<?xml version="1.0" encoding="UTF-8" standalone="no"?>
<svg width="446px" height="354px" viewBox="0 0 446 354" version="1.1" xmlns="http://www.w3.org/2000/svg" xmlns:xlink="http://www.w3.org/1999/xlink">
    <!-- Generator: Sketch 40 (33762) - http://www.bohemiancoding.com/sketch -->
    <title>callback_anim_4</title>
    <desc>Created with Sketch.</desc>
    <defs></defs>
    <g id="Symbols" stroke="none" stroke-width="1" fill="none" fill-rule="evenodd">
        <g id="callback_anim_4">
            <g id="outgoingcall_anim_6">
                <path d="M378.704917,119.486601 C374.791325,53.062121 319.732085,0 253.367941,0 C213.082049,0 174.103779,19.6331692 149.898858,51.6880758 C149.360971,51.4022006 148.776714,51.2269868 148.238827,50.9318899 C146.755,50.2494782 145.2619,49.5670665 143.740978,48.958429 C142.878503,48.6264449 142.043851,48.3405697 141.172103,48.0178075 C139.651181,47.5106096 138.167354,47.0495206 136.609336,46.6160969 C135.737588,46.3947742 134.902935,46.1457862 134.003366,45.9613506 C132.371156,45.564814 130.664756,45.2789389 128.930533,45.0668379 C128.207168,44.9192894 127.446707,44.771741 126.676972,44.7071885 C124.219384,44.4489787 121.752522,44.2737649 119.220743,44.2737649 C82.41257,44.2737649 52.4578208,74.0601136 52.4578208,110.661358 C52.4578208,111.601979 52.4856426,112.533379 52.5598339,113.474001 C21.6962409,130.183866 0.505342493,165.235851 0.505342493,200.324723 C0.505342493,252.593771 43.2488221,295.096954 95.8133789,295.096954 L134.031187,295.096954 C138.130258,295.096954 141.459594,291.786335 141.459594,287.710308 C141.459594,283.643503 138.130258,280.323663 134.031187,280.323663 L95.8133789,280.323663 C51.43769,280.323663 15.3621562,244.450939 15.3621562,200.324723 C15.3621562,169.662305 35.4309108,137.856386 63.0671809,124.678463 L67.2682649,122.69578 L67.2682649,118.048003 C67.2682649,117.144269 67.3424563,116.212869 67.3795519,115.272248 L67.4537433,113.971977 L67.3795519,112.607153 C67.3424563,111.961629 67.2682649,111.306882 67.2682649,110.661358 C67.2682649,82.2029452 90.5643423,59.0009472 119.220743,59.0009472 C121.502127,59.0009472 123.78351,59.2222699 126.027798,59.5081451 C126.612054,59.5819193 127.149942,59.6925807 127.734198,59.7571332 C129.72809,60.1260043 131.684887,60.5225409 133.604587,61.0942912 C133.854983,61.1680655 134.105379,61.2049526 134.365048,61.2787268 C136.498049,61.9242514 138.566132,62.7542116 140.587846,63.6487242 C141.097911,63.8700469 141.607977,64.119035 142.118042,64.3680231 C143.88936,65.2717575 145.660678,66.2492661 147.367079,67.3282144 C161.639636,76.5499942 171.126852,92.5036732 171.126852,110.661358 C171.126852,114.728163 174.465462,118.048003 178.555259,118.048003 C182.65433,118.048003 185.983666,114.728163 185.983666,110.661358 C185.983666,90.3457768 176.746845,72.1512052 162.251714,59.9784559 C183.516804,32.3131164 218.553659,14.7732913 253.367941,14.7732913 C310.819851,14.7732913 358.561972,60.015343 363.532791,117.218043 C355.956001,116.673958 344.58618,116.388083 333.24418,118.121778 C329.182205,118.730415 326.40003,122.511345 327.012109,126.550484 C327.596365,130.183866 330.740223,132.812073 334.366324,132.812073 C334.728007,132.812073 335.08969,132.775186 335.488468,132.710633 C351.968217,130.220753 369.180606,132.563085 370.228558,132.710633 C404.792444,139.230432 430.796505,170.851914 430.796505,206.37421 C430.796505,247.152921 397.438228,280.323663 356.428971,280.323663 L326.937917,280.323663 C322.84812,280.323663 319.509511,283.643503 319.509511,287.710308 C319.509511,291.786335 322.84812,295.096954 326.937917,295.096954 L356.428971,295.096954 C405.627096,295.096954 445.653318,255.295752 445.653318,206.37421 C445.653318,165.881375 417.256587,129.538341 378.704917,119.486601 L378.704917,119.486601 Z" id="Fill-1" fill="#959595"></path>
                <path d="M283.859937,279.065619 L267.934316,279.065619 C262.438949,279.065619 257.984949,283.475693 257.984949,288.911365 C257.984949,294.35032 262.438949,298.757112 267.934316,298.757112 L283.859937,298.757112 C289.355304,298.757112 293.809304,294.35032 293.809304,288.911365 C293.809304,283.475693 289.355304,279.065619 283.859937,279.065619 L283.859937,279.065619 Z" id="Combined-Shape" fill="#E77D39"></path>
                <path d="M198.823525,288.911365 C198.823525,283.475693 194.370354,279.065619 188.874158,279.065619 L172.949367,279.065619 C167.453171,279.065619 163,283.475693 163,288.911365 C163,294.35032 167.453171,298.757112 172.949367,298.757112 L188.874158,298.757112 C194.370354,298.757112 198.823525,294.35032 198.823525,288.911365 L198.823525,288.911365 Z" id="Combined-Shape" fill-opacity="0.4" fill="#E77D39"></path>
                <path d="M228.182449,318.18277 C222.68957,318.18277 218.233082,322.592843 218.233082,328.028516 L218.233082,343.790736 C218.233082,349.226408 222.68957,353.636482 228.182449,353.636482 C233.678646,353.636482 238.131816,349.226408 238.131816,343.790736 L238.131816,328.028516 C238.131816,322.592843 233.678646,318.18277 228.182449,318.18277 L228.182449,318.18277 Z" id="Combined-Shape" fill="#E77D39"></path>
                <path d="M228.182449,224.189531 C222.68957,224.189531 218.233082,228.599605 218.233082,234.035277 L218.233082,249.794215 C218.233082,255.233169 222.68957,259.639961 228.185766,259.639961 C233.678646,259.639961 238.131816,255.233169 238.131816,249.794215 L238.131816,234.035277 C238.131816,228.596323 233.678646,224.189531 228.182449,224.189531 L228.182449,224.189531 Z" id="Combined-Shape" fill-opacity="0.4" fill="#E77D39"></path>
                <path d="M263.390772,309.609586 C259.504715,305.766463 253.205108,305.766463 249.318222,309.609586 C245.435481,313.45517 245.435481,319.689169 249.318222,323.534753 L260.582563,334.678497 C262.52269,336.6017 265.071386,337.563301 267.617595,337.563301 C270.162975,337.563301 272.708354,336.6017 274.651797,334.678497 C278.538684,330.832913 278.538684,324.598914 274.651797,320.756612 L263.390772,309.609586 Z" id="Combined-Shape" fill="#E77D39"></path>
                <path d="M196.225911,243.147515 C192.343171,239.30111 186.043563,239.30111 182.156677,243.147515 C178.27062,246.989818 178.273937,253.227098 182.156677,257.069401 L193.418532,268.213145 C195.361146,270.136347 197.907354,271.097949 200.452734,271.097949 C203.00143,271.097949 205.54681,270.136347 207.490253,268.213145 C211.373823,264.370842 211.373823,258.136844 207.490253,254.291259 L196.225911,243.147515 Z" id="Combined-Shape" fill-opacity="0.4" fill="#E77D39"></path>
                <path d="M193.418532,309.609586 L182.15419,320.756612 C178.27062,324.598914 178.27062,330.836195 182.156677,334.678497 C184.10012,336.6017 186.646329,337.563301 189.191709,337.563301 C191.737089,337.563301 194.282468,336.6017 196.225911,334.678497 L207.486937,323.534753 C211.373823,319.689169 211.373823,313.45517 207.486937,309.609586 C203.60088,305.763181 197.301272,305.766463 193.418532,309.609586 L193.418532,309.609586 Z" id="Combined-Shape" fill-opacity="0.4" fill="#E77D39"></path>
                <path d="M256.353253,271.097949 C258.901949,271.097949 261.447329,270.136347 263.387456,268.213145 L274.651797,257.069401 C278.535367,253.223816 278.535367,246.989818 274.651797,243.144233 C270.765741,239.297829 264.466133,239.297829 260.579247,243.144233 L249.318222,254.291259 C245.432165,258.133562 245.435481,264.370842 249.318222,268.213145 C251.261665,270.136347 253.807044,271.097949 256.353253,271.097949 L256.353253,271.097949 Z" id="Combined-Shape" fill="#E77D39"></path>
            </g>
        </g>
    </g>
</svg>