<?xml version="1.0" encoding="UTF-8" standalone="no"?>
<svg width="121px" height="121px" viewBox="0 0 121 121" version="1.1" xmlns="http://www.w3.org/2000/svg" xmlns:xlink="http://www.w3.org/1999/xlink">
    <!-- Generator: Sketch 40 (33762) - http://www.bohemiancoding.com/sketch -->
    <title>outgoing_call</title>
    <desc>Created with Sketch.</desc>
    <defs></defs>
    <g id="Symbols" stroke="none" stroke-width="1" fill="none" fill-rule="evenodd">
        <g id="outgoing_call">
            <g id="Group-16-Copy" transform="translate(60.500000, 60.500000) rotate(-45.000000) translate(-60.500000, -60.500000) translate(11.000000, 25.000000)">
                <g id="Group-9" transform="translate(72.275172, 34.907407) rotate(-180.000000) translate(-72.275172, -34.907407) translate(45.775172, 16.407407)" fill="#545454">
                    <path d="M48.0362451,22.8095342 C50.3552642,22.8145621 52.23929,20.9448713 52.2443345,18.6334628 C52.249379,16.3220543 50.3735319,14.4442116 48.0545127,14.4391837 L6.04618803,14.3481046 C3.72716889,14.3430767 1.8431431,16.2127676 1.83809863,18.5241761 C1.83305417,20.8355845 3.70890127,22.7134273 6.0279204,22.7184552 L48.0362451,22.8095342 Z" id="Stroke-2"></path>
                    <path d="M9.00631373,15.5740491 L9.00631373,21.4927948 L23.2496919,7.29616108 C24.8894899,5.6617446 24.8894899,3.01183191 23.2496919,1.37741543 C21.6098939,-0.257001048 18.9512559,-0.257001048 17.3114579,1.37741543 L3.06807974,15.5740491 L0.0989627515,18.5334219 L3.06807974,21.4927948 L17.373998,35.7517633 C19.013796,37.3861798 21.6724339,37.3861798 23.312232,35.7517633 C24.95203,34.1173468 24.95203,31.4674341 23.312232,29.8330176 L9.00631373,15.5740491 Z" id="Stroke-4"></path>
                </g>
                <path d="M10.367048,22.3689382 C10.367048,20.2202833 10.9645511,18.048306 12.1595752,15.8529412 C13.4717584,13.4940917 14.7136276,12.0694615 15.8852198,11.5790076 C16.4710159,11.3221032 17.2735445,11.07688 18.2928298,10.8433305 C19.312115,10.6097811 20.1380751,10.4930081 20.7707349,10.4930081 C21.0987807,10.4930081 21.3448114,10.52804 21.5088343,10.5981049 C21.9306075,10.7382345 22.5515421,11.6257091 23.3716566,13.2605553 C23.6294069,13.7042992 23.9808793,14.3348733 24.4260844,15.1522963 C24.8712894,15.9697194 25.2813405,16.7112278 25.65625,17.3768437 C26.0311595,18.0424596 26.3943477,18.667195 26.7458254,19.2510686 C26.8161209,19.3444884 27.0211464,19.6364209 27.3609082,20.1268747 C27.7006699,20.6173285 27.9525585,21.0318726 28.1165814,21.3705193 C28.2806043,21.709166 28.3626145,22.041969 28.3626145,22.3689382 C28.3626145,22.8360371 28.0287158,23.4199019 27.3609082,24.1205503 C26.6931006,24.8211986 25.9667243,25.46345 25.1817576,26.0473236 C24.3967908,26.6311972 23.6704145,27.250094 23.0026069,27.9040324 C22.3347994,28.5579709 22.0009006,29.0951266 22.0009006,29.5155156 C22.0009006,29.7257101 22.0594793,29.9884493 22.1766385,30.303741 C22.2937978,30.6190328 22.3933816,30.8584174 22.4753931,31.021902 C22.5574045,31.1853866 22.721425,31.4656417 22.9674593,31.8626758 C23.2134937,32.2597098 23.3482248,32.4815785 23.3716566,32.5282884 C25.1524768,35.7279158 27.1910167,38.4720807 29.4873374,40.7608653 C31.7836582,43.0496499 34.5368586,45.0814996 37.7470213,46.8564754 C37.793885,46.8798303 38.0164841,47.0141193 38.4148255,47.2593462 C38.8131669,47.5045731 39.0943448,47.6680553 39.2583677,47.7497976 C39.4223906,47.8315399 39.6625634,47.9307969 39.9788933,48.0475716 C40.2952232,48.1643463 40.5588275,48.2227328 40.7697141,48.2227328 C41.1914873,48.2227328 41.7304116,47.8899299 42.3865033,47.2243139 C43.0425949,46.558698 43.6635295,45.8347056 44.2493256,45.0523149 C44.8351217,44.2699243 45.4794877,43.5459318 46.1824431,42.8803159 C46.8853984,42.2147 47.4711857,41.881897 47.9398226,41.881897 C48.2678684,41.881897 48.6017672,41.9636381 48.941529,42.1271227 C49.2812907,42.2906073 49.6971997,42.5416692 50.1892684,42.8803159 C50.6813372,43.2189626 50.9742308,43.4233153 51.0679582,43.4933802 C51.6537543,43.8437043 52.2805467,44.2057005 52.9483543,44.5793797 C53.6161619,44.9530588 54.3601118,45.3617642 55.1802263,45.8055081 C56.0003409,46.2492521 56.6329912,46.599571 57.0781962,46.8564754 C58.7184253,47.6738985 59.6088221,48.2927952 59.7494131,48.7131842 C59.8197087,48.8766688 59.8548559,49.1218921 59.8548559,49.4488613 C59.8548559,50.0794448 59.7376984,50.9026943 59.50338,51.9186344 C59.2690616,52.9345745 59.0230309,53.7344693 58.7652806,54.3183429 C58.2732119,55.4860902 56.8438908,56.7238837 54.4772745,58.0317606 C52.2746811,59.2228628 50.0955523,59.818405 47.9398226,59.818405 C47.3071628,59.818405 46.6920861,59.7775344 46.0945741,59.6957921 C45.4970621,59.6140498 44.8234066,59.4680836 44.0735876,59.2578891 C43.3237686,59.0476946 42.7672707,58.8783738 42.4040771,58.7499216 C42.0408835,58.6214694 41.3906595,58.3820848 40.4533858,58.0317606 C39.516112,57.6814364 38.9420404,57.4712451 38.7311538,57.4011803 C36.4348331,56.5837572 34.3845774,55.6145415 32.5803254,54.4935042 C29.5810493,52.6484635 26.4822344,50.132006 23.2837877,46.944056 C20.0853409,43.756106 17.5605975,40.6674609 15.7094818,37.678028 C14.5847533,35.8796972 13.6123463,33.8361702 12.7922318,31.5473856 C12.7219363,31.3371911 12.5110528,30.7650035 12.1595752,29.8308057 C11.8080975,28.896608 11.5679247,28.248518 11.4390495,27.8865163 C11.3101744,27.5245147 11.1402961,26.969843 10.9294095,26.2224848 C10.7185229,25.4751266 10.572076,24.803682 10.4900646,24.2081309 C10.4080531,23.6125798 10.367048,22.9995217 10.367048,22.3689382 L10.367048,22.3689382 Z" id="" fill="#C1C1C1" transform="translate(35.110952, 35.155707) rotate(-315.000000) translate(-35.110952, -35.155707) "></path>
            </g>
        </g>
    </g>
</svg>