<?xml version="1.0" encoding="UTF-8" standalone="no"?>
<svg width="220px" height="220px" viewBox="0 0 220 220" version="1.1" xmlns="http://www.w3.org/2000/svg" xmlns:xlink="http://www.w3.org/1999/xlink">
    <!-- Generator: Sketch 40 (33762) - http://www.bohemiancoding.com/sketch -->
    <title>state_liste_renvoi_selected</title>
    <desc>Created with Sketch.</desc>
    <defs>
        <path d="M97.5586854,195 C151.374037,195 195,151.347763 195,97.5 C195,43.6522369 151.374037,0 97.5586854,0 C43.7433334,0 0.117370892,43.6522369 0.117370892,97.5 C0.117370892,151.347763 43.7433334,195 97.5586854,195 Z" id="path-1"></path>
        <filter x="-50%" y="-50%" width="200%" height="200%" filterUnits="objectBoundingBox" id="filter-2">
            <feOffset dx="0" dy="2" in="SourceAlpha" result="shadowOffsetOuter1"></feOffset>
            <feGaussianBlur stdDeviation="2" in="shadowOffsetOuter1" result="shadowBlurOuter1"></feGaussianBlur>
            <feColorMatrix values="0 0 0 0 0   0 0 0 0 0   0 0 0 0 0  0 0 0 0.5 0" type="matrix" in="shadowBlurOuter1"></feColorMatrix>
        </filter>
    </defs>
    <g id="Symbols" stroke="none" stroke-width="1" fill="none" fill-rule="evenodd">
        <g id="state_liste_renvoi_selected">
            <g transform="translate(13.000000, 13.000000)">
                <g>
                    <g id="Oval">
                        <use fill="black" fill-opacity="1" filter="url(#filter-2)" xlink:href="#path-1"></use>
                        <use fill="#D9D9D9" fill-rule="evenodd" xlink:href="#path-1"></use>
                    </g>
                    <path d="M58.8227719,149.074322 C58.4217524,148.07117 58.5220057,147.193424 59.123535,146.44106 L71.1540597,131.995736 C71.6052067,131.444002 72.2317902,131.168139 73.0338292,131.168139 L97.0948788,131.168139 L97.0948788,83.0170576 L82.6582491,83.0170576 C80.6531516,83.0170576 79.1994777,82.0891554 78.2971838,80.2333232 C77.4450174,78.377491 77.6705875,76.6721572 78.9739008,75.1172708 L103.03495,46.226622 C103.937244,45.1231542 105.165348,44.5714286 106.719299,44.5714286 C108.273249,44.5714286 109.501353,45.1231542 110.403647,46.226622 L134.464696,75.1172708 C135.818137,76.7223149 136.043707,78.4276486 135.141413,80.2333232 C134.23912,82.0891554 132.785446,83.0170576 130.780348,83.0170576 L116.343718,83.0170576 L116.343718,148.021017 C116.343718,148.723224 116.118148,149.300028 115.667001,149.751447 C115.215854,150.202865 114.639398,150.428571 113.937613,150.428571 L61.0033045,150.428571 C59.9506283,150.428571 59.2237913,149.97716 58.8227719,149.074322 L58.8227719,149.074322 Z" id="" fill="#595959"></path>
                </g>
            </g>
        </g>
    </g>
</svg>