{
  "__inputs": [
    {
      "name": "DS_INFLUXDB",
      "label": "InfluxDB",
      "description": "",
      "type": "datasource",
      "pluginId": "influxdb",
      "pluginName": "InfluxDB"
    },
    {
      "name": "VAR_XIVO",
      "type": "constant",
      "label": "xivo",
      "value": "",
      "description": ""
    },
    {
      "name": "VAR_USM",
      "type": "constant",
      "label": "usm",
      "value": "",
      "description": ""
    },
    {
      "name": "VAR_CONTRACT_START",
      "type": "constant",
      "label": "Start of contract",
      "value": "",
      "description": ""
    },
    {
      "name": "VAR_CONTRACT_END",
      "type": "constant",
      "label": "End of contract",
      "value": "",
      "description": ""
    }
  ],
  "__elements": {},
  "__requires": [
    {
      "type": "panel",
      "id": "gauge",
      "name": "Gauge",
      "version": ""
    },
    {
      "type": "grafana",
      "id": "grafana",
      "name": "Grafana",
      "version": "9.3.2"
    },
    {
      "type": "datasource",
      "id": "influxdb",
      "name": "InfluxDB",
      "version": "1.0.0"
    },
    {
      "type": "panel",
      "id": "text",
      "name": "Text",
      "version": ""
    },
    {
      "type": "panel",
      "id": "timeseries",
      "name": "Time series",
      "version": ""
    }
  ],
  "annotations": {
    "list": [
      {
        "builtIn": 1,
        "datasource": {
          "type": "grafana",
          "uid": "-- Grafana --"
        },
        "enable": true,
        "hide": true,
        "iconColor": "rgba(0, 211, 255, 1)",
        "name": "Annotations & Alerts",
        "target": {
          "limit": 100,
          "matchAny": false,
          "tags": [],
          "type": "dashboard"
        },
        "type": "dashboard"
      }
    ]
  },
  "editable": true,
  "fiscalYearStartMonth": 0,
  "graphTooltip": 0,
  "id": 3,
  "links": [],
  "liveNow": true,
  "panels": [
    {
      "datasource": {
        "type": "influxdb",
        "uid": "${DS_INFLUXDB}"
      },
      "description": "",
      "gridPos": {
        "h": 10,
        "w": 8,
        "x": 0,
        "y": 0
      },
      "id": 6,
      "options": {
        "code": {
          "language": "plaintext",
          "showLineNumbers": false,
          "showMiniMap": false
        },
        "content": "# Client A \n\n## Infos extrait de SalesForce ou autres\n\n|Commercial      | Dupont     |\n|----------------|------------|\n|Contact client  | Dupont     |\n\n## USM\n\n|USM                | ${VAR_USM}          |\n|-------------------|---------------|\n|Début de contrat   | ${VAR_CONTRACT_START}   |\n|Fin de contrat     | ${VAR_CONTRACT_END}    |\n|XiVO-UUID          | ${VAR_XIVO}|\n\n## autres\n- ce qu'on va definir\n- ",
        "mode": "markdown"
      },
      "pluginVersion": "9.4.7",
      "title": "Informations",
      "type": "text"
    },
    {
      "datasource": {
        "type": "influxdb",
        "uid": "${DS_INFLUXDB}"
      },
      "fieldConfig": {
        "defaults": {
          "color": {
            "mode": "palette-classic"
          },
          "custom": {
            "axisCenteredZero": false,
            "axisColorMode": "text",
            "axisLabel": "",
            "axisPlacement": "auto",
            "barAlignment": 0,
            "drawStyle": "line",
            "fillOpacity": 0,
            "gradientMode": "none",
            "hideFrom": {
              "legend": false,
              "tooltip": false,
              "viz": false
            },
            "lineInterpolation": "linear",
            "lineWidth": 1,
            "pointSize": 5,
            "scaleDistribution": {
              "log": 2,
              "type": "log"
            },
            "showPoints": "auto",
            "spanNulls": false,
            "stacking": {
              "group": "A",
              "mode": "none"
            },
            "thresholdsStyle": {
              "mode": "off"
            }
          },
          "mappings": [],
          "min": 0,
          "thresholds": {
            "mode": "absolute",
            "steps": [
              {
                "color": "green",
                "value": null
              },
              {
                "color": "red",
                "value": "${VAR_USM}"
              }
            ]
          }
        },
        "overrides": []
      },
      "gridPos": {
        "h": 9,
        "w": 16,
        "x": 8,
        "y": 0
      },
      "id": 4,
      "options": {
        "legend": {
          "calcs": [],
          "displayMode": "list",
          "placement": "bottom",
          "showLegend": true
        },
        "tooltip": {
          "mode": "single",
          "sort": "none"
        }
      },
      "pluginVersion": "9.3.2",
      "targets": [
        {
          "datasource": {
            "type": "influxdb",
            "uid": "${DS_INFLUXDB}"
          },
          "query": "from(bucket: \"usm\")\n  |> range(start: v.timeRangeStart, stop: v.timeRangeStop)\n  |> filter(fn: (r) => r[\"_measurement\"] == \"collect_daily\")\n  |> filter(fn: (r) => r[\"_field\"] == \"sw_type_web_browser_logins\" or r[\"_field\"] == \"nb_users\")\n  |> filter(fn: (r) => r[\"xivo_uuid\"] == \"${xivo}\")\n  |> aggregateWindow(every: v.windowPeriod, fn: last, createEmpty: false)\n  |> yield(name: \"last\")\n\nfrom(bucket: \"usm\")\n  |> range(start: v.timeRangeStart, stop: v.timeRangeStop)\n  |> filter(fn: (r) => r[\"_measurement\"] == \"collect_daily\")\n  |> filter(fn: (r) => r[\"_field\"] == \"setpoint\")\n  |> filter(fn: (r) => r[\"xivo_uuid\"] == \"bb13fd18-1339-40e9-9d12-5239731e4ac6\")\n  |> map(fn: (r) => ({ r with _value: ${usm}} ))\n  |> aggregateWindow(every: v.windowPeriod, fn: last, createEmpty: false)\n  |> yield(name: \"usm\")",
          "refId": "A"
        }
      ],
      "title": "USM  - Etat actuels par jour",
      "transformations": [
        {
          "id": "renameByRegex",
          "options": {
            "regex": "(.*sw_type_web_browser_logins.*)",
            "renamePattern": "Total users logins"
          }
        },
        {
          "id": "renameByRegex",
          "options": {
            "regex": "(.*nb_users_current.*)",
            "renamePattern": "Nb user current"
          }
        },
        {
          "id": "renameByRegex",
          "options": {
            "regex": "(.*setpoint.*)",
            "renamePattern": "USM achetes"
          }
        }
      ],
      "transparent": true,
      "type": "timeseries"
    },
    {
      "datasource": {
        "type": "influxdb",
        "uid": "${DS_INFLUXDB}"
      },
      "fieldConfig": {
        "defaults": {
          "color": {
            "mode": "palette-classic"
          },
          "custom": {
            "axisCenteredZero": false,
            "axisColorMode": "text",
            "axisLabel": "",
            "axisPlacement": "auto",
            "barAlignment": 0,
            "drawStyle": "line",
            "fillOpacity": 0,
            "gradientMode": "none",
            "hideFrom": {
              "legend": false,
              "tooltip": false,
              "viz": false
            },
            "lineInterpolation": "linear",
            "lineWidth": 1,
            "pointSize": 5,
            "scaleDistribution": {
              "type": "linear"
            },
            "showPoints": "auto",
            "spanNulls": false,
            "stacking": {
              "group": "A",
              "mode": "none"
            },
            "thresholdsStyle": {
              "mode": "off"
            }
          },
          "mappings": [],
          "min": 0,
          "thresholds": {
            "mode": "absolute",
            "steps": [
              {
                "color": "green",
                "value": null
              },
              {
                "color": "red",
                "value": "${VAR_USM}"
              }
            ]
          }
        },
        "overrides": []
      },
      "gridPos": {
        "h": 8,
        "w": 16,
        "x": 8,
        "y": 9
      },
      "id": 8,
      "options": {
        "legend": {
          "calcs": [],
          "displayMode": "list",
          "placement": "bottom",
          "showLegend": true
        },
        "tooltip": {
          "mode": "single",
          "sort": "none"
        }
      },
      "pluginVersion": "9.3.2",
      "targets": [
        {
          "datasource": {
            "type": "influxdb",
            "uid": "${DS_INFLUXDB}"
          },
          "query": "from(bucket: \"usm\")\n  |> range(start: v.timeRangeStart, stop: v.timeRangeStop)\n  |> filter(fn: (r) => r[\"_measurement\"] == \"collect_daily\")\n  |> filter(fn: (r) => r[\"_field\"] == \"sw_type_web_browser_logins\" or r[\"_field\"] == \"sw_type_unknown_logins\" or r[\"_field\"] == \"sw_type_mobile_logins\" or r[\"_field\"] == \"sw_type_electron_logins\")\n  |> filter(fn: (r) => r[\"xivo_uuid\"] == \"${xivo}\")\n  |> aggregateWindow(every: v.windowPeriod, fn: last, createEmpty: false)\n  |> yield(name: \"last\")",
          "refId": "A"
        }
      ],
      "title": "Login par type de logiciel par jour",
      "transformations": [
        {
          "id": "renameByRegex",
          "options": {
            "regex": "(.*sw_type_web_browser_logins.*)",
            "renamePattern": "Navigateur web"
          }
        },
        {
          "id": "renameByRegex",
          "options": {
            "regex": "(.*sw_type_mobile_logins.*)",
            "renamePattern": "Application mobile"
          }
        },
        {
          "id": "renameByRegex",
          "options": {
            "regex": "(.*sw_type_unknown_logins.*)",
            "renamePattern": "Intégration API ou autre"
          }
        },
        {
          "id": "renameByRegex",
          "options": {
            "regex": "(.*sw_type_electron_logins.*)",
            "renamePattern": "Application desktop"
          }
        }
      ],
      "transparent": true,
      "type": "timeseries"
    },
    {
      "datasource": {
        "type": "influxdb",
        "uid": "${DS_INFLUXDB}"
      },
      "fieldConfig": {
        "defaults": {
          "color": {
            "mode": "thresholds"
          },
          "mappings": [],
          "min": 0,
          "max": "${VAR_USM}",
          "thresholds": {
            "mode": "absolute",
            "steps": [
              {
                "color": "green",
                "value": null
              },
              {
                "color": "red",
                "value": "${VAR_USM}"
              }
            ]
          }
        },
        "overrides": []
      },
      "gridPos": {
        "h": 14,
        "w": 8,
        "x": 0,
        "y": 10
      },
      "id": 3,
      "options": {
        "orientation": "auto",
        "reduceOptions": {
          "calcs": [
            "max"
          ],
          "fields": "",
          "values": false
        },
        "showThresholdLabels": true,
        "showThresholdMarkers": true
      },
      "pluginVersion": "9.4.7",
      "targets": [
        {
          "datasource": {
            "type": "influxdb",
            "uid": "${DS_INFLUXDB}"
          },
          "query": "from(bucket: \"usm\")\n  |> range(start: v.timeRangeStart, stop: v.timeRangeStop)\n  |> filter(fn: (r) => r[\"_measurement\"] == \"collect_monthly\")\n  |> filter(fn: (r) => r[\"_field\"] == \"nb_users\")\n  |> filter(fn: (r) => r[\"xivo_uuid\"] == \"${xivo}\")\n  |> aggregateWindow(every: v.windowPeriod, fn: last, createEmpty: false)\n  |> yield(name: \"last\")",
          "refId": "A"
        }
      ],
      "title": "USM  - Nb max utilisateur sur la période",
      "transformations": [
        {
          "id": "renameByRegex",
          "options": {
            "regex": "(.*total_users_logins.*)",
            "renamePattern": "Total users logins"
          }
        },
        {
          "id": "renameByRegex",
          "options": {
            "regex": "(.*nb_users_current.*)",
            "renamePattern": "Nb user current"
          }
        },
        {
          "id": "renameByRegex",
          "options": {
            "regex": "(.*setpoint.*)",
            "renamePattern": "USM achetes"
          }
        }
      ],
      "transparent": true,
      "type": "gauge"
    },
    {
      "datasource": {
        "type": "influxdb",
        "uid": "${DS_INFLUXDB}"
      },
      "description": "Nb max d'utilisateurs sur la période sélectionné",
      "fieldConfig": {
        "defaults": {
          "color": {
            "mode": "palette-classic"
          },
          "custom": {
            "axisCenteredZero": false,
            "axisColorMode": "text",
            "axisLabel": "",
            "axisPlacement": "auto",
            "barAlignment": 0,
            "drawStyle": "line",
            "fillOpacity": 0,
            "gradientMode": "none",
            "hideFrom": {
              "legend": false,
              "tooltip": false,
              "viz": false
            },
            "lineInterpolation": "linear",
            "lineWidth": 1,
            "pointSize": 5,
            "scaleDistribution": {
              "type": "linear"
            },
            "showPoints": "auto",
            "spanNulls": false,
            "stacking": {
              "group": "A",
              "mode": "none"
            },
            "thresholdsStyle": {
              "mode": "off"
            }
          },
          "mappings": [],
          "min": 0,
          "thresholds": {
            "mode": "absolute",
            "steps": [
              {
                "color": "green",
                "value": null
              },
              {
                "color": "red",
                "value": "${VAR_USM}"
              }
            ]
          },
          "unit": "Users"
        },
        "overrides": []
      },
      "gridPos": {
        "h": 7,
        "w": 16,
        "x": 8,
        "y": 17
      },
      "id": 7,
      "options": {
        "legend": {
          "calcs": [],
          "displayMode": "list",
          "placement": "bottom",
          "showLegend": true
        },
        "tooltip": {
          "mode": "single",
          "sort": "none"
        }
      },
      "pluginVersion": "9.3.2",
      "targets": [
        {
          "datasource": {
            "type": "influxdb",
            "uid": "${DS_INFLUXDB}"
          },
          "query": "from(bucket: \"usm\")\n  |> range(start: v.timeRangeStart, stop: v.timeRangeStop)\n  |> filter(fn: (r) => r[\"_measurement\"] == \"collect_daily\")\n  |> filter(fn: (r) => r[\"_field\"] == \"ln_type_phone_logins\" or r[\"_field\"] == \"ln_type_ua_logins\" or r[\"_field\"] == \"ln_type_webrtc_logins\")\n  |> filter(fn: (r) => r[\"xivo_uuid\"] == \"${xivo}\")\n  |> aggregateWindow(every: v.windowPeriod, fn: last, createEmpty: false)\n  |> yield(name: \"last\")",
          "refId": "A"
        }
      ],
      "title": "Login par type de ligne par jour",
      "transformations": [
        {
          "id": "renameByRegex",
          "options": {
            "regex": "(.*ln_type_phone_logins.*)",
            "renamePattern": "Téléphone"
          }
        },
        {
          "id": "renameByRegex",
          "options": {
            "regex": "(.*ln_type_ua_logins.*)",
            "renamePattern": "Compte unique"
          }
        },
        {
          "id": "renameByRegex",
          "options": {
            "regex": "(.*ln_type_webrtc_logins.*)",
            "renamePattern": "WebRTC"
          }
        }
      ],
      "transparent": true,
      "type": "timeseries"
    }
  ],
  "refresh": "",
  "revision": 1,
  "schemaVersion": 38,
  "style": "dark",
  "tags": [],
  "templating": {
    "list": [
      {
        "description": "",
        "hide": 2,
        "name": "xivo",
        "query": "${VAR_XIVO}",
        "skipUrlSync": false,
        "type": "constant",
        "current": {
          "value": "${VAR_XIVO}",
          "text": "${VAR_XIVO}",
          "selected": false
        }
      },
      {
        "description": "usm - nb d'utilisateurs achetes",
        "hide": 2,
        "name": "usm",
        "query": "${VAR_USM}",
        "skipUrlSync": false,
        "type": "constant",
        "current": {
          "value": "${VAR_USM}",
          "text": "${VAR_USM}",
          "selected": false
        }
      }
    ]
  },
  "time": {
    "from": "now-1M/M",
    "to": "now-1M/M"
  },
  "timepicker": {},
  "timezone": "",
  "title": "",
  "uid": "",
  "version": 3,
  "weekStart": ""
}
