{
  "index_patterns": ["queuelog*"],
  "settings": {
    "number_of_shards": 1,
    "number_of_replicas": 0,
    "index.lifecycle.name": "xivo_policy",
    "index.lifecycle.rollover_alias": "queuelog"
  }
}