<?xml version="1.0" encoding="utf-8"?>
<svg viewBox="7.444 8.089 406.036 406.053" xmlns="http://www.w3.org/2000/svg">
  <path class="st1" d="M 345.803 278.77 C 330.384 278.77 316.22 283.979 304.855 292.658 L 278.137 265.946 L 278.137 156.027 L 304.716 129.452 C 316.114 138.195 330.337 143.449 345.803 143.449 C 383.169 143.449 413.48 113.151 413.48 75.766 C 413.48 38.385 383.186 8.089 345.803 8.089 C 308.434 8.089 278.125 38.385 278.125 75.766 C 278.125 91.249 283.377 105.457 292.12 116.854 L 265.666 143.325 L 155.503 143.325 L 128.911 116.731 C 137.592 105.35 142.8 91.19 142.8 75.781 C 142.8 38.415 112.505 8.106 75.12 8.106 C 37.738 8.106 7.444 38.4 7.444 75.781 C 7.444 113.166 37.738 143.46 75.12 143.46 C 90.527 143.46 104.702 138.255 116.074 129.572 L 142.784 156.287 L 142.784 266.204 L 116.208 292.782 C 104.809 284.039 90.589 278.787 75.12 278.787 C 37.755 278.787 7.444 309.079 7.444 346.464 C 7.444 383.833 37.738 414.142 75.12 414.142 C 112.505 414.142 142.8 383.848 142.8 346.464 C 142.8 330.982 137.547 316.775 128.804 305.378 L 155.503 278.682 L 265.177 278.682 L 292.013 305.513 C 283.332 316.899 278.125 331.059 278.125 346.464 C 278.125 383.833 308.419 414.142 345.803 414.142 C 383.169 414.142 413.48 383.848 413.48 346.464 C 413.48 309.079 383.186 278.77 345.803 278.77 Z" style="fill: rgb(255, 87, 34);"/>
</svg>