Name,University,Level,Language,ECTS,Title,Weightedpercentage,Color,Size
Wirtschaftsinformatik 2 Business and Information Systems Engineering 2,AUG,Bachelor,Deutsch,5.0,Digitale Transformation,55.02,3,110.04
Digital Business I: Geschäftsmodelle und Prozesse Digital Business I: Business Models and Processes,REG,Bachelor,Deutsch,6.0,Digitale Transformation,53.72,4,107.44
Digitale Finanzwirtschaft Digital Finance,AUG,Bachelor,Deutsch,5.0,Digitale Transformation,53.14,3,106.28
Digitalisierung und Demokratie,TUM,Bachelor,Deutsch,3.0,Digitale Transformation,53.14,1,106.28
Ethische und soziale Herausforderungen neuer Technologien,TUM,Bachelor,Deutsch,3.0,Digitale Transformation,53.14,1,106.28
Corporate Digital Responsibility,TUM,Bachelor,Deutsch,6.0,Digitale Transformation,53.05,1,106.1
Einführung in die Wirtschaftsinformatik,TUM,Bachelor,Deutsch,5.0,Digitale Transformation,53.05,1,106.1
Medienwirtschaft I,LMU,Bachelor,Deutsch,6.0,Digitale Transformation,53.05,2,106.1
Politische Ideen für das Bayerische Digitalgesetz 2.0,TUM,Bachelor,Deutsch,3.0,Digitale Transformation,51.18,1,102.36
Programming for Management Students,JMU,Bachelor,Deutsch,5.0,Digitale Transformation,51.18,5,102.36
Seminar Finance & Accounting: Digital Finance,TUM,Bachelor,Deutsch,6.0,Digitale Transformation,51.18,1,102.36
Seminar Innovation and Entrepreneurship: Innovation Management in Family Enterprises,TUM,Bachelor,Englisch,6.0,Digitale Transformation,51.18,1,102.36
Softskill-Kurse - Sozialkompetenz,AUG,Bachelor,Deutsch,2.0,Digitale Transformation,9.09,3,18.18
Bildungssoziologie / Arbeitssoziologie Sociology of Education / Sociology of Work,AUG,Bachelor,Deutsch,9.0,Digitale Transformation,7.27,3,14.54
Gesellschaftstheorien und sozialer Wandel Theories of Society and Social Change,AUG,Bachelor,Deutsch,9.0,Digitale Transformation,7.27,3,14.54
Nachhaltigkeit 2 (Social Entrepreneurship) Social Entrepreneurship,REG,Bachelor,Deutsch,6.0,Digitale Transformation,5.93,4,11.86
Grundlagen der Sozialwissenschaften (Soziologie) für MuK-Studierende Principles of Social Sciences (Sociology) for Students of Media and Communication,AUG,Bachelor,Deutsch,6.0,Digitale Transformation,5.44,3,10.88
Materialien im ressourcenstrategischen Blickwinkel Materials from a Resource-Strategic Perspective,AUG,Bachelor,Deutsch,6.0,Digitale Transformation,5.04,3,10.08
Herausforderungen der Wissenschaftsund Forschungspolitik,TUM,Bachelor,Deutsch,6.0,Digitale Transformation,4.86,1,9.72
Diversität und Inklusion,TUM,Bachelor,Deutsch,7.0,Digitale Transformation,4.73,1,9.46
Politologie / Soziologie,TUM,Bachelor,Deutsch,5.0,Digitale Transformation,4.73,1,9.46
Seminar: Soziologie,TUM,Bachelor,Deutsch,3.0,Digitale Transformation,4.73,1,9.46
Start-ups and unicorns coming up,TUM,Bachelor,Englisch,6.0,Digitale Transformation,4.73,1,9.46
Policy and Innovation,TUM,Bachelor,Englisch,5.0,Digitale Transformation,4.5,1,9.0
Soziologische Perspektiven auf Trendund Freizeitsportarten,TUM,Bachelor,Deutsch,5.0,Digitale Transformation,4.5,1,9.0
Technik und Demokratie,TUM,Bachelor,Englisch,2.0,Digitale Transformation,4.5,1,9.0
Wirtschaftsinformatik,LMU,Bachelor,Deutsch,6.0,Digitale Transformation,4.5,2,9.0
Praxismodul Resource Aware Algorithmics Practice Module Resource Aware Algorithmics,AUG,Bachelor,Deutsch,11.0,Digitale Transformation,4.37,3,8.74
Bildung in religionspädagogischer Perspektive (ev.Theo.): Vertiefung 1,AUG,Bachelor,Deutsch,5.0,Digitale Transformation,4.15,3,8.3
Business Intelligence und Reporting,TUM,Bachelor,Deutsch,6.0,Digitale Transformation,4.15,1,8.3
"Kontexte und Lebenswelten für den Kompetenzerwerb von SchülerInnen nutzen (B.Ed. NB, Gym)",TUM,Bachelor,Deutsch,6.0,Digitale Transformation,4.15,1,8.3
Medienwirtschaft II,LMU,Bachelor,Deutsch,6.0,Digitale Transformation,4.15,2,8.3
Spezielle Soziologische Theorien,LMU,Bachelor,Deutsch,6.0,Digitale Transformation,4.15,2,8.3
Wahlmodul Sozialkunde Bachelor (Auflagenmodul),TUM,Bachelor,Deutsch,3.0,Digitale Transformation,4.1,1,8.2
Angewandte Soziologie,LMU,Bachelor,Deutsch,9.0,Digitale Transformation,4.06,2,8.12
Arbeitsund Industriesoziologie,TUM,Bachelor,Deutsch,3.0,Digitale Transformation,4.06,1,8.12
Einführung in die Soziologie,TUM,Bachelor,Deutsch,5.0,Digitale Transformation,4.06,1,8.12
General basics: sociology of disability/ theories of special education,JMU,Bachelor,Deutsch,5.0,Digitale Transformation,4.06,5,8.12
Grundkurs Soziologie III (Sozialstruktur),TUM,Bachelor,Deutsch,3.0,Digitale Transformation,4.06,1,8.12
Grundlagen der Soziologie für Nebenfachstudierende Principles of Sociology for Undergraduates of Minor,AUG,Bachelor,Deutsch,15.0,Digitale Transformation,4.06,3,8.12
