{
    "type": "object",
    "properties": {
        "id": {
            "type": ["null", "integer"]
        },
        "username": {
            "type": ["null", "string"]
        },
        "name": {
            "type": ["null", "string"]
        },
        "state": {
            "type": ["null", "string"]
        },
        "avatar_url": {
            "type": ["null", "string"]
        },
        "web_url": {
            "type": ["null", "string"]
        }
    }
}
