{
    "transportId": "d88ed0f2-3f1d-4925-bf76-1997c7dbc8dd",
    "args": {
        "entity": "fa_field_config",
        "field_values": {
            "label_for_true": "Yes",
            "label_for_false": "No",
            "entityName": "phone_call",
            "fa_entity_id": "c4242432-96de-4265-86e3-e811fec150d8",
            "layout_id": "3bb89feb-6473-49af-a56c-28a70218f823",
            "name_label": "Contact",
            "data_type": "dbc78366-691c-4af3-8cc1-45b2f3c85988",
            "reference_fa_entity_id": "ac12096d-027b-57f5-b389-93c1920222a3"
        }
    },
    "transports": [
        {
            "id": "dd759d55-dcf1-4a45-a167-b3c11dbf1c98",
            "field": "transport_id",
            "model": "fa_field_config"
        },
        {
            "id": ["84b7d4b1-fb03-4741-8c83-29994c664198"],
            "field": "transport_id",
            "model": "fa_related_list"
          }
    ]
}