{
    "transportId": "af458919-0ef7-4c54-b9f0-9d6f045cc725",
    "args": {
        "id": "79abf4c6-eacb-4882-87c7-3e0db39161e5",
        "label": "Phone Call",
        "label_plural": "Phone Calls",
        "is_visible": true,
        "icon": "fa fa-phone-square-alt",
        "show_related_list": null,
        "roles": [],
        "enforce_individual_access": true,
        "info_segment_wide": "1 column",
        "form_segment_wide": "1 column",
        "landscape_mode": null,
        "template_file_url": null,
        "applet_config": {
            "width": 350,
            "height": 600,
            "url": "https://playing-voice.000webhostapp.com/",
            "params": "{\n\n   \"field_from\": \"phone_call_field0\",\n\n   \"field_to\": \"phone_call_field1\",\n\n   \"field_contact\": \"phone_call_field2\",\n\n   \"field_duration\": \"phone_call_field3\",\n\n   \"field_direction\": \"phone_call_field4\",\n\n   \"field_status\": \"phone_call_field5\",\n\n   \"field_note\": \"phone_call_field6\",\n\n   \"field_sid\": \"phone_call_field7\",\n\n   \"field_callAppType\": \"phone_call_field8\",\n\n   \"field_callRecordingUrl\": \"phone_call_field9\",\n\n   \"phone_applet_name\": \"phone_call\",\n\n   \"contact_app_name\": \"contact\",\n\n   \"phone_applet_id\": \"aHR0cHM6Ly9wbGF5aW5nLXZvaWNlLjAwMHdlYmhvc3RhcHAuY29tLw==\"\n\n }",
            "applet_id": "aHR0cHM6Ly9wbGF5aW5nLXZvaWNlLjAwMHdlYmhvc3RhcHAuY29tLw=="
        },
        "card_layout": {
            "card_body": [
                "description",
                "owner_id"
            ],
            "card_footer": {
                "team_member": "owner_id"
            },
            "card_header": {
                "title": "seq_id"
            }
        },
        "title_field_name": "seq_id",
        "show_app_icon": false,
        "show_seq_id": true,
        "primary_action": null,
        "default_sorts": [],
        "enable_quick_add": false,
        "quick_add_custom_code": "(function(input, record, parent, context){\n  // Use 'CTRL + space' to display a list\n  // of hints\n  //\n  // Return the values for your record\n  // Example:\n  // return c;\n  return {\n    description: 'Hello World',\n  };\n}(input, record, parent, context));",
        "quick_add_hint": null,
        "description": "Twilio Phone Call Applet",
        "color": "#ff0000",
        "fa_entity_id": "c4242432-96de-4265-86e3-e811fec150d8"
    },
    "transports": [
        {
            "id": "67453676-f0eb-468a-b673-2a4ce8afb639",
            "field": "id",
            "model": "fa_entity_config"
        },
        {
            "id": "8e4c4fbf-525c-4005-ba23-22ae546c0345",
            "field": "title_field_name",
            "model": "fa_field_config",
            "attribute": "field_name"
        },
        {
            "id": "80e72f6a-f5fd-4c15-a17b-9768d634c27a",
            "field": "card_layout.card_body[0]",
            "model": "fa_field_config",
            "attribute": "field_name"
        },
        {
            "id": "46285edd-5bd7-4c86-a451-a4bfc4fd51de",
            "field": "card_layout.card_body[1]",
            "model": "fa_field_config",
            "attribute": "field_name"
        },
        {
            "id": "46285edd-5bd7-4c86-a451-a4bfc4fd51de",
            "field": "card_layout.card_footer.team_member",
            "model": "fa_field_config",
            "attribute": "field_name"
        },
        {
            "id": "8e4c4fbf-525c-4005-ba23-22ae546c0345",
            "field": "card_layout.card_header.title",
            "model": "fa_field_config",
            "attribute": "field_name"
        }
    ]
}