{
    "transportId": "4277f3e6-af0f-40c7-a571-ba6613b74af3",
    "args": {
        "entity": "fa_field_config",
        "field_values": {
            "label_for_true": "Yes",
            "label_for_false": "No",
            "entityName": "phone_call",
            "fa_entity_id": "c4242432-96de-4265-86e3-e811fec150d8",
            "layout_id": "3bb89feb-6473-49af-a56c-28a70218f823",
            "name_label": "Note",
            "data_type": "4e71314b-f997-4338-bd88-746ca266bdf6"
        }
    },
    "transports": [
        {
            "id": "0b945c95-151b-4961-bcb8-e5719e37a3cd",
            "field": "transport_id",
            "model": "fa_field_config"
        }
    ]
}