Project_Name,Area,Skills,Team_Size,Start_Date
our-awesome-project,automotive,banking,5,2020-03-12
offshore-project,automotive,java,12,2018-02-12
internal-project,hr,frontend,3,2019-06-15
another-cool-project,banking,cloud,9,2020-08-01