[
  {
    "Project Name": "our-awesome-project",
    "Area": "automotive",
    "Skills": "banking",
    "Team Size": 5,
    "Start Date": "2020-03-12"
  },
  {
    "Project Name": "another-cool-project",
    "Area": "banking",
    "Skills": "cloud",
    "Team Size": 9,
    "Start Date": "2020-08-01"
  },
  {
    "Project Name": "our-awesome-project",
    "Area": "automotive",
    "Skills": "sw engineering",
    "Team Size": 5,
    "Start Date": "2020-03-12"
  },
  {
    "Project Name": "another-cool-project",
    "Area": "banking",
    "Skills": "cloud",
    "Team Size": 9,
    "Start Date": "2020-08-01"
  },
  {
    "Project Name": "our-awesome-project",
    "Area": "automotive",
    "Skills": "sw engineering",
    "Team Size": 5,
    "Start Date": "2020-03-12"
  },
  {
    "Project Name": "another-cool-project",
    "Area": "banking",
    "Skills": "cloud",
    "Team Size": 9,
    "Start Date": "2020-08-01"
  },
  {
    "Project Name": "our-awesome-project",
    "Area": "automotive",
    "Skills": "sw engineering",
    "Team Size": 5,
    "Start Date": "2020-03-12"
  },
  {
    "Project Name": "another-cool-project",
    "Area": "banking",
    "Skills": "cloud",
    "Team Size": 9,
    "Start Date": "2020-08-01"
  },
  {
    "Project Name": "our-awesome-project",
    "Area": "automotive",
    "Skills": "sw engineering",
    "Team Size": 5,
    "Start Date": "2020-03-12"
  },
  {
    "Project Name": "another-cool-project",
    "Area": "banking",
    "Skills": "cloud",
    "Team Size": 9,
    "Start Date": "2020-08-01"
  },
  {
    "Project Name": "our-awesome-project",
    "Area": "automotive",
    "Skills": "sw engineering",
    "Team Size": 5,
    "Start Date": "2020-03-12"
  },
  {
    "Project Name": "another-cool-project",
    "Area": "banking",
    "Skills": "cloud",
    "Team Size": 9,
    "Start Date": "2020-08-01"
  },
  {
    "Project Name": "our-awesome-project",
    "Area": "automotive",
    "Skills": "sw engineering",
    "Team Size": 5,
    "Start Date": "2020-03-12"
  },
  {
    "Project Name": "another-cool-project",
    "Area": "banking",
    "Skills": "cloud",
    "Team Size": 9,
    "Start Date": "2020-08-01"
  },
  {
    "Project Name": "our-awesome-project",
    "Area": "automotive",
    "Skills": "sw engineering",
    "Team Size": 5,
    "Start Date": "2020-03-12"
  },
  {
    "Project Name": "another-cool-project",
    "Area": "banking",
    "Skills": "cloud",
    "Team Size": 9,
    "Start Date": "2020-08-01"
  },
  {
    "Project Name": "our-awesome-project",
    "Area": "automotive",
    "Skills": "sw engineering",
    "Team Size": 5,
    "Start Date": "2020-03-12"
  },
  {
    "Project Name": "another-cool-project",
    "Area": "banking",
    "Skills": "cloud",
    "Team Size": 9,
    "Start Date": "2020-08-01"
  },
  {
    "Project Name": "our-awesome-project",
    "Area": "automotive",
    "Skills": "sw engineering",
    "Team Size": 5,
    "Start Date": "2020-03-12"
  },
  {
    "Project Name": "another-cool-project",
    "Area": "xhens",
    "Skills": "cloud",
    "Team Size": 9,
    "Start Date": "2020-08-01"
  }
]