docs/Makefile: Format SUPPORT.md into the toplevel

Signed-off-by: Ian Jackson <Ian.Jackson@eu.citrix.com>
Release-acked-by: Juergen Gross <jgross@suse.com>
Acked-by: Lars Kurth <lars.kurth@citrix.com>
16 jobs for staging in 121 minutes and 34 seconds (queued for 8 minutes and 22 seconds)
Status Name Job ID Coverage
  Build
failed centos-7-2-gcc #62648926

00:18:02

failed centos-7-2-gcc-debug #62648928

00:24:02

failed debian-jessie-clang #62648929

00:12:41

failed debian-jessie-clang-debug #62648931

00:12:21

failed debian-jessie-gcc #62648932

01:12:29

failed debian-jessie-gcc-debug #62648933

00:12:27

failed debian-stretch-clang #62648934

00:18:33

failed debian-stretch-clang-debug #62648935

00:15:42

failed debian-stretch-gcc #62648936

00:22:46

failed debian-stretch-gcc-debug #62648937

00:13:12

failed ubuntu-trusty-gcc #62648938

00:15:01

failed ubuntu-trusty-gcc-debug #62648939

00:12:53

failed ubuntu-xenial-clang #62648940

00:18:43

failed ubuntu-xenial-clang-debug #62648941

00:16:10

failed ubuntu-xenial-gcc #62648942

00:21:54

failed ubuntu-xenial-gcc-debug #62648943

00:12:06

 
Name Stage Failure
failed
ubuntu-trusty-gcc Build
BEGIN failed--compilation aborted at /builds/xen-project/xen/docs/gen-html-index line 13.
make[1]: *** [html/index.html] Error 2
make[1]: Leaving directory `/builds/xen-project/xen/docs'
make: *** [install-docs] Error 2
Uploading artifacts...
xen/.config: found 1 matching files
*.log: found 2 matching files

Uploading artifacts to coordinator... ok
id=62648938 responseStatus=201 Created token=6zmwWnY9
ERROR: Job failed: exit code 1
failed
centos-7-2-gcc-debug Build
BEGIN failed--compilation aborted at /builds/xen-project/xen/docs/gen-html-index line 13.
make[1]: *** [html/index.html] Error 2
make[1]: Leaving directory `/builds/xen-project/xen/docs'
make: *** [install-docs] Error 2
Uploading artifacts...
xen/.config: found 1 matching files
*.log: found 2 matching files

Uploading artifacts to coordinator... ok
id=62648928 responseStatus=201 Created token=UzcMWXy-
ERROR: Job failed: exit code 1
failed
debian-jessie-clang Build
make[1]: *** [html/index.html] Error 2
make[1]: Leaving directory '/builds/xen-project/xen/docs'
Makefile:146: recipe for target 'install-docs' failed
make: *** [install-docs] Error 2
Uploading artifacts...
xen/.config: found 1 matching files
*.log: found 2 matching files

Uploading artifacts to coordinator... ok
id=62648929 responseStatus=201 Created token=FmEx8uM1
ERROR: Job failed: exit code 1
failed
debian-jessie-clang-debug Build
make[1]: *** [html/index.html] Error 2
make[1]: Leaving directory '/builds/xen-project/xen/docs'
Makefile:146: recipe for target 'install-docs' failed
make: *** [install-docs] Error 2
Uploading artifacts...
xen/.config: found 1 matching files
*.log: found 2 matching files

Uploading artifacts to coordinator... ok
id=62648931 responseStatus=201 Created token=5czndSdc
ERROR: Job failed: exit code 1
failed
debian-jessie-gcc Build
make[1]: *** [html/index.html] Error 2
make[1]: Leaving directory '/builds/xen-project/xen/docs'
Makefile:146: recipe for target 'install-docs' failed
make: *** [install-docs] Error 2
Uploading artifacts...
xen/.config: found 1 matching files
*.log: found 2 matching files

Uploading artifacts to coordinator... ok
id=62648932 responseStatus=201 Created token=x_pKHWzT
ERROR: Job failed: exit code 1
failed
debian-jessie-gcc-debug Build
make[1]: *** [html/index.html] Error 2
make[1]: Leaving directory '/builds/xen-project/xen/docs'
Makefile:146: recipe for target 'install-docs' failed
make: *** [install-docs] Error 2
Uploading artifacts...
xen/.config: found 1 matching files
*.log: found 2 matching files

Uploading artifacts to coordinator... ok
id=62648933 responseStatus=201 Created token=Ymst9bdQ
ERROR: Job failed: exit code 1
failed
debian-stretch-clang Build
make[1]: *** [html/index.html] Error 2
make[1]: Leaving directory '/builds/xen-project/xen/docs'
Makefile:146: recipe for target 'install-docs' failed
make: *** [install-docs] Error 2
Uploading artifacts...
xen/.config: found 1 matching files
*.log: found 2 matching files

Uploading artifacts to coordinator... ok
id=62648934 responseStatus=201 Created token=Ho2xVayC
ERROR: Job failed: exit code 1
failed
debian-stretch-clang-debug Build
make[1]: *** [html/index.html] Error 2
make[1]: Leaving directory '/builds/xen-project/xen/docs'
Makefile:146: recipe for target 'install-docs' failed
make: *** [install-docs] Error 2
Uploading artifacts...
xen/.config: found 1 matching files
*.log: found 2 matching files

Uploading artifacts to coordinator... ok
id=62648935 responseStatus=201 Created token=1h5cCz_z
ERROR: Job failed: exit code 1
failed
debian-stretch-gcc-debug Build
make[1]: *** [html/index.html] Error 2
make[1]: Leaving directory '/builds/xen-project/xen/docs'
Makefile:146: recipe for target 'install-docs' failed
make: *** [install-docs] Error 2
Uploading artifacts...
xen/.config: found 1 matching files
*.log: found 2 matching files

Uploading artifacts to coordinator... ok
id=62648937 responseStatus=201 Created token=Fv_B8VHZ
ERROR: Job failed: exit code 1
failed
ubuntu-xenial-clang Build
make[1]: *** [html/index.html] Error 2
make[1]: Leaving directory '/builds/xen-project/xen/docs'
Makefile:146: recipe for target 'install-docs' failed
make: *** [install-docs] Error 2
Uploading artifacts...
xen/.config: found 1 matching files
*.log: found 2 matching files

Uploading artifacts to coordinator... ok
id=62648940 responseStatus=201 Created token=Vwgbc6Ju
ERROR: Job failed: exit code 1
failed
ubuntu-xenial-gcc Build
make[1]: *** [html/index.html] Error 2
make[1]: Leaving directory '/builds/xen-project/xen/docs'
Makefile:146: recipe for target 'install-docs' failed
make: *** [install-docs] Error 2
Uploading artifacts...
xen/.config: found 1 matching files
*.log: found 2 matching files

Uploading artifacts to coordinator... ok
id=62648942 responseStatus=201 Created token=DpFzvm2s
ERROR: Job failed: exit code 1
failed
ubuntu-xenial-gcc-debug Build
make[1]: *** [html/index.html] Error 2
make[1]: Leaving directory '/builds/xen-project/xen/docs'
Makefile:146: recipe for target 'install-docs' failed
make: *** [install-docs] Error 2
Uploading artifacts...
xen/.config: found 1 matching files
*.log: found 2 matching files

Uploading artifacts to coordinator... ok
id=62648943 responseStatus=201 Created token=UPEzLZLw
ERROR: Job failed: exit code 1
failed
centos-7-2-gcc Build
BEGIN failed--compilation aborted at /builds/xen-project/xen/docs/gen-html-index line 13.
make[1]: *** [html/index.html] Error 2
make[1]: Leaving directory `/builds/xen-project/xen/docs'
make: *** [install-docs] Error 2
Uploading artifacts...
xen/.config: found 1 matching files
*.log: found 2 matching files

Uploading artifacts to coordinator... ok
id=62648926 responseStatus=201 Created token=ninx1cP2
ERROR: Job failed: exit code 1
failed
ubuntu-trusty-gcc-debug Build
BEGIN failed--compilation aborted at /builds/xen-project/xen/docs/gen-html-index line 13.
make[1]: *** [html/index.html] Error 2
make[1]: Leaving directory `/builds/xen-project/xen/docs'
make: *** [install-docs] Error 2
Uploading artifacts...
xen/.config: found 1 matching files
*.log: found 2 matching files

Uploading artifacts to coordinator... ok
id=62648939 responseStatus=201 Created token=GoxYsK6d
ERROR: Job failed: exit code 1
failed
ubuntu-xenial-clang-debug Build
make[1]: *** [html/index.html] Error 2
make[1]: Leaving directory '/builds/xen-project/xen/docs'
Makefile:146: recipe for target 'install-docs' failed
make: *** [install-docs] Error 2
Uploading artifacts...
xen/.config: found 1 matching files
*.log: found 2 matching files

Uploading artifacts to coordinator... ok
id=62648941 responseStatus=201 Created token=sN-9LNRa
ERROR: Job failed: exit code 1
failed
debian-stretch-gcc Build
make[1]: *** [html/index.html] Error 2
make[1]: Leaving directory '/builds/xen-project/xen/docs'
Makefile:146: recipe for target 'install-docs' failed
make: *** [install-docs] Error 2
Uploading artifacts...
xen/.config: found 1 matching files
*.log: found 2 matching files

Uploading artifacts to coordinator... ok
id=62648936 responseStatus=201 Created token=ZdJx8SA9
ERROR: Job failed: exit code 1