module gitlab.com/xen-project/people/gdunlap/go-xenlib

go 1.18

require (
	github.com/Microsoft/go-winio v0.6.1 // indirect
	github.com/ProtonMail/go-crypto v0.0.0-20230923063757-afb1ddc0824c // indirect
	github.com/agnivade/levenshtein v1.1.0
	github.com/bluekeyes/go-gitdiff v0.5.1-0.20201031230050-b846b2cee04a
	github.com/emirpasic/gods v1.18.1 // indirect
	github.com/go-git/go-git/v5 v5.10.0
	github.com/jmoiron/sqlx v1.3.5
	github.com/kevinburke/ssh_config v1.2.0 // indirect
	github.com/mattn/go-sqlite3 v1.14.14
	github.com/mitchellh/go-homedir v1.1.0
	github.com/mpvl/unique v0.0.0-20150818121801-cbe035fff7de
	github.com/sergi/go-diff v1.3.1 // indirect
	github.com/sirupsen/logrus v1.9.0
	github.com/spf13/afero v1.1.2 // indirect
	github.com/spf13/cobra v1.1.1
	github.com/spf13/viper v1.7.1
	github.com/xanzy/ssh-agent v0.3.3 // indirect
	gitlab.com/martyros/sqlutil v0.0.0-20220719053433-a391ff774a35
	golang.org/x/crypto v0.14.0 // indirect
	golang.org/x/net v0.17.0 // indirect
	golang.org/x/sys v0.14.0 // indirect
	gonum.org/v1/plot v0.8.1
)

require github.com/samber/lo v1.35.0

require (
	dario.cat/mergo v1.0.0 // indirect
	github.com/acomagu/bufpipe v1.0.4 // indirect
	github.com/ajstarks/svgo v0.0.0-20180226025133-644b8db467af // indirect
	github.com/cloudflare/circl v1.3.6 // indirect
	github.com/cyphar/filepath-securejoin v0.2.4 // indirect
	github.com/fogleman/gg v1.3.0 // indirect
	github.com/fsnotify/fsnotify v1.4.7 // indirect
	github.com/go-git/gcfg v1.5.1-0.20230307220236-3a3c6141e376 // indirect
	github.com/go-git/go-billy/v5 v5.5.0 // indirect
	github.com/go-latex/latex v0.0.0-20200518072620-0806b477ea35 // indirect
	github.com/golang/freetype v0.0.0-20170609003504-e2365dfdc4a0 // indirect
	github.com/golang/groupcache v0.0.0-20210331224755-41bb18bfe9da // indirect
	github.com/hashicorp/hcl v1.0.0 // indirect
	github.com/inconshreveable/mousetrap v1.0.0 // indirect
	github.com/jbenet/go-context v0.0.0-20150711004518-d14ea06fba99 // indirect
	github.com/jung-kurt/gofpdf v1.16.2 // indirect
	github.com/magiconair/properties v1.8.1 // indirect
	github.com/mitchellh/mapstructure v1.1.2 // indirect
	github.com/pelletier/go-toml v1.2.0 // indirect
	github.com/pjbgf/sha1cd v0.3.0 // indirect
	github.com/skeema/knownhosts v1.2.1 // indirect
	github.com/spf13/cast v1.3.0 // indirect
	github.com/spf13/jwalterweatherman v1.0.0 // indirect
	github.com/spf13/pflag v1.0.5 // indirect
	github.com/subosito/gotenv v1.2.0 // indirect
	golang.org/x/exp v0.0.0-20220303212507-bbda1eaf7a17 // indirect
	golang.org/x/image v0.0.0-20200618115811-c13761719519 // indirect
	golang.org/x/mod v0.14.0 // indirect
	golang.org/x/text v0.13.0 // indirect
	golang.org/x/tools v0.14.0 // indirect
	gopkg.in/ini.v1 v1.51.0 // indirect
	gopkg.in/warnings.v0 v0.1.2 // indirect
	gopkg.in/yaml.v2 v2.4.0 // indirect
)
