module gitlab.com/xen-project/misc/session-scheduler

require (
	github.com/corpix/uarand v0.1.0 // indirect
	github.com/davecgh/go-spew v1.1.1 // indirect
	github.com/gofrs/flock v0.8.1
	github.com/hjson/hjson-go v3.3.0+incompatible
	github.com/icrowley/fake v0.0.0-20180203215853-4178557ae428
	github.com/jmoiron/sqlx v1.4.0
	github.com/julienschmidt/httprouter v1.3.0
	github.com/mattn/go-sqlite3 v1.14.22
	github.com/microcosm-cc/bluemonday v1.0.23
	github.com/russross/blackfriday/v2 v2.1.0
	github.com/stretchr/testify v1.4.0 // indirect
	golang.org/x/crypto v0.17.0
	gopkg.in/yaml.v2 v2.2.4 // indirect
)

go 1.15
