{
    "title": "Expert en informatique et Système d'information",
    "description": "Développeur Full Stack en recherche de nouvel emploi en CDI",
    "identity": {
        "firstname": "julien",
        "lastname": "lauret" ,
        "birthdate": "1998/11/24"
    },
    "address": {
        "address_1": "21 rue Simone Boudet",
        "address_2": "appt. C80",
        "postal_code": 31200,
        "city": "Toulouse",
        "country": "France"
    },
    "contact": {
        "phone": "06.85.57.17.26",
        "email": "julien.lauret.pro@gmail.com"
    },
    "skills": {
        "languages": [
            {
                "name": "français",
                "level": 100
            },
            {
                "name": "anglais",
                "level": 80
            },
            {
                "name": "espagnol",
                "level": 30
            },
            {
                "name": "japonais",
                "level": 10
            }
        ],
        "techno": [
            {
                "name": "Python - Django/FastApi/Flask",
                "mastery": "90%",
                "icon": "python"
            },
            {
                "name": "PHP - Symfony/CakePHP",
                "mastery": "78%",
                "icon": "php"
            },
            {
                "name": "Base de Donnée - MySQL/MariaDB",
                "mastery": "65%",
                "icon": "mariadb"
            },
            {
                "name": "Développement Web (Front)",
                "mastery": "80%",
                "icon": "web"
            },
            {
                "name": "Conteneurisation - Docker/Podman",
                "mastery": "75%",
                "icon": "docker"
            },
            {
                "name": "CI/CD - GitlabCI",
                "mastery": "60%",
                "icon": "gitlab"
            }
        ]
    },
    "formations": [
        {
            "school": "EPSI Bordeaux",
            "dates": {
                "start": "2020/10/11",
                "end": "2021/7/31"
            },
            "licence": "BAC +5 - Titre de niveau 7 - Expert en informatique et Systèmes d'informations"
        },
        {
            "school": "EPSI Bordeaux",
            "dates": {
                "start": "2018/10/9",
                "end": "2019/7/4"
            },
            "licence": "BAC +3 - Titre de niveau 5 - Concepteur dévelopeur informatique"
        },
        {
            "school": "YNOV - Ingésup Bordeaux",
            "dates": {
                "start": "2016/9/21",
                "end": "2018/6/30"
            },
            "licence": "BAC +1/+2 Informatique"
        }
    ],
    "professional_xp": [
        {
            "type": "CDI",
            "company": "ASTEK",
            "city": "Toulouse",
            "postal_code": "31",
            "dates": {
                "start": "2023/7/3",
                "end": "2024/5/28"
            },
            "tasks": [
                "Développement et maintenance d'application python sur site client",
                "Gestion de CI/CD Gitlab"
            ]
        },
        {
            "type": "CDI",
            "company": "Vega France",
            "city": "Toulouse",
            "postal_code": "31",
            "dates": {
                "start": "2021/10/11",
                "end": "2023/6/27"
            },
            "tasks": [
                "Gestion, Développement et maintenance d'application Web",
                "Développement de logiciel embarqués",
                "Administration Système et Réseau",
                "Electronique",
                "Gestion de CI/CD Gitlab"
            ]
        },
        {
            "type": "Alternance",
            "company": "Job Explorer",
            "city": "Bordeaux",
            "postal_code": "33",
            "dates": {
                "start": "2019/1/19",
                "end": "2021/8/31"
            },
            "tasks": [
                "Développement et maintenance application web",
                "Migration CakePHP vers Symfony",
                "Support client"
            ]
        },
        {
            "type": "Stage",
            "company": "CHD - La Candelie",
            "city": "Agen",
            "postal_code": "47",
            "dates": {
                "start": "2018/6/1",
                "end": "2018/8/31"
            },
            "tasks": [
                "Développement Web - Flask",
                "Initiation à l'architechture d'infra réseau"
            ]
        },
        {
            "type": "Stage",
            "company": "France3 Poitou-Charentes",
            "city": "Poitiers",
            "postal_code": "86",
            "dates": {
                "start": "2017/6/1",
                "end": "2017/8/31"
            },
            "tasks": [
                "Maintenance Réseau physique",
                "Initiation à l'outil GLPI"
            ]
        }
    ],
    "others": {
        "hobbies": [
            "Jeux vidéos",
            "Jeux de Rôles",
            "Musique",
            "Montage Vidéo",
            "Dessin",
            "Manga/Anime",
            "Développement"
        ],
        "patronage": [
            {
                "name": "Pets Rescue France",
                "url": "https://sos-animaux-23.fr/",
                "sector": "Développement web",
                "dates": {
                    "start": "2024/4/1",
                    "end": "2024/5/28"
                },
                "referants": [
                    {
                        "name": "MARYSE CERQUEIRA",
                        "contact": "mcerqueira@groupeastek.fr"
                    },
                    {
                        "name": "Clément Trofleau",
                        "contact": "c.trofleau@gmail.com"
                    }
                ],
                "tasks": [
                    "Projet Pattes-a-coeur: Review et correction de merge request",
                    "Projet de générateur Formulaire de don: Développement d'api personnalisée sous FastApi"
                ]
            }
        ], 
        "links": [
            {
                "name": "gitlab",
                "icon": "gitlab",
                "url": "https://gitlab.com/XelekGakure"
            }   
        ]
    }
}