module gitlab.com/xdev-tech/xdev-enterprise-business-network/hlf-k8s/ccid

go 1.16

require (
	github.com/apex/log v1.9.0
	github.com/mitchellh/go-homedir v1.1.0
	github.com/spf13/cobra v1.3.0
	github.com/spf13/viper v1.10.1
)
