{
  "Version":"2012-10-17",
  "Statement":[
    {
      "Effect":"Allow",
      "Principal":{
        "Service":"ec2.amazonaws.com"
      },
      "Action":"sts:AssumeRole"
    },
    {
      "Effect":"Allow",
      "Principal":{
        "Service":"ecs-tasks.amazonaws.com"
      },
      "Action":"sts:AssumeRole"
    },
    {
      "Effect":"Allow",
      "Principal":{
        "Service":"ecs.amazonaws.com"
      },
        "Action":"sts:AssumeRole"
      }
  ]
}
