{
  "Version" : "2012-10-17",
  "Id" : "Policy1560181228695",
  "Statement" : [
    {
      "Sid" : "Stmt1560181207940",
      "Effect" : "Allow",
      "Principal" : {
        "AWS" : "arn:aws:iam::855262394183:user/datateam-snowplow-ro"
      },
      "Action" : "s3:ListBucket",
      "Resource" : "arn:aws:s3:::gitlab-com-snowplow-events"
    },
    {
      "Sid" : "Stmt1560181227007",
      "Effect" : "Allow",
      "Principal" : {
        "AWS" : "arn:aws:iam::855262394183:user/datateam-snowplow-ro"
      },
      "Action" : "s3:GetObject",
      "Resource" : "arn:aws:s3:::gitlab-com-snowplow-events/*"
    }
  ]
}
