100
300
210
210
209
207
205
202
201
197
193
192
188
186
185
184
182
181
177
176
173
172
168
166
165
164
161
161
161
160
160
159
158
157
153
153
152
152
149
147
144
144
133
131
129
128
127
125
124
122
122
121
120
120
115
115
112
110
109
107
107
107
107
106
106
105
104
104
104
100
97
97
95
93
93
92
91
89
87
85
83
81
78
77
77
76
76
75
75
73
71
70
69
64
64
63
63
62
62
61
61
60
