50
100
79
76
74
70
70
69
67
66
66
65
64
62
61
60
55
54
52
47
47
47
44
42
41
41
40
39
39
39
38
36
36
35
34
34
32
31
31
29
26
24
24
24
23
23
22
22
21
14
13
11
