500
400
280
280
279
279
279
279
277
277
276
274
274
273
273
272
271
271
271
271
271
271
271
270
269
268
268
267
267
267
267
267
266
266
266
266
265
265
265
265
265
264
264
263
263
262
262
262
262
261
261
261
261
260
260
260
260
259
259
258
257
257
256
256
255
255
255
254
254
254
254
254
253
252
252
251
251
251
251
250
250
249
249
248
247
247
247
247
247
247
246
246
246
246
246
245
245
245
245
245
243
243
243
243
242
242
242
241
241
240
240
240
240
240
239
239
239
239
239
238
238
238
237
237
235
235
235
235
235
235
234
234
234
234
233
233
233
233
232
230
230
230
228
228
228
227
227
226
226
225
225
225
224
224
224
224
223
223
222
222
222
222
222
221
221
221
220
220
219
219
219
219
219
219
219
217
217
217
217
217
216
215
215
214
214
214
214
212
211
210
210
210
210
210
209
209
208
208
207
207
206
204
204
203
203
203
203
202
201
200
200
200
200
198
198
197
197
197
197
195
195
194
194
194
193
193
193
193
193
192
192
191
190
190
190
189
189
188
187
187
186
186
186
186
186
186
186
185
185
185
185
185
184
184
184
183
183
182
182
182
182
182
181
181
180
180
180
179
179
179
179
179
178
176
176
176
176
176
176
176
175
174
174
173
172
172
172
171
171
171
170
170
170
169
169
169
169
169
168
168
167
167
165
164
164
163
163
162
161
161
161
161
161
160
159
158
157
157
157
156
156
155
155
155
155
154
152
152
151
151
151
151
151
150
150
150
150
149
149
149
148
147
146
146
145
145
145
145
145
145
143
142
142
141
140
139
139
138
137
137
137
137
136
135
135
135
134
134
134
134
134
133
133
133
132
131
131
130
130
129
129
129
128
128
127
127
126
126
125
125
125
124
124
124
123
123
123
122
122
122
121
121
121
121
121
120
120
120
120
120
119
119
119
119
118
118
118
118
117
117
117
117
117
115
115
114
114
114
113
110
110
110
110
109
109
109
109
109
108
107
104
104
102
102
102
102
102
102
102
102
101
100
100
100
99
98
98
98
98
97
97
97
96
96
95
95
94
94
94
92
92
92
92
91
91
91
89
88
88
88
87
87
87
87
85
85
85
84
84
84
84
84
83
83
83
82
82
81
81
81
80
80
