100
300
237
236
232
228
228
228
226
225
224
222
216
214
213
213
212
210
208
208
206
201
199
197
196
193
189
187
187
185
180
180
180
178
178
175
175
174
174
174
173
172
170
170
169
168
163
162
161
161
161
155
155
153
152
150
149
147
146
145
142
141
139
134
127
126
126
122
120
118
115
114
114
113
113
112
111
103
102
101
99
99
99
99
96
94
94
92
90
88
87
84
84
79
77
75
73
73
65
64
64
60
