100
75
60
60
58
58
58
58
58
57
57
55
55
54
54
52
52
52
52
51
50
50
49
47
47
45
44
44
43
43
43
42
41
41
41
41
40
40
39
39
38
38
37
37
36
36
36
36
36
35
35
35
35
34
34
33
32
31
30
30
30
29
29
29
28
27
27
27
26
26
26
25
25
25
24
24
23
23
23
22
22
22
21
21
21
21
20
19
19
19
19
19
19
18
18
18
18
18
17
16
16
15
