50
150
105
100
99
96
96
96
94
93
93
91
89
88
87
85
82
80
79
77
75
72
68
66
61
61
57
56
55
53
53
52
51
50
49
47
46
46
45
44
43
41
41
40
39
38
37
34
33
32
31
31
