200
100
70
70
70
69
69
69
69
68
67
67
67
67
67
67
66
66
65
65
65
65
64
64
63
63
63
62
61
60
60
60
59
58
58
58
58
57
57
57
57
56
56
56
55
55
55
54
54
54
54
54
53
53
53
53
53
53
53
53
53
52
52
52
52
52
52
51
51
51
50
50
50
49
49
49
49
49
48
48
48
48
47
47
46
45
45
44
44
44
44
44
44
44
43
43
43
42
42
42
41
41
40
40
40
39
39
39
39
38
38
38
37
36
36
36
36
35
35
35
35
35
35
34
34
33
33
33
32
32
31
31
30
30
29
29
29
29
29
28
28
28
28
28
27
27
27
27
26
26
26
26
26
26
26
26
24
24
24
24
24
23
23
23
23
23
22
22
22
22
22
22
22
21
20
20
19
19
19
18
18
18
18
17
17
17
16
15
14
14
13
13
12
12
12
10
10
10
10
10
10
10
