100
750
589
588
586
580
577
577
559
557
554
549
546
545
545
543
537
536
531
528
526
513
513
508
506
502
501
498
491
490
487
478
460
459
454
454
450
450
443
443
437
426
423
417
405
404
403
397
386
381
376
373
370
355
345
332
330
305
294
294
287
284
283
280
272
267
265
263
241
234
221
221
220
219
212
206
204
202
199
190
173
163
147
145
137
134
129
128
123
117
113
112
106
100
97
90
86
85
84
79
79
76
