300
200
139
139
139
138
138
138
138
137
137
137
137
136
136
136
136
136
135
135
135
135
135
135
135
135
135
134
134
133
133
133
133
132
132
132
130
130
129
128
128
128
127
127
127
127
126
126
125
125
125
125
124
124
124
123
123
123
123
123
122
122
122
121
121
121
121
121
121
120
120
120
119
119
118
118
118
118
117
117
117
117
117
117
117
117
117
116
116
115
114
113
113
112
112
112
112
112
111
110
110
110
110
110
109
109
108
108
108
108
107
107
107
106
106
105
105
105
104
103
101
101
101
101
100
100
100
100
100
100
100
99
99
99
98
98
98
98
97
97
96
96
95
95
94
94
94
93
93
92
90
90
90
90
89
89
88
88
88
88
87
87
87
86
86
86
86
86
85
85
85
84
83
82
82
82
82
82
81
81
80
80
80
80
80
79
79
79
79
79
78
76
76
76
76
75
75
75
75
74
73
72
72
72
70
70
70
69
69
69
69
69
69
68
68
68
68
68
67
67
67
65
65
65
64
64
63
61
61
61
61
60
60
60
60
59
58
56
56
56
56
56
56
55
55
55
55
55
54
54
54
54
53
53
53
53
53
52
52
52
51
51
51
51
51
50
50
50
49
49
48
47
47
47
46
46
46
46
46
46
44
44
44
44
43
43
43
43
43
42
42
42
41
41
41
41
41
40
40
40
40
40
