300
1000
698
692
690
688
687
683
680
678
672
672
672
666
665
664
663
661
661
654
649
649
648
647
646
642
642
638
637
636
635
633
629
629
627
627
626
624
622
622
622
621
617
617
616
615
610
609
606
602
599
590
589
588
588
586
586
578
577
572
571
570
568
560
560
558
556
555
555
550
546
543
540
539
537
537
534
533
532
529
529
526
526
525
522
522
519
518
518
517
508
507
504
504
500
498
490
489
487
487
486
486
478
474
469
467
466
463
462
457
456
455
454
452
450
446
446
445
443
442
435
433
427
426
425
420
418
412
412
408
408
407
404
402
401
398
392
392
391
389
388
387
385
382
382
381
379
378
376
374
370
370
369
361
361
360
359
359
355
355
350
348
347
347
342
342
341
340
339
337
337
333
332
329
326
325
325
323
318
316
314
310
306
303
303
302
295
292
290
289
288
286
285
285
282
280
278
277
274
273
272
271
271
267
267
266
264
260
260
260
253
253
250
250
248
243
242
242
241
239
238
237
233
233
232
228
227
227
225
223
220
220
215
215
214
214
214
212
206
206
202
200
199
195
192
191
190
189
189
189
187
187
187
184
180
180
179
179
175
175
174
174
168
168
168
165
164
162
158
154
152
150
147
147
146
144
144
144
138
135
128
124
120
120
119
117
117
116
116
113
112
111
109
109
108
107
105
104
103
101
101
100
