100
750
591
591
588
587
581
578
576
575
573
572
565
561
558
557
554
548
530
528
522
511
497
491
491
490
481
480
476
461
449
449
449
435
434
432
432
429
426
426
425
420
418
403
393
392
388
386
383
382
353
352
346
344
340
339
328
321
320
320
315
315
313
312
304
301
300
297
296
296
282
280
279
269
267
262
262
260
260
251
245
234
234
233
230
223
222
216
215
212
199
196
185
181
179
177
172
172
167
158
157
150
