100
400
275
268
268
268
266
265
265
265
261
261
260
260
256
254
254
253
252
251
249
247
245
244
243
238
238
232
231
229
226
226
225
224
224
223
221
218
210
209
207
206
200
196
195
194
191
188
187
187
185
185
185
183
181
178
175
175
174
170
164
161
157
157
155
153
149
149
143
142
141
141
140
135
131
127
126
123
123
120
119
118
117
116
113
110
110
110
108
108
107
106
102
100
95
92
91
89
89
86
84
81
