400
500
400
400
399
398
398
398
398
398
397
396
395
394
393
392
392
392
392
391
390
389
388
386
385
383
382
382
382
382
381
381
381
379
379
379
378
377
376
376
376
376
375
374
374
373
373
371
370
370
369
369
368
366
365
365
365
364
363
361
359
359
358
357
356
356
356
355
355
355
354
352
351
350
350
350
349
347
347
347
346
344
343
343
340
338
338
338
337
334
334
333
331
330
330
330
330
328
327
326
326
326
324
323
321
321
321
319
319
319
317
317
315
315
315
314
314
312
311
309
307
305
305
305
305
304
303
301
301
301
300
300
300
299
298
298
298
297
297
297
295
295
294
294
294
291
290
289
289
288
287
286
285
284
282
281
281
280
279
278
277
275
275
275
273
273
271
269
269
268
268
267
266
266
265
265
265
264
262
261
261
260
260
260
259
256
256
255
255
254
251
251
250
248
247
246
246
246
246
245
245
244
244
243
242
239
239
239
239
238
238
238
237
237
236
236
235
235
234
234
233
233
232
232
229
229
228
227
225
225
224
224
223
223
222
222
221
220
219
218
218
218
218
218
216
216
215
215
212
211
211
210
210
210
209
208
208
207
206
205
205
205
204
203
202
201
201
201
200
199
198
198
197
194
192
192
191
190
189
188
188
188
187
187
186
186
186
186
186
185
185
184
183
183
182
181
181
180
180
179
178
177
176
176
176
176
175
175
175
175
174
174
173
173
172
172
171
170
170
170
170
170
170
169
169
167
166
164
164
163
162
162
162
161
160
160
160
155
155
155
153
153
153
151
150
150
148
147
144
144
142
140
139
139
139
138
138
136
136
136
135
134
134
134
132
130
130
128
127
127
127
126
126
126
125
125
124
124
123
123
122
122
120
120
118
116
116
115
114
112
111
111
110
108
103
102
101
100
100
100
100
100
