500
750
600
600
599
598
598
597
595
595
594
594
592
592
592
592
591
590
589
588
588
587
584
582
581
580
579
578
576
574
573
572
572
570
569
568
568
567
566
564
563
563
562
559
557
555
554
553
552
552
552
552
551
549
547
547
545
545
543
541
541
540
540
540
540
539
539
537
537
536
536
534
534
534
533
531
530
529
528
528
527
525
524
523
522
522
521
520
518
517
515
514
514
514
512
511
511
510
507
506
506
505
505
504
504
503
503
502
500
500
499
497
497
497
496
496
496
495
495
494
494
494
493
491
491
491
491
490
489
486
485
484
484
483
483
482
482
482
480
478
478
477
475
475
474
473
473
472
471
470
470
469
469
469
467
465
464
463
461
461
461
460
459
458
457
457
455
454
454
453
452
451
450
450
449
448
448
446
446
446
446
445
442
442
442
441
441
440
440
439
438
438
437
435
434
434
433
432
432
430
429
429
428
428
427
426
426
426
426
425
425
425
425
425
424
423
422
422
421
421
421
420
419
418
418
416
415
414
411
408
408
407
406
405
405
405
404
404
403
403
402
401
399
399
398
398
398
395
395
393
393
392
391
391
391
390
389
388
386
386
385
383
383
383
382
381
380
379
378
376
376
375
375
373
373
373
372
371
370
366
365
364
364
364
364
364
364
362
362
362
360
356
356
355
354
353
352
352
350
349
348
345
345
344
340
339
337
337
337
336
335
334
334
333
332
331
331
330
330
329
328
327
327
326
325
319
319
318
317
317
316
314
314
313
311
310
308
308
308
307
306
306
301
300
300
300
300
299
298
296
295
293
290
290
289
288
288
287
287
287
286
283
282
281
281
280
276
276
275
274
273
273
272
272
270
270
270
267
265
264
264
263
263
262
261
260
259
259
258
258
256
253
253
253
251
251
249
248
248
248
246
246
244
244
242
241
240
240
239
238
235
235
234
232
232
231
230
230
228
228
227
226
226
225
225
223
222
222
222
221
220
220
219
218
217
217
215
215
215
212
211
210
209
207
207
207
206
206
204
201
201
200
200
198
197
196
195
194
194
194
193
193
191
191
190
190
189
189
189
188
187
187
187
186
185
184
183
183
183
181
179
176
175
175
173
172
172
171
169
168
163
162
159
156
156
156
155
154
154
153
153
151
