100
750
599
595
592
588
583
581
578
575
574
568
566
565
563
561
551
533
530
525
519
518
505
497
497
495
494
489
484
478
477
473
469
459
458
452
451
440
433
432
426
404
402
402
388
387
382
377
377
373
372
363
363
362
360
358
353
341
336
331
327
323
320
311
300
294
289
288
285
271
271
269
266
261
259
254
252
251
250
249
248
244
241
231
228
228
215
211
209
205
203
196
194
192
185
181
179
179
176
171
165
157
