50
750
518
515
513
507
493
492
484
481
463
461
436
434
421
415
412
408
407
404
399
382
379
371
371
369
355
348
346
303
301
298
298
293
289
283
283
278
275
269
267
265
250
242
231
214
210
203
200
180
170
160
