100
125
99
98
98
97
96
96
96
92
92
91
91
91
91
90
89
87
87
87
86
86
85
85
84
82
81
81
80
80
79
79
79
79
76
76
76
76
75
73
71
68
67
65
65
65
60
59
57
55
54
54
53
52
52
51
51
50
50
50
49
49
49
46
44
44
42
42
42
40
39
38
38
37
35
34
33
33
32
31
30
29
28
27
26
25
24
24
24
23
20
20
20
19
18
18
16
15
15
14
13
12
