100
125
87
86
85
84
84
84
83
82
82
82
81
81
80
79
78
76
76
76
75
74
73
73
73
72
71
71
71
70
69
69
69
67
67
66
65
63
63
62
61
61
61
60
58
57
57
57
56
56
55
55
55
54
54
53
53
52
52
52
52
51
51
51
51
50
50
50
49
48
48
47
47
46
46
45
45
44
44
43
42
41
41
38
37
36
36
36
35
34
32
32
31
31
30
30
30
28
28
28
25
25
