200
150
105
105
105
105
105
103
103
103
103
103
103
102
102
102
101
101
99
99
98
98
98
98
97
97
97
96
96
95
95
94
94
94
94
93
92
92
91
91
91
91
90
90
89
87
87
87
86
86
85
85
84
84
84
83
81
81
80
80
80
79
78
78
77
77
77
77
77
76
76
75
74
74
74
73
73
72
72
71
70
69
69
68
67
66
66
66
65
65
65
64
64
64
64
63
63
63
61
61
59
59
59
58
58
58
58
57
56
56
56
55
54
54
54
54
52
52
51
51
51
50
50
50
49
48
47
47
47
47
46
45
45
45
45
44
44
44
43
43
43
41
41
41
40
40
40
40
39
39
39
37
37
37
35
35
34
34
34
33
33
32
31
31
30
30
30
29
29
29
29
28
28
28
28
27
27
27
27
27
27
26
26
24
22
21
20
20
19
19
19
18
17
17
17
17
17
16
16
16
16
15
