200
300
210
210
209
207
205
204
203
200
199
199
199
199
199
198
197
196
194
194
192
191
190
190
190
190
189
189
189
186
182
181
179
178
176
176
175
172
172
170
168
167
166
166
165
165
164
164
163
163
163
162
162
162
161
160
159
156
154
154
153
152
150
150
149
148
148
147
147
146
145
145
145
144
144
141
140
137
137
137
137
137
136
135
134
134
134
133
132
131
131
127
126
126
126
125
125
123
123
121
121
120
120
120
119
119
119
118
118
116
116
116
115
115
113
112
112
110
109
109
109
108
106
106
105
102
101
101
100
100
98
97
97
97
96
95
94
91
88
87
87
85
85
85
84
80
76
75
74
73
72
70
69
69
68
68
64
64
64
62
60
60
60
59
59
57
56
54
53
52
52
52
51
51
50
49
49
48
48
47
46
46
45
45
44
44
44
43
43
43
42
42
42
41
40
39
38
37
35
34
33
30
