100
750
599
583
580
572
569
569
566
563
563
562
560
558
553
552
551
549
548
547
545
537
536
532
531
530
528
504
474
474
467
464
459
459
452
441
431
425
424
421
420
409
409
404
400
395
395
394
393
393
388
387
386
384
375
365
359
355
353
352
349
347
342
341
338
337
336
335
295
292
290
287
280
277
270
269
268
268
265
262
259
247
239
231
226
220
216
211
206
197
195
194
192
186
186
183
178
171
166
165
163
158
