50
1000
693
688
685
684
654
651
640
634
633
606
586
584
582
557
552
541
529
523
520
505
500
498
496
469
457
454
450
448
445
445
444
440
426
426
424
392
386
359
355
353
352
347
307
306
293
270
220
214
211
210
