50
125
99
97
96
95
94
93
89
89
87
84
82
82
79
78
73
72
70
69
68
67
67
67
67
61
55
51
48
47
46
45
42
42
39
39
38
36
35
34
31
31
30
28
26
24
22
21
19
18
13
13
