500
750
600
599
597
594
594
593
590
588
588
587
587
586
585
585
584
582
581
581
581
579
577
577
575
575
575
574
574
574
573
572
571
571
570
567
567
565
564
563
562
562
561
560
560
557
557
557
556
556
555
555
554
554
553
553
553
552
548
547
546
546
543
540
540
540
539
538
537
536
535
534
534
532
531
531
528
528
526
525
525
522
521
521
519
519
519
519
518
518
517
516
516
516
516
516
514
513
513
511
510
510
510
509
509
508
507
507
507
506
506
505
505
502
501
500
500
499
499
497
497
496
495
495
494
494
493
492
492
491
490
490
490
489
489
489
488
486
484
484
482
482
482
481
479
479
476
476
476
475
475
475
474
473
472
467
466
465
463
463
462
462
461
460
459
458
458
457
455
455
455
454
452
451
450
449
449
448
448
447
446
445
445
442
441
441
441
438
436
435
435
434
434
433
433
432
432
432
430
430
430
430
428
427
427
424
424
423
423
423
421
421
420
420
419
417
416
415
415
413
412
412
411
411
409
408
407
406
406
406
405
404
403
402
402
401
401
401
399
399
399
399
399
396
395
394
394
393
391
390
390
389
389
387
386
385
385
384
383
382
381
379
375
372
369
368
367
366
366
365
364
362
362
362
361
360
360
360
359
358
358
357
355
355
355
355
354
353
353
353
352
350
350
348
346
346
345
345
343
342
340
340
340
338
337
336
336
334
331
330
330
328
327
326
326
324
323
323
322
322
321
321
321
321
315
314
314
313
312
312
311
311
310
310
307
307
306
306
304
304
304
303
303
301
300
297
295
294
293
292
292
291
290
289
289
289
288
287
285
284
283
280
280
280
279
279
278
278
277
276
276
275
274
273
271
271
271
269
268
268
267
265
264
264
263
262
261
260
258
257
257
257
254
254
254
253
253
253
252
251
250
249
245
244
244
243
243
243
243
242
242
240
238
237
237
236
235
234
233
232
232
231
230
230
229
227
226
225
225
223
222
221
220
220
219
218
214
214
213
212
210
210
209
208
207
206
206
202
200
199
199
198
198
198
198
196
196
195
193
192
191
191
188
188
188
188
187
186
185
183
183
182
181
180
180
179
178
177
177
177
176
176
175
174
174
173
172
171
169
169
167
164
162
162
161
158
158
157
157
157
155
154
