50
100
69
69
69
67
67
66
65
65
58
57
56
56
55
55
53
53
52
51
50
49
48
46
45
44
42
42
39
36
36
35
34
34
33
33
33
33
32
32
31
30
30
29
29
28
27
27
26
22
21
20
