300
1000
696
694
693
691
690
689
686
682
682
682
681
681
679
676
671
670
670
669
669
669
666
665
665
664
664
663
662
659
658
648
641
639
638
637
637
637
626
624
623
620
617
616
615
613
612
612
608
605
605
604
601
599
598
592
592
589
589
588
588
586
580
576
573
571
569
562
560
560
558
555
554
554
553
548
546
546
546
543
534
531
528
524
522
522
522
515
513
512
512
511
508
506
505
504
503
502
502
501
499
497
497
496
493
492
491
479
476
472
472
472
471
470
466
463
463
463
461
460
457
457
455
451
450
449
448
447
446
444
443
441
439
439
439
430
428
427
422
419
418
416
413
402
401
400
399
399
394
393
391
390
389
389
386
385
385
383
382
382
381
380
375
372
371
368
367
366
366
365
365
364
362
361
359
358
358
358
356
355
354
351
351
349
348
338
335
334
334
329
328
325
322
321
319
317
315
313
312
312
312
310
307
306
303
302
298
292
290
288
285
283
281
281
278
272
269
269
266
264
263
260
260
256
255
255
254
252
251
250
249
248
247
244
244
242
235
234
234
232
231
225
222
221
219
219
214
212
212
211
208
207
205
204
200
195
188
186
184
184
182
180
178
173
172
169
165
164
160
158
152
152
149
148
146
146
146
144
143
143
139
138
137
137
137
132
132
124
124
123
122
121
118
117
115
114
109
108
108
106
105
103
