50
1000
698
683
660
653
646
644
643
643
638
631
623
605
597
595
588
561
526
520
518
516
503
499
459
455
453
450
443
417
417
414
391
378
375
369
365
363
350
336
331
329
320
319
311
295
292
288
274
258
257
202
