300
1000
697
696
694
692
692
691
688
688
686
686
684
684
680
679
679
679
678
678
677
676
672
672
671
670
664
664
663
663
658
653
653
651
645
645
641
640
635
631
631
631
630
628
624
624
624
623
623
620
617
615
612
608
604
601
598
598
595
589
584
583
578
573
570
566
562
562
556
553
552
552
552
551
550
549
548
546
542
541
536
536
534
534
530
528
526
526
524
523
522
521
520
514
512
509
508
508
501
499
493
491
488
487
486
485
484
482
478
476
476
476
474
471
467
466
465
463
460
458
457
456
450
450
448
447
447
447
447
443
441
439
435
434
433
432
430
428
425
421
420
418
417
415
410
407
406
405
403
399
399
396
396
395
393
393
393
390
388
388
384
380
379
378
373
370
367
367
367
365
363
363
363
360
360
359
358
356
355
350
346
343
343
343
342
341
340
340
338
338
337
335
332
332
330
329
328
327
325
317
312
310
310
310
308
308
308
306
305
305
301
295
292
288
286
285
284
284
283
281
279
278
278
276
275
274
273
273
271
270
269
268
266
265
265
263
261
260
259
258
257
254
250
250
246
246
245
237
236
235
233
231
226
225
221
220
214
213
205
204
202
201
199
197
193
193
192
191
189
189
186
176
169
168
167
167
164
164
163
161
156
154
154
153
152
150
149
146
144
142
138
137
131
130
126
125
120
119
115
114
101
100
