50
120
84
83
83
83
81
81
81
78
75
74
71
71
70
70
70
69
68
66
62
62
61
60
59
56
56
55
55
55
54
54
52
51
46
44
43
43
41
41
39
38
37
37
36
35
35
34
28
27
27
24
