200
500
399
396
396
395
392
389
385
385
384
383
382
381
377
376
376
375
374
374
373
372
369
367
367
366
364
362
361
361
360
357
356
355
354
353
353
350
349
349
348
348
347
347
346
344
344
342
342
340
338
338
333
332
331
328
328
328
327
321
320
320
315
313
312
312
308
308
307
305
304
304
303
302
300
298
297
296
295
294
294
294
289
288
286
283
283
283
278
277
276
270
269
266
263
262
260
260
256
256
255
255
253
253
252
251
249
249
248
247
246
244
243
243
243
243
242
241
241
240
238
236
234
233
233
232
231
229
228
228
227
225
221
220
214
213
212
210
207
207
207
205
205
204
202
201
199
197
196
196
190
189
188
188
187
185
185
185
185
184
181
180
176
175
174
173
170
168
162
162
160
157
155
152
151
149
149
144
143
142
139
139
136
135
134
134
133
131
127
122
121
117
115
114
110
108
104
103
102
101
101
100
