200
750
525
524
521
519
517
513
512
507
507
505
504
502
501
501
499
497
497
495
494
488
486
486
485
484
484
476
474
472
471
469
466
464
463
462
460
459
456
454
454
452
451
450
450
446
446
445
444
444
443
441
440
440
435
430
429
428
425
425
424
424
423
408
407
406
406
403
402
399
399
397
395
395
395
393
392
390
390
390
389
388
388
387
386
382
382
382
377
375
372
367
366
366
363
358
353
351
350
342
340
336
336
333
327
325
324
324
322
322
321
319
316
314
313
312
310
308
302
301
299
298
297
296
296
293
289
287
286
285
285
284
283
283
281
281
281
280
278
278
276
276
276
268
267
266
264
264
258
256
256
255
255
255
253
253
250
245
245
243
243
240
237
234
231
229
224
223
223
222
221
217
217
212
212
207
204
203
202
202
201
200
195
192
191
190
189
180
177
175
174
174
174
170
166
166
165
162
158
157
156
154
