200
125
100
100
99
99
99
99
98
97
96
96
95
93
92
92
92
91
91
91
91
91
90
90
90
89
88
88
87
87
86
86
86
86
85
85
84
84
82
82
81
80
80
79
78
77
77
77
76
76
76
75
75
74
73
73
72
72
72
72
71
71
71
69
69
69
69
68
67
66
66
66
66
66
65
65
64
64
64
64
63
63
62
62
61
59
59
57
56
56
56
56
56
56
56
55
55
54
54
54
54
52
52
51
51
50
50
50
50
49
49
49
49
49
48
48
47
47
47
46
45
45
44
44
44
44
42
41
41
41
40
39
38
38
38
38
37
37
37
37
36
36
35
35
34
34
34
34
33
33
32
32
31
31
30
30
30
29
29
29
28
28
28
28
28
27
26
26
26
25
24
24
24
24
23
23
22
22
21
21
21
21
20
20
20
19
19
18
17
17
16
15
15
15
15
14
14
13
13
13
12
12
