400
750
525
525
524
522
521
519
519
518
518
515
512
512
511
510
509
509
509
508
508
508
507
506
505
503
502
501
500
499
498
498
497
496
496
496
495
494
493
493
490
489
489
489
488
486
483
483
481
480
480
478
478
478
478
477
475
475
475
471
468
468
467
465
465
464
461
461
459
459
458
457
452
452
450
448
447
444
441
440
439
437
437
437
436
436
435
433
432
431
431
429
428
428
428
427
427
427
425
425
425
424
423
422
422
422
422
422
422
421
420
420
419
418
417
415
413
413
409
409
407
407
406
404
402
402
401
399
399
398
397
397
397
397
396
395
395
393
393
392
390
389
388
387
387
386
386
386
385
384
383
383
382
382
380
378
378
375
375
373
373
367
367
367
365
365
363
363
361
360
359
359
358
356
355
355
355
355
353
352
352
351
351
351
350
350
349
349
349
347
347
347
347
346
346
346
345
343
342
342
341
340
339
339
337
334
333
333
332
331
331
329
328
328
326
324
323
321
321
320
319
318
318
318
318
317
316
316
315
315
315
314
313
311
309
308
308
308
307
306
302
300
300
298
297
297
296
295
294
292
291
291
290
290
288
286
286
284
283
281
281
280
277
277
276
276
275
275
275
274
274
274
272
270
268
268
267
266
263
262
262
261
257
254
254
254
252
252
251
250
249
249
249
249
248
246
245
245
245
244
244
242
242
240
240
239
238
237
236
235
235
233
232
232
230
229
229
228
227
227
227
226
224
222
220
220
220
218
217
217
216
216
215
214
210
208
208
207
206
206
205
203
202
202
202
201
199
199
196
195
195
194
193
193
192
190
189
188
188
186
185
184
184
184
181
180
180
179
177
177
177
176
176
176
176
175
174
174
173
173
173
173
172
172
171
170
170
169
168
167
167
163
162
161
160
159
155
154
153
153
152
150
