300
400
280
280
280
280
278
277
276
276
276
276
275
274
273
272
271
271
270
269
268
267
264
262
262
261
261
261
258
258
257
256
255
253
253
253
252
252
251
250
250
249
249
249
247
246
245
245
244
243
243
242
242
241
240
237
237
236
235
235
233
233
233
232
229
229
229
228
228
227
223
221
219
218
217
217
217
217
216
216
215
213
213
209
209
209
208
207
207
206
205
204
203
203
203
203
202
202
201
201
201
198
198
196
195
195
194
194
193
193
192
191
191
191
189
189
189
187
187
186
186
185
184
184
182
181
181
180
180
179
178
178
177
174
172
171
170
170
170
168
168
166
166
165
164
163
161
160
160
160
160
160
158
157
155
154
154
153
152
151
150
149
148
146
146
143
142
142
141
141
140
140
139
139
139
138
137
136
136
134
134
134
134
134
134
132
132
130
130
130
129
129
127
125
124
123
122
121
119
119
119
119
116
115
114
113
113
111
111
110
110
108
107
105
105
104
104
104
103
102
102
101
101
101
100
100
99
99
99
98
98
97
97
97
96
96
94
93
93
92
92
92
91
91
90
89
89
88
88
88
87
86
86
86
85
84
83
83
83
83
83
82
78
77
76
74
73
72
72
72
70
66
66
66
65
63
62
62
60
60
59
59
57
56
56
54
52
52
51
51
50
49
47
46
46
45
44
44
42
42
40
40
