50
750
503
501
492
484
480
474
471
471
468
466
455
440
403
394
391
386
379
373
367
364
356
356
353
341
338
337
320
319
317
294
294
285
278
277
267
258
257
252
246
222
216
203
201
200
189
167
164
161
156
152
