50
1000
769
748
748
739
736
708
693
647
637
628
615
602
583
577
573
551
548
546
523
522
518
503
500
476
470
429
425
420
414
412
398
394
390
384
379
379
372
366
361
352
330
301
285
284
266
255
225
219
206
201
