100
200
136
135
135
134
133
133
132
130
130
129
128
126
126
125
124
122
122
121
118
117
115
115
115
114
114
112
111
111
111
110
109
109
108
108
107
103
101
98
96
95
95
94
93
91
90
89
88
86
86
82
80
80
79
79
78
74
73
73
72
72
71
71
68
67
65
63
63
61
61
59
58
57
57
53
53
52
52
49
47
46
46
46
45
44
43
43
42
40
39
32
30
27
25
24
24
23
22
22
20
20
