100
400
317
315
312
309
307
304
304
304
301
298
298
289
289
286
283
278
276
273
273
266
263
260
259
259
257
253
243
241
235
232
232
230
227
225
224
217
217
211
208
207
205
204
201
196
192
185
184
184
182
177
176
175
165
159
157
157
156
156
156
155
153
152
151
149
148
146
144
144
143
143
142
142
134
133
132
129
127
115
113
109
97
96
89
78
77
75
74
73
71
67
66
62
57
49
46
46
46
45
42
41
