300
1000
800
800
797
795
791
788
787
782
779
771
771
770
770
767
765
765
764
762
762
762
757
756
755
755
738
738
737
736
736
736
735
732
731
728
721
719
719
718
716
715
715
712
707
705
702
700
699
692
688
688
682
677
674
672
670
669
667
667
663
661
657
654
653
653
651
650
649
649
645
643
643
643
641
641
636
634
633
631
628
624
624
623
622
621
621
620
619
617
617
617
615
615
612
611
608
607
606
604
603
600
598
598
596
595
590
590
589
586
578
576
575
574
567
564
558
552
547
546
545
544
541
534
530
528
527
523
523
521
519
514
512
507
500
499
492
489
488
484
482
479
477
477
473
472
472
468
465
464
462
461
458
456
455
452
451
448
446
445
443
442
441
441
437
432
424
422
422
421
420
411
409
406
405
403
400
400
397
396
393
393
388
380
379
377
371
369
368
366
366
365
365
359
356
355
355
351
342
341
339
338
337
334
328
327
325
325
322
321
320
316
315
313
312
311
307
304
302
299
296
295
294
294
294
291
291
290
286
282
277
273
267
266
265
257
256
256
252
250
249
245
244
242
242
240
237
234
234
233
233
231
230
222
222
217
214
213
211
211
208
206
204
203
201
201
200
198
195
192
191
186
182
175
172
171
171
164
164
163
162
160
155
155
152
140
139
138
137
136
128
127
127
123
121
120
119
117
114
111
102
102
