50
120
96
96
94
90
90
90
89
88
86
86
85
81
75
75
72
70
64
63
62
59
59
59
56
53
53
46
45
43
43
41
40
39
39
37
34
34
32
31
29
24
24
24
24
21
21
19
19
17
16
15
