100
400
320
318
318
314
313
311
310
307
302
299
297
293
292
290
287
285
283
280
272
270
264
261
259
252
250
248
247
246
245
243
241
240
237
236
235
234
233
231
228
225
225
218
215
215
213
207
205
204
204
196
195
191
191
190
188
186
182
181
180
173
170
169
161
161
160
159
159
156
156
156
154
153
150
149
146
139
135
134
129
128
126
124
123
116
113
108
107
105
102
101
98
98
97
97
97
93
91
88
84
80
