100
400
318
317
316
315
311
306
305
301
298
295
291
290
288
284
282
282
275
275
275
273
273
271
270
268
267
263
257
245
241
241
240
240
239
237
235
233
233
230
230
224
220
213
210
209
208
206
205
203
197
190
180
179
177
169
168
168
168
167
166
165
165
162
160
155
154
145
139
138
138
137
124
120
116
113
112
112
108
106
106
99
98
98
97
96
93
90
83
81
78
76
74
73
66
65
61
60
53
49
48
42
