400
750
598
597
596
596
595
592
591
591
590
590
589
586
584
582
582
579
579
577
577
577
573
573
572
572
572
571
568
568
567
564
562
561
561
560
560
559
558
557
555
553
553
552
551
551
551
550
550
550
549
549
548
547
547
540
537
536
535
535
534
533
533
533
533
530
529
529
525
524
522
522
520
518
517
517
517
516
516
515
515
514
514
513
511
511
509
509
508
507
504
504
501
501
499
497
495
493
493
493
493
491
491
490
485
484
483
481
479
476
475
475
473
473
472
471
471
468
467
467
467
467
466
466
466
463
462
460
459
458
457
457
456
452
452
451
448
446
444
444
442
440
437
436
435
434
434
430
429
429
426
426
425
423
419
419
418
415
415
415
415
414
413
412
410
409
407
406
405
405
402
401
399
397
396
394
393
393
391
391
385
385
384
383
383
383
382
381
379
378
378
378
377
377
376
375
375
374
372
371
371
371
367
365
363
363
363
362
362
359
358
357
355
353
351
349
349
346
346
345
345
344
342
341
340
339
338
336
336
334
333
332
331
331
330
329
329
326
326
325
322
321
319
318
317
317
316
316
316
314
314
311
310
310
309
308
306
306
306
305
303
302
299
297
297
296
295
290
289
285
284
283
281
281
279
276
275
275
274
272
272
271
270
269
269
268
268
267
265
264
263
262
262
261
260
259
258
257
256
255
254
253
252
248
248
248
247
247
245
245
243
242
241
240
239
239
239
238
238
237
235
235
235
234
234
233
232
230
229
227
227
226
225
224
222
222
221
221
220
218
216
214
208
208
206
206
205
205
204
204
202
201
201
200
198
197
196
196
195
192
192
192
192
191
190
190
189
189
188
187
187
183
181
178
178
176
175
175
174
170
169
169
169
168
164
164
161
161
161
160
159
158
158
156
155
155
154
151
151
151
151
150
