50
750
525
525
517
503
499
496
491
488
486
484
479
472
437
420
420
417
410
409
384
382
358
348
332
330
323
312
308
306
284
283
275
261
257
245
232
227
212
212
194
192
182
178
177
171
156
136
132
109
107
77
