400
300
210
210
210
209
209
209
208
208
208
207
207
206
205
204
204
204
202
201
201
201
201
200
200
199
197
197
196
195
195
195
194
194
194
193
192
192
191
190
190
190
190
189
189
189
188
188
188
188
187
187
187
187
186
186
186
185
185
185
184
184
182
182
182
182
182
181
180
179
178
178
178
178
178
178
178
177
177
177
176
175
175
174
174
173
173
172
172
172
172
171
171
171
170
170
170
169
169
168
167
167
166
166
165
165
165
165
164
164
163
163
161
161
160
160
160
159
158
158
158
157
156
156
156
156
155
155
154
154
153
152
152
151
151
151
150
149
148
148
148
147
147
146
146
145
145
145
145
145
144
144
144
143
143
142
142
142
142
142
141
141
141
140
139
139
139
139
138
136
135
134
134
134
134
133
132
132
132
131
129
129
129
128
127
127
126
126
126
126
124
124
124
123
123
123
122
122
122
122
121
121
121
121
120
120
118
118
118
118
117
117
117
116
112
112
111
111
110
110
109
109
109
108
108
108
108
107
106
106
106
106
106
105
105
104
104
103
101
101
100
100
99
97
97
97
96
96
95
95
94
93
93
92
92
92
90
89
89
88
87
87
86
86
86
86
86
86
85
85
84
84
84
84
83
82
82
81
81
81
80
80
79
78
77
77
77
77
76
76
76
76
76
76
76
75
74
74
74
73
72
72
72
72
71
71
71
70
69
69
69
69
69
68
67
67
67
67
66
65
65
65
65
64
64
63
63
62
62
61
61
61
60
60
60
59
58
58
57
57
57
57
55
55
55
54
54
54
54
53
53
53
52
52
51
50
50
49
49
48
48
48
47
47
47
47
47
46
46
45
45
45
45
43
42
42
41
40
40
39
39
38
38
38
37
36
36
35
35
35
35
33
33
33
32
32
32
31
31
31
30
30
