200
500
400
398
398
397
397
396
396
394
392
392
390
388
386
384
382
381
381
380
376
368
366
365
364
364
362
362
360
360
359
358
357
356
355
354
354
353
352
351
345
344
343
336
335
335
333
332
332
329
325
324
324
323
323
321
320
318
316
316
316
315
312
311
310
310
308
307
307
306
305
303
303
303
301
299
299
298
288
287
287
286
285
281
281
277
275
275
274
274
273
273
273
272
272
270
269
267
263
259
259
259
255
255
253
252
245
244
243
241
239
239
238
237
236
234
228
228
228
227
225
224
223
220
220
218
216
215
213
210
210
209
207
207
200
198
189
187
184
183
183
183
179
178
177
176
174
173
171
169
168
164
162
161
159
158
153
149
148
144
143
143
142
140
133
132
127
127
124
122
117
115
107
104
104
101
101
101
98
97
96
93
89
88
87
86
86
83
80
79
79
75
74
74
73
73
73
69
63
61
53
50
