100
120
96
95
93
91
91
90
89
88
88
87
86
83
82
82
81
81
81
79
78
78
78
77
77
76
76
76
75
73
72
71
69
69
69
67
66
64
64
63
62
62
61
61
61
60
58
58
57
56
54
54
53
53
53
51
48
47
47
46
46
46
45
45
45
44
44
43
42
41
40
39
37
37
33
32
31
31
30
29
29
29
28
28
27
27
26
26
26
26
25
24
21
20
18
18
17
17
17
13
13
12
