100
750
592
589
586
586
582
573
557
553
551
541
540
530
529
526
525
524
504
499
496
488
478
466
463
460
454
454
450
448
446
446
442
441
437
431
425
424
423
421
417
408
407
395
391
384
382
375
375
371
350
347
343
343
335
334
334
334
317
312
309
303
301
298
297
296
289
287
286
284
281
280
279
279
276
274
268
268
263
263
259
255
248
247
231
213
204
202
199
192
184
176
176
175
173
171
171
170
166
162
156
153
