100
500
399
398
397
388
387
386
379
369
368
368
366
360
358
358
350
348
343
336
327
323
321
318
313
308
303
303
302
298
296
296
293
291
289
287
285
284
283
276
268
267
266
262
253
252
251
249
246
241
238
230
229
229
227
223
217
217
217
207
207
201
200
197
196
194
184
184
182
181
180
178
175
173
164
164
160
159
153
152
147
145
144
143
135
134
132
131
129
126
125
124
122
122
118
116
109
107
105
103
103
100
