50
125
82
79
78
77
76
75
74
74
73
73
68
68
67
67
65
65
63
63
63
61
58
57
57
56
54
54
53
53
51
51
49
48
47
44
39
38
36
36
35
33
33
33
32
32
32
30
27
27
26
25
