500
400
320
319
319
319
317
317
317
317
316
315
315
315
315
314
314
312
312
311
311
311
310
309
309
309
309
309
308
308
308
307
307
306
306
305
305
304
304
303
303
302
301
301
301
300
300
299
299
299
298
297
297
296
296
295
295
293
293
293
292
292
289
288
287
286
286
285
284
284
284
283
282
282
282
280
280
280
279
279
278
277
276
275
275
275
274
274
274
274
273
273
272
272
271
270
269
269
269
268
266
266
265
265
263
262
262
261
261
260
258
258
258
258
257
257
256
256
256
255
253
253
252
251
251
250
248
248
248
248
246
246
245
244
243
243
243
240
240
240
240
239
239
238
238
237
237
236
235
234
234
232
232
230
230
229
228
226
226
225
225
225
225
224
224
223
222
222
222
220
220
220
220
219
218
218
217
217
216
215
215
214
213
212
211
210
209
209
209
208
208
207
207
207
206
206
205
205
203
203
202
201
200
200
200
198
197
197
196
194
193
192
192
190
190
189
188
188
187
187
186
185
185
183
182
181
179
179
178
177
177
176
176
175
175
175
175
174
174
174
173
173
172
171
171
170
169
169
169
169
168
167
166
166
166
165
165
165
165
164
164
164
163
163
163
163
162
162
162
161
161
160
159
159
158
157
157
157
155
155
155
155
154
154
152
151
149
148
148
148
148
147
147
147
146
146
145
145
144
143
143
142
140
140
140
139
139
139
138
138
137
137
137
136
136
135
134
134
134
133
133
133
133
133
132
132
132
131
131
131
131
130
130
130
130
129
129
129
128
128
128
128
127
127
127
126
125
125
125
125
125
125
124
123
122
122
122
121
120
120
120
120
118
118
115
115
114
114
113
112
112
112
111
111
109
109
109
107
107
106
106
105
104
103
103
103
102
102
101
101
101
100
100
100
99
99
98
98
97
97
96
96
95
95
95
95
94
94
93
93
93
92
92
92
92
91
90
88
86
85
84
84
84
84
84
82
82
82
81
80
80
79
79
78
78
77
75
74
74
74
72
72
68
68
68
68
67
67
67
67
66
65
64
64
63
63
62
62
62
62
61
61
61
58
58
57
57
57
56
55
54
54
53
53
52
52
52
52
51
51
50
50
50
50
49
49
49
49
48
48
48
46
45
45
45
44
43
42
42
40
40
40
