200
500
400
400
398
396
396
389
389
388
387
386
382
379
378
377
375
373
371
371
370
370
366
365
364
362
360
360
360
358
358
355
353
353
351
350
349
347
346
345
345
343
343
342
342
338
332
332
331
329
328
327
326
326
324
322
322
321
321
316
315
312
311
310
307
303
303
302
302
299
298
298
297
296
294
294
293
293
293
293
288
288
287
285
283
281
280
279
273
271
270
270
268
268
268
267
266
265
265
264
264
263
260
258
257
257
257
255
255
253
252
249
248
245
244
240
240
240
239
239
238
236
236
233
232
230
230
230
229
228
223
223
221
221
219
219
218
218
214
210
204
204
202
201
200
200
196
196
191
190
187
186
186
183
181
179
177
175
175
172
169
169
169
166
164
161
159
158
157
150
148
146
146
143
141
141
140
139
138
137
132
132
126
126
123
120
119
117
116
115
113
111
111
110
108
106
105
104
102
102
100
100
