200
500
348
348
348
346
345
343
343
342
342
338
336
336
331
331
330
330
328
326
325
323
318
318
315
314
314
313
312
312
311
311
311
311
311
309
306
305
305
302
298
298
297
296
295
294
294
293
292
291
291
291
289
289
289
288
286
285
285
281
281
279
276
275
274
273
271
269
264
263
262
262
261
257
257
255
252
251
251
249
248
247
244
243
241
235
234
233
233
231
226
220
218
218
216
215
215
215
213
211
207
205
205
204
203
203
202
202
201
200
198
198
197
195
195
194
194
193
190
190
190
190
189
186
184
183
183
183
182
181
180
179
178
178
177
176
175
175
174
173
171
170
170
170
169
168
167
167
164
164
163
162
160
159
158
155
154
154
154
152
151
151
151
150
147
145
143
140
138
138
138
138
136
135
135
133
133
132
130
130
129
129
126
125
123
120
119
115
114
111
110
110
108
107
107
107
106
105
103
103
101
101
