300
1000
799
798
798
791
790
789
789
789
786
784
775
767
767
765
761
753
746
741
740
739
738
731
730
728
725
723
722
721
720
719
717
709
707
705
702
696
695
689
684
683
675
672
671
671
670
668
667
665
661
661
660
658
657
636
635
631
630
629
626
618
615
614
614
613
613
607
599
599
594
594
594
591
590
590
583
580
579
579
574
574
573
569
569
565
565
563
562
558
558
557
556
555
554
553
551
550
549
547
543
542
541
535
530
530
530
527
526
524
515
513
505
505
504
502
500
498
495
495
493
492
490
490
487
487
487
486
485
484
483
478
475
472
464
462
459
453
451
441
440
439
437
437
436
433
431
430
429
424
418
410
410
409
407
406
405
405
402
402
397
391
389
385
384
382
380
373
371
368
365
365
364
360
359
359
358
355
355
355
355
344
343
343
341
336
335
335
335
326
325
325
321
318
318
316
315
314
311
310
310
308
307
302
300
300
299
297
296
295
294
292
292
290
290
288
288
284
284
284
277
276
272
271
267
263
260
258
256
253
252
251
249
246
246
246
246
245
245
243
243
243
242
242
240
239
235
229
229
228
222
220
220
219
219
218
218
215
214
212
200
194
193
193
192
186
184
182
180
179
175
173
171
168
162
161
159
158
156
148
146
146
146
143
140
139
139
137
136
135
131
121
118
117
116
116
113
109
108
106
103
103
