750
1000
798
796
795
795
794
794
794
792
791
790
789
788
787
787
787
787
783
782
782
782
781
780
779
777
775
774
773
773
771
770
769
768
768
767
766
765
764
760
759
758
758
757
757
756
754
752
751
749
747
747
747
746
745
745
744
744
741
741
739
738
737
737
736
736
734
733
732
732
730
730
729
727
726
726
725
725
724
724
723
721
721
720
720
719
719
714
714
713
709
709
709
709
708
708
706
706
705
703
700
699
698
697
697
697
696
696
696
695
692
691
691
689
689
686
685
685
685
684
683
682
681
679
679
676
675
674
674
674
672
671
671
671
671
670
668
667
667
666
666
665
663
663
659
658
658
656
656
655
655
654
654
653
652
651
651
650
650
649
648
648
644
644
644
644
643
640
640
639
639
638
637
637
636
636
635
634
633
633
633
632
632
631
629
627
627
627
627
626
625
623
623
622
622
620
617
616
616
613
613
613
612
612
611
611
610
609
608
608
607
607
607
607
606
604
604
604
604
603
602
600
599
597
597
597
596
596
595
595
594
594
593
593
592
592
591
591
591
590
590
588
587
586
584
584
582
582
581
581
580
580
579
577
577
576
576
576
574
574
574
574
573
573
571
570
567
567
564
562
559
558
554
552
551
550
549
548
547
547
543
542
541
541
540
538
537
537
534
528
528
526
525
525
525
524
523
523
522
521
520
519
518
516
515
515
514
514
513
513
512
510
510
509
506
505
505
504
504
504
503
502
500
498
497
496
495
495
495
495
495
494
494
493
492
489
489
488
487
485
483
483
482
482
481
481
476
476
475
475
474
473
472
471
470
470
469
468
468
467
466
465
464
464
464
464
463
461
460
460
458
458
457
456
455
454
454
453
452
451
451
451
450
449
448
448
447
445
444
443
440
440
439
438
435
433
433
431
428
426
424
421
421
420
420
419
419
417
415
415
413
413
411
410
409
409
408
408
407
407
405
405
403
403
402
401
399
398
398
398
396
396
395
395
395
393
392
392
391
391
390
389
389
387
387
384
383
382
382
382
377
377
376
376
375
373
373
372
371
371
368
367
365
363
363
362
362
362
361
359
358
358
357
355
353
352
351
351
351
350
349
349
348
346
346
345
345
345
342
342
341
340
340
339
337
335
334
332
332
330
327
327
326
326
325
325
324
323
320
316
313
312
310
310
308
308
308
308
307
306
304
304
304
304
302
301
300
300
299
298
296
295
292
291
291
290
290
289
287
287
287
282
281
278
273
273
272
271
271
270
269
267
267
266
266
266
263
263
260
260
260
258
257
256
254
254
252
251
251
251
250
249
246
244
244
242
241
241
240
240
238
237
236
236
236
235
235
234
234
234
233
232
231
231
230
229
229
229
228
228
226
225
224
224
224
223
221
221
220
220
218
217
217
216
214
214
213
213
212
211
210
209
209
209
206
205
203
200
199
199
199
198
196
196
195
194
193
193
191
190
190
190
188
186
185
185
184
183
182
182
181
181
180
179
179
179
178
177
177
175
174
174
173
173
172
172
172
169
168
167
166
165
165
164
163
163
162
161
159
158
156
155
155
155
150
150
150
150
150
148
148
145
144
143
143
143
140
139
139
137
137
136
136
136
136
136
135
135
135
135
135
135
134
134
133
132
132
131
130
130
129
128
128
125
124
123
122
122
122
120
119
118
117
117
116
114
113
112
110
109
108
107
106
106
105
105
104
103
102
101
100
100
