50
120
94
89
87
84
83
80
78
76
76
75
71
70
69
69
67
62
60
60
55
54
54
53
52
50
50
50
50
49
45
45
44
44
42
41
41
41
40
37
36
34
28
27
27
26
25
24
22
17
15
12
