750
750
525
525
524
523
523
521
521
521
521
520
519
518
518
517
517
515
515
514
514
513
513
513
513
512
511
511
509
508
508
508
507
507
506
505
505
504
504
504
502
502
501
501
501
499
499
499
499
499
499
498
498
497
496
496
496
496
496
495
494
493
493
493
492
492
491
491
491
491
490
490
490
490
490
489
489
489
488
488
488
488
487
486
486
486
485
484
484
483
483
483
482
482
482
481
480
479
478
478
478
477
477
476
476
476
475
473
473
472
472
472
472
471
470
470
470
470
470
470
470
469
469
468
468
468
466
466
465
465
464
464
464
464
463
463
463
463
462
461
461
460
460
460
459
458
458
458
457
456
456
456
454
454
454
453
453
451
450
450
448
448
448
447
447
447
447
446
446
446
444
442
441
441
440
439
439
437
437
436
436
435
435
435
435
433
432
432
432
431
431
430
429
428
427
427
426
425
425
425
424
424
423
422
422
422
421
420
420
420
419
419
418
418
416
416
416
416
415
415
414
414
414
414
414
414
413
413
412
410
410
409
409
408
408
408
407
407
406
406
405
405
404
401
401
400
400
400
399
399
399
399
399
399
398
397
397
397
397
396
395
394
394
393
393
392
392
392
392
392
392
392
392
392
391
391
388
388
388
387
387
387
386
386
385
385
384
384
384
383
383
382
381
381
381
380
379
379
379
379
378
378
377
376
376
376
375
374
374
374
373
373
373
373
372
372
372
371
370
369
368
367
366
366
366
365
363
363
362
361
361
361
361
360
359
359
358
358
357
356
356
356
355
355
354
354
354
352
352
352
352
351
351
350
349
348
348
347
347
347
347
347
347
346
346
345
345
345
344
344
344
343
343
342
342
342
341
341
340
340
339
339
338
336
336
335
335
334
333
333
333
331
331
331
331
330
330
329
329
329
328
328
328
326
326
326
326
326
325
325
325
324
324
324
323
322
322
321
321
321
321
320
319
318
318
318
317
317
316
316
315
315
315
315
315
315
314
313
312
311
311
311
311
310
310
308
308
308
308
307
307
307
307
307
306
304
304
304
303
303
303
300
300
299
299
299
298
297
296
295
295
294
294
294
293
293
293
292
292
292
291
289
288
286
286
285
285
285
285
283
283
282
281
281
281
280
279
278
277
276
274
274
273
273
273
272
272
271
271
269
268
267
267
267
266
266
266
266
266
265
265
265
264
264
264
263
263
262
261
260
260
259
259
257
257
257
257
256
256
256
256
256
256
255
255
254
254
254
254
254
253
252
251
251
250
250
250
250
250
249
248
247
247
247
247
246
246
245
245
245
245
245
244
244
244
244
244
242
242
241
239
239
239
238
238
238
238
236
235
235
233
232
232
232
231
230
230
228
226
226
225
225
225
224
224
222
222
221
221
220
219
219
219
219
219
218
217
217
216
216
215
215
214
214
213
212
212
211
211
211
210
208
207
205
204
204
204
203
202
202
200
199
198
197
196
196
196
196
195
195
195
195
194
193
193
193
193
193
192
192
191
191
190
190
189
187
187
187
186
186
186
185
185
185
184
184
183
182
182
182
182
181
181
180
178
178
177
176
176
176
174
174
173
173
173
173
173
173
172
172
172
172
171
171
171
171
171
170
170
170
168
168
167
166
164
163
163
163
163
162
162
160
160
160
159
159
159
158
158
158
157
157
157
157
156
156
155
155
155
154
153
153
153
153
152
152
151
151
151
150
150
150
