50
750
500
491
490
490
489
466
457
444
436
396
392
390
388
379
375
373
357
350
340
325
320
315
307
301
293
290
289
257
239
237
231
224
216
201
194
193
179
178
173
164
163
158
140
139
137
107
101
93
82
76
