400
500
399
398
398
398
397
394
394
394
392
392
392
392
391
390
390
389
389
388
387
385
383
383
381
379
377
377
375
375
372
369
367
366
365
363
362
361
361
360
359
359
359
359
359
357
357
356
356
355
355
354
353
353
353
351
351
350
350
346
345
343
342
340
339
339
339
339
333
332
332
331
331
331
330
328
325
325
325
324
324
323
323
323
321
320
319
318
316
315
314
314
312
312
311
310
309
308
308
307
306
306
305
304
303
302
301
300
298
295
293
292
290
290
290
288
287
286
285
285
285
284
284
283
282
282
279
276
275
273
273
272
272
271
271
270
270
270
269
269
265
263
263
263
262
262
261
261
260
260
259
259
258
258
257
257
257
256
255
255
255
254
254
249
248
247
247
246
246
246
244
239
239
239
238
238
237
236
234
234
233
231
230
227
227
227
225
224
223
220
219
219
219
219
218
216
215
213
211
210
209
209
208
208
208
207
207
206
206
206
203
203
202
202
201
200
200
199
198
198
198
197
196
194
193
192
192
192
190
189
188
188
188
187
187
187
185
184
184
184
183
182
182
182
182
181
181
181
181
180
179
178
178
176
176
176
175
174
173
171
167
167
167
166
165
165
163
162
162
162
161
160
159
156
156
155
154
152
150
149
149
148
147
147
146
144
143
141
141
140
140
140
138
137
137
134
133
132
131
130
129
129
129
128
127
127
125
124
124
123
123
121
119
118
115
113
113
112
112
108
108
108
107
107
107
107
107
106
104
103
102
102
100
100
99
99
96
95
95
95
94
93
93
92
91
88
88
87
87
86
86
85
85
84
84
84
84
81
81
81
80
80
79
79
78
77
76
76
75
75
75
75
74
74
74
72
72
71
70
70
70
68
68
66
66
66
63
62
61
61
60
58
55
55
54
54
54
53
53
51
51
50
