100
300
208
203
202
197
196
195
194
192
190
188
187
187
182
182
180
180
176
172
172
171
171
168
168
167
166
166
165
161
160
159
155
154
153
149
149
148
147
146
145
144
143
139
138
136
135
134
134
134
133
133
133
131
131
130
129
128
126
126
120
120
119
118
115
113
113
108
107
106
100
98
97
94
90
88
88
84
83
79
79
77
76
76
75
74
71
71
70
69
64
62
59
50
46
37
36
33
32
32
30
30
