200
500
349
349
347
347
344
344
344
341
341
340
336
336
333
332
330
328
327
326
325
322
321
320
314
308
308
307
306
304
299
298
298
295
294
294
293
293
291
291
289
289
286
285
281
279
277
277
276
274
272
272
272
269
269
269
267
265
263
263
258
258
258
257
256
256
255
250
248
247
247
239
236
236
236
236
233
231
227
224
224
223
223
223
220
220
216
215
210
210
206
206
205
205
204
203
201
200
200
200
199
198
197
195
192
192
186
184
183
181
180
179
178
177
174
172
171
171
170
170
170
170
168
166
165
164
164
164
158
156
156
152
152
151
151
150
150
150
145
144
144
142
142
139
132
132
131
131
130
129
125
122
122
122
121
120
118
118
116
113
112
111
111
111
110
110
109
108
107
107
101
100
99
99
99
98
97
97
95
93
92
90
85
84
81
80
79
77
69
69
69
68
66
66
64
64
63
59
56
56
53
50
