100
500
350
347
347
337
336
336
332
327
324
324
320
319
319
316
303
296
294
290
280
280
270
268
265
265
262
257
255
255
254
254
253
247
243
236
236
232
231
228
224
223
223
217
216
213
213
213
211
211
211
211
210
208
206
204
203
202
200
199
198
197
196
190
187
187
185
180
175
173
173
170
169
164
162
157
154
151
150
145
143
139
134
133
133
130
125
124
122
122
122
120
115
111
109
109
108
107
107
106
104
101
