100
300
235
233
231
230
229
229
228
227
227
224
221
221
219
211
210
208
198
196
190
189
188
186
185
183
182
181
180
177
176
174
174
174
173
172
170
169
168
163
162
160
151
151
150
150
148
148
141
140
140
132
130
130
129
129
124
123
122
121
121
114
110
109
108
107
107
106
104
98
96
95
93
92
89
88
87
86
86
85
76
73
72
70
67
67
65
63
62
58
58
55
55
53
52
44
42
37
32
32
31
30
