300
150
105
105
105
105
105
105
105
103
103
103
102
102
102
102
101
101
101
101
101
100
100
100
99
98
98
98
98
97
97
96
95
95
95
95
93
93
93
92
92
92
91
91
91
91
90
90
90
90
90
90
90
90
89
89
89
89
89
88
88
87
87
86
86
86
83
83
83
82
82
82
81
81
81
81
80
80
80
80
80
80
79
79
79
78
78
78
78
77
76
76
76
75
74
74
74
74
74
73
72
71
71
71
70
70
69
69
69
69
68
68
68
68
68
67
67
67
66
66
66
66
66
65
65
65
64
64
64
64
63
63
62
61
61
61
61
60
60
59
59
59
58
58
58
58
58
58
58
58
56
56
56
56
55
55
54
54
54
54
53
53
52
52
52
50
50
50
50
50
50
50
50
50
49
49
49
49
48
48
48
48
46
46
45
45
44
44
44
44
43
43
43
43
43
42
41
41
41
40
40
40
39
39
39
38
38
38
38
38
38
38
37
37
37
37
37
37
36
36
36
36
35
34
34
34
34
34
34
33
33
33
33
32
32
32
32
31
31
31
31
31
31
31
31
30
30
30
29
29
29
28
28
28
28
28
27
27
27
27
27
26
26
26
26
24
24
24
24
24
24
24
23
23
23
23
22
22
21
21
20
20
20
19
19
18
18
18
18
18
17
17
17
17
17
16
16
16
15
15
15
15
