50
120
95
95
94
92
92
91
90
88
87
85
85
82
79
77
77
76
72
70
68
66
66
65
64
64
62
60
58
56
56
52
52
50
49
43
43
38
36
35
35
34
33
33
31
31
30
30
28
27
27
26
