400
200
160
160
159
159
159
159
158
158
157
157
157
156
156
156
155
155
155
155
154
154
154
153
153
153
153
153
152
152
151
150
150
149
149
149
149
148
148
148
148
147
146
146
145
145
145
145
142
142
142
142
142
142
141
141
140
140
140
140
140
140
139
139
139
139
138
138
138
137
137
137
136
136
136
135
135
135
135
134
134
134
134
134
134
133
133
133
132
132
132
131
131
131
130
130
130
129
129
129
129
127
127
127
127
127
125
125
125
125
124
124
124
123
123
123
123
123
123
122
122
122
121
121
121
121
121
121
121
120
120
119
119
118
117
117
116
115
115
115
114
114
112
112
111
111
111
110
110
109
109
109
108
108
107
107
107
107
107
106
105
104
104
104
104
103
103
103
102
102
102
102
101
101
101
100
100
99
98
97
97
97
96
96
96
96
95
95
95
95
95
94
94
94
93
93
93
93
93
93
92
92
92
91
91
90
90
89
89
88
88
87
87
87
87
87
86
86
85
85
84
84
83
83
83
83
83
82
82
82
81
80
80
80
80
79
79
78
78
78
78
78
78
76
75
75
74
74
73
73
72
72
70
70
69
69
69
68
68
68
68
68
67
67
67
67
67
67
66
66
66
65
64
64
63
62
62
62
62
62
61
61
60
59
59
59
59
59
58
58
58
57
56
56
56
56
55
55
55
55
54
53
52
52
51
51
51
51
51
51
51
49
49
49
49
48
48
47
47
47
47
47
46
45
45
44
44
43
43
42
42
42
42
42
41
41
41
41
41
40
40
40
40
40
39
39
38
37
37
37
37
37
37
36
35
35
34
34
34
33
32
32
32
31
31
30
30
30
30
30
30
30
29
29
29
28
28
28
28
28
28
27
27
26
25
25
25
24
23
23
23
23
22
22
21
21
21
21
21
21
20
20
