300
300
210
210
209
209
208
207
205
204
203
203
203
203
202
202
202
201
200
199
198
198
196
196
195
195
195
195
195
194
194
194
193
193
193
193
192
191
190
190
189
188
188
188
186
185
185
184
183
181
180
178
177
176
176
176
175
175
174
174
173
171
171
171
171
171
170
170
169
169
168
167
167
166
166
165
165
165
165
165
165
164
164
163
163
163
162
162
161
161
160
159
159
158
158
157
157
157
156
156
155
154
153
153
152
152
151
150
149
149
149
149
148
147
147
147
146
146
146
146
144
144
144
143
143
143
142
140
139
138
138
135
132
132
132
130
130
130
129
129
129
128
127
126
126
126
125
124
124
123
123
123
122
121
121
121
120
120
119
119
119
118
118
118
118
117
117
117
116
115
115
115
113
113
113
112
112
111
111
110
110
109
109
109
109
109
106
106
106
106
105
105
104
103
103
102
102
101
101
101
100
96
96
96
95
95
94
91
90
89
89
89
89
87
86
84
84
83
83
82
82
82
82
81
81
80
79
78
77
77
75
75
75
75
75
75
72
72
72
71
71
70
70
69
69
68
67
67
67
67
66
66
65
65
64
64
64
62
61
60
60
60
59
56
56
54
54
54
52
51
51
51
51
50
49
49
48
45
45
44
44
43
42
42
42
42
42
40
40
38
37
36
36
35
35
34
33
33
33
32
32
32
