100
750
520
520
517
516
507
506
501
500
489
489
486
486
484
479
478
478
477
473
471
456
450
448
439
424
424
414
410
404
403
402
402
402
400
395
388
387
380
377
362
361
361
359
356
351
346
344
344
334
333
333
329
327
320
310
307
303
302
299
299
298
295
293
290
277
259
259
258
257
254
251
250
243
238
227
214
210
209
208
201
193
187
185
182
180
178
175
174
171
171
170
168
166
163
163
162
160
159
152
151
151
