100
750
600
598
598
596
586
583
572
569
561
545
543
543
537
526
525
522
520
519
510
506
499
484
468
459
458
447
445
436
432
430
428
425
425
424
417
414
413
399
397
390
388
381
365
364
358
354
351
351
350
350
349
345
344
340
334
334
333
330
328
323
314
308
308
302
290
290
290
284
282
271
267
264
260
260
258
250
247
246
242
240
239
233
226
218
216
206
205
205
202
202
200
195
178
166
161
158
157
153
151
151
