50
150
105
104
102
100
96
94
88
87
87
87
85
85
84
83
82
82
79
78
78
74
71
69
68
68
66
64
63
63
62
61
58
57
57
56
55
54
53
52
51
48
47
42
39
38
38
36
34
33
32
31
