100
400
320
316
314
314
312
310
309
307
305
303
300
297
294
290
289
280
279
275
271
270
269
268
267
265
262
261
256
255
254
251
244
243
243
242
239
238
231
225
218
217
209
207
206
200
194
194
193
184
183
180
173
171
168
166
162
152
150
148
147
147
147
139
139
136
130
129
124
123
111
109
105
99
97
96
96
96
96
93
91
90
90
89
89
89
87
85
85
81
68
63
63
62
54
50
50
50
46
45
44
42
