50
100
79
79
77
77
74
72
71
71
71
70
68
67
66
66
65
64
56
54
53
51
50
50
49
48
48
44
43
41
40
39
38
37
36
36
36
36
35
33
31
30
29
27
25
24
22
19
16
16
15
12
