50
1000
695
691
682
673
672
670
651
624
621
620
598
589
574
569
560
555
554
520
502
501
498
480
477
414
413
409
406
402
402
379
378
370
330
328
322
302
229
228
222
207
206
193
183
175
157
147
145
132
125
114
