300
400
274
274
273
273
273
272
271
270
269
268
268
268
267
267
266
266
266
265
265
263
263
262
262
260
258
258
258
258
258
257
257
257
256
256
256
255
255
253
253
252
252
252
252
250
249
249
249
249
248
247
245
245
244
242
241
241
240
240
239
239
239
238
236
236
236
236
236
236
235
235
234
234
234
233
231
231
230
229
229
229
228
227
225
225
224
224
224
223
223
223
222
222
221
221
220
219
218
217
217
217
217
216
215
213
213
212
211
210
209
208
208
207
207
207
207
206
206
206
205
205
204
203
203
203
203
203
200
200
200
199
198
197
197
195
194
194
193
189
188
188
187
185
185
184
183
183
182
181
180
180
178
178
175
175
174
173
173
172
172
171
170
170
170
170
169
169
169
169
168
168
167
166
165
165
164
164
164
164
162
161
160
160
160
158
158
158
157
157
156
156
155
154
152
151
150
149
149
149
148
148
148
147
146
145
144
143
142
142
139
139
139
139
138
138
138
136
136
135
133
132
132
132
131
129
129
128
128
128
128
128
126
126
125
122
122
122
121
121
120
119
119
118
117
117
117
116
115
115
115
114
113
113
112
112
111
109
109
109
109
108
108
108
106
106
106
103
102
101
100
98
98
97
96
96
94
94
92
91
90
90
90
90
88
88
87
87
86
85
85
84
84
84
84
83
82
82
81
81
81
80
