200
125
99
99
98
98
98
97
97
97
97
96
96
96
96
96
96
95
95
95
95
94
94
93
93
93
92
92
92
91
91
91
90
90
89
89
89
89
89
89
88
88
87
87
86
86
85
82
81
81
81
81
80
79
79
79
77
77
76
76
76
76
75
75
75
74
74
73
73
73
72
72
71
71
71
70
69
68
68
68
66
66
66
66
62
62
62
61
61
59
59
58
58
57
57
56
56
56
55
55
55
54
54
53
53
53
53
53
53
52
52
51
51
51
51
50
50
50
49
49
49
49
48
48
47
46
46
46
46
45
45
44
44
44
44
44
43
41
41
40
40
40
39
39
38
38
38
37
37
37
37
36
35
34
34
33
33
33
32
32
31
31
30
28
27
27
27
27
26
26
25
24
24
24
23
23
23
22
22
21
21
20
19
19
18
18
18
18
17
17
17
16
16
16
15
15
13
13
13
12
12
12
