750
400
320
320
320
319
318
318
318
318
318
317
316
316
315
315
315
315
315
314
314
313
313
313
313
313
313
312
312
312
311
311
310
310
310
310
310
309
308
308
308
307
306
306
305
304
304
304
303
303
302
302
299
299
299
299
298
297
297
297
297
296
296
296
296
296
296
295
295
295
294
294
294
294
294
294
292
292
291
291
290
289
289
289
289
289
288
288
288
287
287
286
286
285
285
285
284
284
284
284
283
283
283
282
282
282
282
281
281
281
281
280
280
280
279
278
278
278
277
277
277
277
276
275
275
275
275
274
274
274
273
272
272
272
271
271
270
270
269
269
269
268
268
267
267
266
266
265
265
265
265
264
264
264
264
264
264
263
263
262
262
262
262
261
261
261
261
260
259
257
257
257
256
256
256
255
255
254
254
254
253
253
253
253
252
252
252
252
252
252
252
252
251
251
251
251
250
249
249
248
248
248
247
247
247
247
247
246
246
245
245
244
244
243
243
242
242
241
241
240
240
240
240
240
240
240
239
239
239
238
238
238
238
238
238
238
237
237
237
237
236
236
236
235
235
235
235
234
234
233
233
232
231
230
230
229
229
228
228
228
228
228
227
226
226
225
225
225
224
223
223
223
223
222
222
222
221
221
221
221
220
220
220
219
219
218
218
217
217
217
217
217
216
216
215
215
215
214
214
214
214
213
212
212
212
212
212
211
210
209
209
209
207
207
206
206
205
205
205
205
205
204
202
202
202
200
200
200
199
199
199
198
198
198
197
197
197
196
196
196
196
195
195
195
194
194
193
192
191
190
190
189
189
189
189
188
188
186
186
186
185
185
185
185
185
185
184
183
182
182
182
181
181
181
180
180
180
180
180
179
179
179
179
178
178
178
178
178
178
177
176
175
175
174
172
171
171
171
171
170
170
170
170
170
170
169
169
169
168
168
168
168
167
167
167
167
167
166
166
165
165
165
165
164
163
163
163
162
162
162
161
161
160
160
160
160
160
159
159
159
158
158
158
158
158
157
157
157
157
156
156
155
155
155
155
154
154
154
153
153
153
152
152
151
151
150
150
149
149
148
148
148
147
147
147
146
146
146
146
146
145
145
145
145
144
144
144
142
141
141
141
140
140
140
140
139
138
136
136
136
135
134
134
133
133
133
132
132
132
131
131
131
131
131
131
130
129
129
129
128
128
128
128
127
124
124
124
123
123
122
122
121
121
121
120
120
120
120
120
120
119
119
119
119
117
117
117
117
117
116
116
116
115
115
114
114
114
113
113
113
113
113
112
112
112
112
112
112
111
111
110
109
109
109
108
108
108
108
107
107
105
104
104
103
103
102
102
101
100
100
100
99
99
99
99
98
97
97
96
96
96
96
95
95
95
95
94
94
93
92
92
92
91
91
91
90
90
89
89
89
89
89
89
88
88
88
87
86
86
86
86
86
85
85
85
85
85
84
83
83
83
82
82
82
82
81
81
81
81
81
81
81
80
80
80
79
78
78
78
78
77
77
77
75
74
74
74
74
74
73
72
72
71
71
71
70
70
68
67
66
66
65
65
64
64
64
63
63
62
62
62
61
61
60
60
59
59
58
57
57
57
57
57
56
56
56
55
54
54
53
53
53
53
52
52
52
52
51
51
51
50
50
49
49
48
48
47
47
47
47
47
46
46
46
46
46
46
46
46
45
45
44
44
44
43
43
43
42
42
40
40
40
