50
150
105
105
102
98
97
95
95
93
88
81
79
77
77
74
73
72
67
67
67
66
66
62
59
58
54
50
50
49
49
48
48
48
42
40
40
39
39
38
36
33
30
28
27
24
23
20
17
16
16
15
