100
200
138
138
138
137
137
137
135
134
133
132
131
128
126
126
124
123
123
122
121
119
118
118
117
117
116
114
114
113
112
112
112
110
106
103
102
100
97
96
95
94
94
94
94
91
91
91
90
88
88
87
87
87
85
83
83
82
81
80
80
76
76
75
73
71
70
70
69
68
68
67
56
56
56
56
51
50
50
49
48
47
46
45
43
43
42
40
38
37
37
36
34
33
30
29
27
25
25
24
22
20
