100
300
206
205
205
205
201
199
192
192
186
185
181
176
175
173
172
170
167
164
163
161
158
155
153
152
152
151
150
148
147
146
145
145
143
143
139
138
136
136
136
133
132
131
126
125
124
123
120
117
116
114
113
113
112
112
112
106
106
101
100
99
98
95
91
89
81
81
78
77
77
76
75
75
75
74
69
69
68
66
64
63
63
63
59
59
56
53
52
51
51
48
47
44
42
40
40
40
39
39
38
30
