400
1000
798
798
798
797
794
794
793
791
791
789
789
788
784
783
782
782
780
779
778
775
774
774
774
773
773
772
771
768
768
768
767
763
762
761
756
752
751
747
740
737
736
735
735
735
734
732
732
731
731
730
727
726
724
714
713
710
709
709
708
703
703
699
698
697
696
688
687
687
683
681
678
678
676
675
674
673
672
670
668
668
667
666
663
662
659
653
653
652
651
649
648
645
644
641
638
636
635
634
633
632
627
625
620
619
617
610
607
604
602
601
600
598
598
597
596
593
593
592
592
590
588
588
587
587
586
586
585
584
582
582
579
575
574
573
566
566
565
561
561
560
559
557
557
555
554
552
548
548
546
546
546
545
541
539
539
538
534
534
533
533
533
533
523
521
520
520
516
513
511
509
508
508
506
506
503
499
497
496
488
487
482
481
480
479
477
477
476
468
467
463
463
461
459
458
458
456
451
450
448
448
447
445
445
443
443
441
439
438
436
435
435
435
434
432
432
430
423
419
417
417
417
415
415
412
411
411
410
409
408
407
407
403
402
400
396
393
390
382
372
372
372
371
370
369
368
368
367
367
366
366
363
363
362
361
360
360
357
357
357
357
356
353
352
350
339
336
332
330
330
329
329
326
326
323
319
315
313
310
309
306
302
300
299
299
293
291
287
286
285
282
278
278
277
276
275
270
269
268
268
264
262
262
259
252
251
250
246
246
246
246
245
245
244
241
239
238
237
237
235
233
232
231
229
227
226
225
223
220
220
219
219
218
216
216
214
212
211
210
209
208
207
204
202
201
199
199
196
195
189
182
179
179
179
175
173
172
171
170
169
169
167
166
165
163
163
162
156
154
151
150
149
149
149
148
147
144
144
142
141
140
136
136
135
133
133
129
129
126
121
119
119
119
115
115
115
114
114
106
104
104
