750
500
400
400
399
399
399
398
398
398
398
398
398
397
397
396
395
395
395
395
393
393
392
391
391
391
390
390
390
389
388
388
387
387
386
385
385
384
384
384
384
383
383
383
383
383
383
383
382
381
381
381
380
380
380
379
379
378
378
378
378
378
377
377
377
377
377
376
376
376
375
373
373
372
371
370
370
370
370
370
370
369
369
369
369
368
367
367
367
367
366
365
365
365
365
364
364
363
363
362
362
362
362
362
361
361
361
360
360
360
359
359
359
358
358
358
357
357
357
356
356
356
356
354
353
352
352
351
351
350
350
350
350
350
349
348
348
348
347
347
347
345
344
344
343
343
342
342
342
342
340
339
339
338
336
336
336
336
335
333
331
330
330
330
330
329
328
326
325
325
324
324
324
324
323
322
321
321
320
320
320
320
320
319
319
318
318
318
318
317
315
315
314
313
313
313
313
310
310
310
309
308
308
308
306
306
305
305
305
305
304
304
303
303
302
302
302
302
302
302
301
301
301
301
301
300
300
300
300
299
299
298
298
297
297
296
295
295
294
294
294
293
292
291
291
290
290
290
290
290
288
288
287
286
285
285
284
284
282
282
282
282
281
281
280
280
280
280
279
278
278
277
277
275
275
274
274
274
273
273
273
273
272
272
272
271
271
271
270
269
269
268
268
267
267
267
266
266
266
266
265
264
262
261
260
260
258
258
258
257
256
256
256
255
255
255
254
254
254
254
253
253
253
253
252
252
252
252
252
251
251
251
250
250
248
247
247
247
246
246
244
244
243
243
242
242
242
241
240
240
240
239
239
239
237
237
237
237
236
236
235
235
234
234
234
234
234
234
234
233
233
233
232
232
231
231
231
231
229
229
227
227
227
225
224
224
224
223
223
223
222
222
221
220
220
220
219
218
217
217
216
216
216
216
216
216
216
215
215
215
215
215
214
212
211
210
209
209
209
208
208
206
206
206
205
205
205
204
204
203
203
203
203
203
202
201
201
201
201
201
200
200
200
200
199
199
199
198
198
197
197
197
195
194
194
193
193
193
193
193
192
192
192
189
188
188
187
187
187
186
186
186
185
184
183
183
182
181
181
181
180
180
179
179
179
178
178
177
177
176
175
175
175
174
174
172
172
172
172
171
170
170
170
170
169
169
169
168
167
165
164
164
164
164
163
162
162
162
162
162
160
160
160
159
159
159
158
158
158
158
158
157
156
156
155
155
155
154
153
153
153
153
152
152
152
151
150
150
150
148
147
146
145
145
145
145
145
144
144
143
143
143
143
142
142
141
139
139
139
139
139
138
138
138
137
137
137
137
136
136
135
135
135
135
135
134
134
134
133
132
132
132
131
130
129
129
127
127
127
126
124
123
123
122
121
121
120
120
120
118
118
117
117
117
117
117
116
116
116
115
115
115
115
115
115
114
114
114
113
112
112
111
111
111
110
110
109
108
108
107
107
107
107
106
105
105
104
104
104
103
103
101
101
99
99
99
98
97
97
97
96
96
95
95
95
95
94
94
94
94
93
92
91
91
91
90
89
89
89
88
88
88
87
86
86
86
85
85
84
84
84
84
83
83
82
82
81
81
80
80
79
79
78
78
78
77
76
76
73
73
73
72
71
70
70
70
69
68
67
66
66
66
65
64
63
63
63
63
63
63
62
60
58
57
57
57
57
56
56
55
54
54
53
53
53
52
52
51
51
51
51
50
