100
500
350
350
350
349
341
340
339
335
326
324
321
320
311
305
304
304
303
301
298
297
296
293
288
286
286
285
285
283
281
278
275
271
271
266
264
256
252
251
250
249
244
234
232
229
224
223
219
219
217
214
213
209
208
208
197
195
189
189
183
182
179
178
177
175
170
168
165
160
160
159
152
149
148
143
139
129
129
121
121
120
119
115
113
112
111
109
100
95
86
79
78
78
70
67
67
62
58
55
52
50
