300
300
240
240
238
238
238
237
237
236
236
234
234
232
231
231
230
230
229
229
229
228
227
227
227
226
226
226
226
226
224
223
223
222
220
218
217
217
216
216
216
215
215
214
213
211
211
211
211
209
207
206
206
206
205
205
205
205
204
204
202
201
201
201
201
201
199
198
198
198
198
198
197
196
196
195
194
193
193
192
191
190
190
189
189
188
187
186
185
185
184
183
182
182
182
182
182
181
180
180
179
178
178
178
177
177
177
177
177
177
176
174
173
173
172
172
171
170
170
169
168
168
167
166
166
165
165
164
164
163
162
162
162
162
161
160
159
159
159
158
158
158
158
158
157
157
156
155
155
154
154
153
153
153
152
151
150
149
148
148
148
147
147
146
146
146
145
144
144
144
144
144
143
141
140
138
137
137
137
137
136
134
134
133
130
130
129
128
128
128
127
127
126
125
122
121
121
119
118
118
117
116
116
115
115
115
114
114
114
112
112
111
111
110
109
109
109
108
108
107
106
105
105
104
104
104
104
103
103
102
102
101
101
99
98
98
97
97
97
97
96
96
96
96
95
95
95
94
94
94
94
93
93
93
92
91
91
88
88
88
88
86
86
86
85
84
83
82
82
81
80
79
79
78
75
73
73
73
72
72
72
72
71
70
70
70
69
68
68
67
67
67
65
65
65
65
64
64
63
61
60
60
