300
300
210
210
209
209
209
209
209
206
203
203
202
202
201
200
200
199
199
198
197
197
197
196
195
195
194
193
193
192
191
191
190
190
190
190
188
188
187
187
187
187
186
186
185
185
185
184
183
183
182
182
181
181
180
179
176
175
175
175
174
174
174
173
173
173
173
172
171
171
170
170
170
170
169
168
168
168
167
166
166
165
164
164
163
163
161
158
157
156
156
156
155
155
154
154
154
153
152
151
151
150
150
150
148
148
147
147
146
145
145
144
143
142
141
140
139
139
138
138
137
137
136
136
135
135
134
134
134
132
132
131
131
131
131
131
130
129
129
128
127
127
124
124
124
123
123
123
121
121
121
121
120
120
118
117
117
116
115
115
115
113
113
112
112
111
111
111
110
109
109
109
109
108
107
107
106
105
104
104
103
101
101
100
97
97
97
95
95
94
93
92
92
90
90
90
89
89
87
87
87
86
85
85
85
85
84
83
83
83
83
82
82
82
79
79
79
78
77
77
77
76
75
74
73
72
72
72
71
71
70
67
67
66
66
65
65
65
65
64
64
63
63
63
63
62
62
62
61
61
61
60
60
60
59
57
57
57
53
53
53
52
51
50
50
49
49
49
48
48
47
46
46
46
46
46
45
45
44
44
43
42
42
41
41
40
39
39
38
38
37
37
37
36
34
33
32
32
32
31
31
30
