300
1000
799
798
794
790
787
786
785
784
783
782
780
779
773
772
772
770
762
758
755
754
754
752
750
750
747
746
744
735
734
731
730
730
724
724
722
722
721
720
720
718
718
715
714
713
710
709
708
707
706
700
697
695
695
693
690
686
682
670
668
664
664
663
660
660
658
657
654
653
650
648
647
647
645
643
639
639
638
634
633
629
626
626
625
625
624
620
618
617
617
614
612
611
607
606
603
601
597
595
594
589
588
586
584
582
582
582
580
567
563
562
558
555
554
549
542
539
537
535
534
534
528
524
522
522
521
514
513
512
511
509
504
500
500
494
492
491
491
485
483
482
482
481
481
478
478
477
475
468
466
461
460
457
455
454
449
449
446
444
439
437
431
428
428
428
422
411
404
401
399
394
394
390
390
387
375
374
374
374
372
369
367
367
366
361
356
355
354
354
344
340
338
337
334
334
332
331
327
326
318
314
313
312
312
312
309
309
306
305
300
291
291
291
290
288
286
286
286
279
278
277
276
269
269
266
263
261
254
248
247
245
242
241
239
238
238
234
234
233
232
229
228
217
213
211
209
209
209
207
206
206
205
201
194
193
193
191
189
189
187
187
185
182
178
166
156
155
149
149
147
147
145
145
144
143
142
140
139
134
131
128
127
127
126
125
125
123
115
114
113
110
108
108
106
105
105
104
104
103
103
103
