100
75
60
60
60
59
59
58
58
57
57
57
57
57
56
55
54
53
53
53
52
52
52
52
52
52
51
51
50
50
50
47
46
46
46
45
45
45
45
45
43
43
42
41
41
41
40
40
39
39
39
38
36
35
35
35
35
33
33
33
32
31
31
31
30
30
29
29
29
29
28
28
27
27
27
27
26
26
26
25
24
24
24
23
23
23
22
22
20
20
19
18
18
17
16
16
16
16
15
15
15
15
