50
125
87
85
85
84
84
84
83
82
81
81
75
74
71
70
65
65
64
61
59
59
58
51
51
51
48
46
45
43
43
42
40
38
36
36
35
30
29
28
25
22
20
18
18
17
16
16
15
15
15
12
