300
400
279
279
278
276
274
273
271
271
269
269
267
264
264
264
264
262
262
260
259
258
258
258
257
257
257
256
256
255
254
254
254
253
253
251
250
249
248
248
248
247
245
245
244
241
240
239
238
236
235
234
234
234
234
231
229
228
227
227
225
222
222
221
219
218
218
216
215
215
213
213
212
212
212
212
211
210
209
209
209
207
207
204
204
204
204
203
202
199
198
198
198
197
196
195
195
194
194
191
191
191
191
190
188
187
184
182
182
181
181
180
180
180
179
179
179
179
178
178
176
175
174
174
174
173
173
173
171
170
169
162
161
160
160
159
157
156
156
155
154
153
153
151
150
149
149
148
148
148
147
147
145
145
145
142
141
141
140
140
138
138
136
135
135
134
134
133
133
133
132
129
129
129
128
128
127
127
127
126
126
125
125
123
123
123
122
122
121
120
120
119
118
118
117
117
116
115
115
114
114
114
113
113
112
112
112
112
111
111
111
110
109
109
108
106
106
106
105
104
104
103
103
103
102
102
102
101
100
100
99
99
99
98
97
96
96
95
94
93
92
91
90
89
87
87
85
85
84
84
81
80
79
77
76
76
72
71
71
70
70
67
67
67
66
66
66
65
64
63
62
62
60
59
58
57
57
55
55
55
54
53
53
53
52
51
50
50
48
48
47
47
47
45
45
43
43
42
42
42
41
40
