100
120
84
81
81
81
81
80
80
80
80
79
79
78
78
78
77
77
77
76
76
76
76
75
74
73
73
73
72
72
71
71
70
70
68
66
64
63
63
61
61
60
60
60
58
58
58
57
57
57
57
57
56
55
53
53
52
52
50
50
49
49
49
49
49
47
46
46
46
46
45
43
42
42
42
41
40
40
39
39
39
38
37
36
36
36
36
36
35
34
33
33
33
32
31
30
29
28
28
27
25
25
