750
1000
799
799
799
799
798
798
798
793
792
792
792
791
790
788
787
786
786
786
786
785
785
783
783
783
781
781
781
779
778
776
774
773
773
772
770
769
769
768
767
765
765
764
764
763
762
762
762
762
761
761
760
760
758
758
757
757
756
756
755
755
752
750
748
747
745
745
744
743
742
742
741
740
740
739
739
738
738
737
737
737
737
732
731
731
731
730
729
726
725
724
722
721
720
719
718
718
718
715
714
712
712
711
711
711
710
710
709
708
706
706
704
702
699
699
698
695
695
694
693
693
692
692
692
691
691
689
687
687
687
687
684
684
683
683
682
681
681
681
681
679
675
675
675
673
672
672
672
666
666
665
665
665
664
664
663
663
663
662
662
662
661
660
660
659
658
656
656
652
651
650
649
648
648
647
645
644
644
643
643
642
641
636
635
635
635
634
631
631
628
628
628
627
624
623
623
621
621
621
620
619
618
616
616
614
614
613
613
611
610
609
609
607
607
607
607
606
605
604
603
601
601
596
596
594
594
594
593
593
592
591
591
590
590
587
587
586
585
584
584
583
583
583
583
583
581
580
579
575
575
575
575
574
574
573
573
573
572
572
572
572
571
570
569
569
569
568
567
567
567
566
565
565
564
563
563
562
561
561
560
560
558
557
556
555
554
554
554
551
551
550
550
549
546
545
545
545
544
541
541
541
536
536
534
533
532
528
528
527
527
526
526
526
525
524
524
523
520
520
519
516
516
514
514
513
511
511
510
510
509
505
504
504
503
501
501
501
500
500
500
499
497
497
494
494
494
491
490
489
488
487
487
486
485
483
483
482
482
481
478
477
474
472
470
470
470
469
467
466
466
464
463
460
460
459
458
457
457
457
456
455
455
454
454
454
454
453
451
451
451
450
446
446
446
445
444
442
438
438
438
438
437
437
436
436
434
434
433
431
431
430
429
428
428
427
427
426
424
423
422
421
419
419
418
418
416
413
413
413
412
412
411
411
410
409
409
409
409
407
406
405
404
404
404
404
402
402
402
399
399
397
392
392
392
391
391
391
389
388
388
384
383
382
380
379
379
378
378
376
376
373
373
372
371
368
367
363
363
362
361
360
359
358
357
357
357
355
353
353
352
352
349
348
346
345
343
341
340
340
340
339
338
337
335
335
334
334
333
333
332
332
329
328
327
326
326
326
324
324
324
323
321
320
320
320
319
319
316
316
315
315
313
313
312
310
308
307
306
306
305
304
304
303
303
303
303
302
302
301
300
299
291
291
291
291
289
288
286
284
283
282
282
281
280
280
279
278
278
278
277
277
276
276
275
275
271
271
271
270
270
269
267
267
267
266
266
264
264
262
261
260
260
260
259
259
257
257
255
255
253
252
248
247
245
245
244
244
242
241
239
239
237
235
235
234
234
232
232
232
230
230
229
228
225
224
223
219
219
218
218
217
217
216
216
215
215
214
212
211
210
208
207
205
205
203
202
202
200
200
200
198
196
195
194
191
191
191
191
191
191
190
190
189
189
188
186
186
186
185
181
181
181
181
180
178
178
177
175
173
172
172
170
170
169
167
166
166
166
165
164
163
163
162
161
161
160
160
159
157
156
155
155
154
154
153
152
152
150
149
149
147
145
145
144
144
144
143
142
142
141
139
139
139
137
137
136
135
133
132
131
128
126
124
124
124
122
120
118
117
116
115
114
112
111
110
110
108
106
106
104
101
