400
400
320
320
320
319
319
318
317
316
316
315
315
315
315
314
314
313
313
312
312
312
311
310
310
310
309
309
309
309
308
307
307
307
306
304
303
303
303
303
302
302
302
301
299
296
295
295
294
293
291
289
289
288
288
288
288
287
285
285
285
284
284
283
282
282
281
280
279
279
279
279
276
276
275
274
273
273
273
272
272
271
270
269
269
269
269
268
268
266
266
266
264
264
264
262
262
262
262
261
261
260
259
257
256
255
255
255
254
254
253
252
252
252
252
252
251
251
249
249
249
248
247
247
247
246
246
246
245
244
242
240
240
240
238
238
238
235
235
234
234
234
234
232
232
231
231
230
228
227
226
226
226
224
224
224
224
223
222
222
222
221
221
221
219
219
218
218
217
216
216
214
212
212
212
212
211
211
210
210
210
208
208
208
207
207
206
206
205
205
204
203
203
203
202
202
202
200
200
198
198
198
198
197
197
196
193
193
193
192
191
191
190
189
189
189
187
187
187
186
186
185
185
185
184
184
184
183
181
180
180
178
178
178
178
177
177
177
176
176
176
175
173
173
172
172
172
171
171
171
168
168
168
167
167
167
166
166
165
163
163
163
162
162
161
161
161
160
160
160
159
159
158
157
157
157
157
156
156
155
155
155
155
154
153
152
152
152
152
151
151
148
148
148
147
146
145
145
144
142
142
141
141
141
140
139
139
139
138
137
136
136
136
135
135
134
134
133
132
132
131
131
131
130
130
126
124
123
122
122
122
122
121
121
120
118
118
117
117
117
115
115
113
113
113
113
111
111
110
109
109
109
109
108
108
107
107
106
106
105
105
104
104
102
102
101
101
100
100
100
99
98
98
98
97
97
97
96
96
96
95
95
95
94
94
93
92
92
91
89
88
87
87
86
85
85
85
84
82
81
80
80
