50
750
513
506
495
493
489
473
471
455
445
442
415
406
396
393
391
376
365
365
360
358
357
354
353
341
339
335
332
315
311
305
300
296
294
285
281
261
258
247
216
212
203
194
189
186
181
177
174
173
167
161
