200
120
84
84
83
83
83
83
83
82
82
82
81
80
80
80
80
78
77
76
76
74
74
74
74
73
72
72
71
70
70
70
70
70
70
68
67
67
67
66
66
66
65
65
65
65
63
63
62
62
62
62
61
61
61
61
61
60
60
60
60
60
60
59
59
59
59
58
58
58
58
58
57
57
57
56
56
56
56
55
53
53
53
52
52
52
52
52
52
52
51
51
50
50
49
49
49
49
49
48
48
48
48
48
47
47
47
47
47
47
46
46
46
44
44
44
44
43
43
42
42
42
41
41
41
40
40
40
40
40
40
39
38
38
38
37
37
37
35
35
35
34
34
33
33
33
32
32
32
32
31
31
30
30
30
29
28
28
28
28
28
27
27
26
26
25
25
25
25
25
24
24
24
23
22
22
22
21
21
21
20
20
20
20
20
19
19
19
19
19
18
18
18
17
17
16
16
16
16
15
15
13
