50
125
100
100
100
98
95
94
93
92
89
89
88
87
85
84
83
82
81
80
79
78
70
67
66
63
63
61
58
58
55
55
54
53
52
51
50
47
44
44
36
35
35
34
32
32
31
29
28
28
27
26
