50
120
96
94
93
93
93
89
88
87
86
86
84
84
83
82
81
76
75
72
70
68
67
67
63
62
60
59
56
52
50
43
43
40
38
37
36
36
31
30
28
27
26
25
24
20
20
19
17
14
14
13
