200
150
120
120
119
119
118
118
117
116
115
114
113
112
112
112
112
112
112
112
112
112
112
112
111
111
111
110
110
109
109
108
108
108
108
107
107
107
106
106
106
105
105
105
104
104
104
104
103
103
102
102
102
101
100
98
98
97
97
96
96
96
95
95
95
94
94
94
93
92
92
90
90
88
88
85
85
85
85
85
84
83
83
83
83
81
81
81
80
79
79
79
79
79
78
78
77
76
76
75
75
73
73
73
73
72
71
71
70
69
69
69
69
68
68
67
67
66
65
64
64
64
62
61
61
60
59
57
56
56
56
55
55
55
55
55
53
51
50
49
49
48
48
46
46
45
44
44
43
43
43
42
41
41
40
40
38
38
37
36
36
36
36
35
35
35
34
34
34
33
33
33
32
32
31
31
31
30
29
29
29
28
28
28
27
26
25
24
24
22
21
20
20
20
20
19
19
18
17
16
15
15
