%YAML 1.1
%TAG !u! tag:unity3d.com,2011:
--- !u!1045 &1
EditorBuildSettings:
  m_ObjectHideFlags: 0
  serializedVersion: 2
  m_Scenes:
  - enabled: 1
    path: Assets/Scenes/MainScene.unity
    guid: 8b3049393ae91cc499fe0c26dd3d9baa
  - enabled: 1
    path: Assets/Scenes/GameScene.unity
    guid: 9fc0d4010bbf28b4594072e72b8655ab
  - enabled: 1
    path: Assets/Scenes/WinScene.unity
    guid: 0e9f4380c95da884298932f2eed71c09
  - enabled: 1
    path: Assets/Scenes/SecondScene.unity
    guid: 09d24e2372c1e8c46a8f2dcc5a6f7508
  - enabled: 1
    path: Assets/Scenes/LoseScene.unity
    guid: b7835500b0c4a92449525cad6d19234f
  m_configObjects: {}
