%YAML 1.1
%TAG !u! tag:unity3d.com,2011:
--- !u!114 &11400000
MonoBehaviour:
  m_ObjectHideFlags: 0
  m_CorrespondingSourceObject: {fileID: 0}
  m_PrefabInstance: {fileID: 0}
  m_PrefabAsset: {fileID: 0}
  m_GameObject: {fileID: 0}
  m_Enabled: 1
  m_EditorHideFlags: 0
  m_Script: {fileID: 11500000, guid: 14027e5feb6cb314784e1721416ee417, type: 3}
  m_Name: IceBullet
  m_EditorClassIdentifier: 
  bulletSpeed: 5
  bulletDamage: 2.5
  bullet: {fileID: 21300000, guid: 235e6e82f247e8f46bf151a546f5d98d, type: 3}
