%YAML 1.1
%TAG !u! tag:unity3d.com,2011:
--- !u!74 &7400000
AnimationClip:
  m_ObjectHideFlags: 0
  m_CorrespondingSourceObject: {fileID: 0}
  m_PrefabInstance: {fileID: 0}
  m_PrefabAsset: {fileID: 0}
  m_Name: Explosion
  serializedVersion: 6
  m_Legacy: 0
  m_Compressed: 0
  m_UseHighQualityCurve: 1
  m_RotationCurves: []
  m_CompressedRotationCurves: []
  m_EulerCurves: []
  m_PositionCurves: []
  m_ScaleCurves: []
  m_FloatCurves: []
  m_PPtrCurves:
  - curve:
    - time: 0
      value: {fileID: 879730398, guid: cc03b6cf932dbd3419117458e23610e1, type: 3}
    - time: 0.041666668
      value: {fileID: -2105448359, guid: cc03b6cf932dbd3419117458e23610e1, type: 3}
    - time: 0.083333336
      value: {fileID: -1559894758, guid: cc03b6cf932dbd3419117458e23610e1, type: 3}
    - time: 0.125
      value: {fileID: 641886802, guid: cc03b6cf932dbd3419117458e23610e1, type: 3}
    - time: 0.16666667
      value: {fileID: -1890978602, guid: cc03b6cf932dbd3419117458e23610e1, type: 3}
    - time: 0.20833333
      value: {fileID: -517866386, guid: cc03b6cf932dbd3419117458e23610e1, type: 3}
    - time: 0.25
      value: {fileID: 2416786, guid: cc03b6cf932dbd3419117458e23610e1, type: 3}
    - time: 0.29166666
      value: {fileID: -1394222503, guid: cc03b6cf932dbd3419117458e23610e1, type: 3}
    - time: 0.33333334
      value: {fileID: -1153700840, guid: cc03b6cf932dbd3419117458e23610e1, type: 3}
    - time: 0.375
      value: {fileID: -590367127, guid: cc03b6cf932dbd3419117458e23610e1, type: 3}
    - time: 0.41666666
      value: {fileID: -1912673025, guid: cc03b6cf932dbd3419117458e23610e1, type: 3}
    - time: 0.45833334
      value: {fileID: -99059735, guid: cc03b6cf932dbd3419117458e23610e1, type: 3}
    - time: 0.5
      value: {fileID: -553676664, guid: cc03b6cf932dbd3419117458e23610e1, type: 3}
    - time: 0.5416667
      value: {fileID: -2132961008, guid: cc03b6cf932dbd3419117458e23610e1, type: 3}
    - time: 0.5833333
      value: {fileID: -1454208617, guid: cc03b6cf932dbd3419117458e23610e1, type: 3}
    - time: 0.625
      value: {fileID: -1415638697, guid: cc03b6cf932dbd3419117458e23610e1, type: 3}
    - time: 0.6666667
      value: {fileID: -937011982, guid: cc03b6cf932dbd3419117458e23610e1, type: 3}
    - time: 0.7083333
      value: {fileID: -878149139, guid: cc03b6cf932dbd3419117458e23610e1, type: 3}
    attribute: m_Sprite
    path: 
    classID: 212
    script: {fileID: 0}
  m_SampleRate: 24
  m_WrapMode: 0
  m_Bounds:
    m_Center: {x: 0, y: 0, z: 0}
    m_Extent: {x: 0, y: 0, z: 0}
  m_ClipBindingConstant:
    genericBindings:
    - serializedVersion: 2
      path: 0
      attribute: 0
      script: {fileID: 0}
      typeID: 212
      customType: 23
      isPPtrCurve: 1
    pptrCurveMapping:
    - {fileID: 879730398, guid: cc03b6cf932dbd3419117458e23610e1, type: 3}
    - {fileID: -2105448359, guid: cc03b6cf932dbd3419117458e23610e1, type: 3}
    - {fileID: -1559894758, guid: cc03b6cf932dbd3419117458e23610e1, type: 3}
    - {fileID: 641886802, guid: cc03b6cf932dbd3419117458e23610e1, type: 3}
    - {fileID: -1890978602, guid: cc03b6cf932dbd3419117458e23610e1, type: 3}
    - {fileID: -517866386, guid: cc03b6cf932dbd3419117458e23610e1, type: 3}
    - {fileID: 2416786, guid: cc03b6cf932dbd3419117458e23610e1, type: 3}
    - {fileID: -1394222503, guid: cc03b6cf932dbd3419117458e23610e1, type: 3}
    - {fileID: -1153700840, guid: cc03b6cf932dbd3419117458e23610e1, type: 3}
    - {fileID: -590367127, guid: cc03b6cf932dbd3419117458e23610e1, type: 3}
    - {fileID: -1912673025, guid: cc03b6cf932dbd3419117458e23610e1, type: 3}
    - {fileID: -99059735, guid: cc03b6cf932dbd3419117458e23610e1, type: 3}
    - {fileID: -553676664, guid: cc03b6cf932dbd3419117458e23610e1, type: 3}
    - {fileID: -2132961008, guid: cc03b6cf932dbd3419117458e23610e1, type: 3}
    - {fileID: -1454208617, guid: cc03b6cf932dbd3419117458e23610e1, type: 3}
    - {fileID: -1415638697, guid: cc03b6cf932dbd3419117458e23610e1, type: 3}
    - {fileID: -937011982, guid: cc03b6cf932dbd3419117458e23610e1, type: 3}
    - {fileID: -878149139, guid: cc03b6cf932dbd3419117458e23610e1, type: 3}
  m_AnimationClipSettings:
    serializedVersion: 2
    m_AdditiveReferencePoseClip: {fileID: 0}
    m_AdditiveReferencePoseTime: 0
    m_StartTime: 0
    m_StopTime: 0.75
    m_OrientationOffsetY: 0
    m_Level: 0
    m_CycleOffset: 0
    m_HasAdditiveReferencePose: 0
    m_LoopTime: 1
    m_LoopBlend: 0
    m_LoopBlendOrientation: 0
    m_LoopBlendPositionY: 0
    m_LoopBlendPositionXZ: 0
    m_KeepOriginalOrientation: 0
    m_KeepOriginalPositionY: 1
    m_KeepOriginalPositionXZ: 0
    m_HeightFromFeet: 0
    m_Mirror: 0
  m_EditorCurves: []
  m_EulerEditorCurves: []
  m_HasGenericRootTransform: 0
  m_HasMotionFloatCurves: 0
  m_Events: []
