metadata	feature	value	coef	stderr	N	N.not.0	pval	qval
Cattle_exposure	Bacteroidetes	Cattle Exposed	0.0336730098147801	0.0142611406210519	315	315	0.0188297633481498	0.094148816740749
Cattle_exposure	Verrucomicrobia	Cattle Exposed	-0.00631719443318192	0.00500026921782141	315	128	0.207396148844394	0.39952861333725
Cattle_exposure	Actinobacteria	Cattle Exposed	-0.0106760468870072	0.0107101273973922	315	315	0.3196228906698	0.39952861333725
Cattle_exposure	Firmicutes	Cattle Exposed	-0.0133636290249888	0.0124043847994329	315	315	0.282162002650905	0.39952861333725
Cattle_exposure	Proteobacteria	Cattle Exposed	-0.00252991496071167	0.00564118735449672	315	315	0.65412283886523	0.65412283886523
