"","SampleID","Order","Cohort","Residency"
"GCF_000403155","GCF_000403155",26,"Ref","Ref"
"TZFG136","TZFG136",24,"TZ","TZ Urban"
"G88994","G88994",23,"NL","NL"
"G89262","G89262",22,"NL","NL"
"TZFG081","TZFG081",20,"TZ","TZ Urban"
"G88748","G88748",19,"NL","NL"
"G88767","G88767",21,"NL","NL"
"TZFG176","TZFG176",17,"TZ","TZ Urban"
"TZFG099","TZFG099",16,"TZ","TZ Urban"
"TZFG173","TZFG173",15,"TZ","TZ Urban"
"TZFG240","TZFG240",14,"TZ","TZ Urban"
"G88896","G88896",18,"NL","NL"
"G88834","G88834",13,"NL","NL"
"G88720","G88720",10,"NL","NL"
"GCF_000011065","GCF_000011065",9,"Ref","Ref"
"TZFG034","TZFG034",8,"TZ","TZ Rural"
"TZFG309","TZFG309",7,"TZ","TZ Urban"
"G89054","G89054",12,"NL","NL"
"G88970","G88970",11,"NL","NL"
"G89074","G89074",6,"NL","NL"
"G89009","G89009",5,"NL","NL"
"G89007","G89007",4,"NL","NL"
"G89044","G89044",3,"NL","NL"
"TZFG271","TZFG271",2,"TZ","TZ Rural"
"G89073","G89073",1,"NL","NL"
"TZFG063","TZFG063",25,"TZ","TZ Urban"
