"","SampleID","Order","Cohort","Residency"
"TZFG095","TZFG095",35,"TZ","TZ Urban"
"TZFG300","TZFG300",29,"TZ","TZ Rural"
"TZFG106","TZFG106",28,"TZ","TZ Urban"
"TZFG042","TZFG042",30,"TZ","TZ Urban"
"TZFG071","TZFG071",27,"TZ","TZ Urban"
"TZFG201","TZFG201",26,"TZ","TZ Urban"
"GCF_000273095","GCF_000273095",25,"Ref","Ref"
"GCF_000273115","GCF_000273115",24,"Ref","Ref"
"TZFG185","TZFG185",21,"TZ","TZ Urban"
"TZFG005","TZFG005",20,"TZ","TZ Urban"
"TZFG132","TZFG132",19,"TZ","TZ Urban"
"TZFG057","TZFG057",23,"TZ","TZ Urban"
"TZFG084","TZFG084",22,"TZ","TZ Urban"
"TZFG246","TZFG246",18,"TZ","TZ Urban"
"TZFG178","TZFG178",17,"TZ","TZ Urban"
"GCF_000009925","GCF_000009925",16,"Ref","Ref"
"GCF_000297755","GCF_000297755",15,"Ref","Ref"
"GCF_000297695","GCF_000297695",14,"Ref","Ref"
"GCF_000157015","GCF_000157015",13,"Ref","Ref"
"TZFG221","TZFG221",12,"TZ","TZ Urban"
"GCF_000210835","GCF_000210835",11,"Ref","Ref"
"GCF_000263115","GCF_000263115",10,"Ref","Ref"
"GCF_000273155","GCF_000273155",9,"Ref","Ref"
"GCF_000273135","GCF_000273135",8,"Ref","Ref"
"GCF_000269525","GCF_000269525",7,"Ref","Ref"
"GCF_000273765","GCF_000273765",6,"Ref","Ref"
"TZFG176","TZFG176",3,"TZ","TZ Urban"
"TZFG161","TZFG161",2,"TZ","TZ Urban"
"TZFG136","TZFG136",1,"TZ","TZ Urban"
"TZFG147","TZFG147",5,"TZ","TZ Urban"
"GCF_000025985","GCF_000025985",4,"Ref","Ref"
"TZFG193","TZFG193",31,"TZ","TZ Urban"
"TZFG219","TZFG219",33,"TZ","TZ Urban"
"GCF_000297735","GCF_000297735",32,"Ref","Ref"
"TZFG121","TZFG121",34,"TZ","TZ Urban"
