"","SampleID","Order","Cohort","Residency"
"TZFG042","TZFG042",31,"TZ","TZ Urban"
"TZFG041","TZFG041",28,"TZ","TZ Urban"
"TZFG044","TZFG044",27,"TZ","TZ Urban"
"TZFG195","TZFG195",29,"TZ","TZ Urban"
"G88745","G88745",25,"NL","NL"
"G89263","G89263",24,"NL","NL"
"G88811","G88811",23,"NL","NL"
"TZFG160","TZFG160",19,"TZ","TZ Urban"
"G88995","G88995",15,"NL","NL"
"G88766","G88766",14,"NL","NL"
"TZFG028","TZFG028",13,"TZ","TZ Urban"
"G88857","G88857",16,"NL","NL"
"TZFG148","TZFG148",17,"TZ","TZ Rural"
"G88888","G88888",18,"NL","NL"
"G88975","G88975",12,"NL","NL"
"G89074","G89074",7,"NL","NL"
"G88692","G88692",6,"NL","NL"
"G89165","G89165",3,"NL","NL"
"G88814","G88814",2,"NL","NL"
"G89073","G89073",1,"NL","NL"
"G89151","G89151",5,"NL","NL"
"TZFG001","TZFG001",4,"TZ","TZ Urban"
"TZFG017","TZFG017",11,"TZ","TZ Urban"
"G88879","G88879",10,"NL","NL"
"G88939","G88939",9,"NL","NL"
"G88926","G88926",8,"NL","NL"
"G88703","G88703",22,"NL","NL"
"G89030","G89030",21,"NL","NL"
"G89001","G89001",20,"NL","NL"
"G88875","G88875",26,"NL","NL"
"TZFG0P1","TZFG0P1",30,"TZ",NA
"TZFG145","TZFG145",35,"TZ","TZ Urban"
"G88927","G88927",34,"NL","NL"
"G88911","G88911",33,"NL","NL"
"G89106","G89106",32,"NL","NL"
"GCF_000273725","GCF_000273725",42,"Ref","Ref"
"G88759","G88759",41,"NL","NL"
"G89069","G89069",40,"NL","NL"
"G88834","G88834",39,"NL","NL"
"G89260","G89260",38,"NL","NL"
"G88807","G88807",37,"NL","NL"
"G88886","G88886",36,"NL","NL"
"TZFG190","TZFG190",46,"TZ","TZ Urban"
"G89109","G89109",45,"NL","NL"
"G89275","G89275",44,"NL","NL"
"GCF_000169015","GCF_000169015",43,"Ref","Ref"
"G88942","G88942",47,"NL","NL"
"G88779","G88779",51,"NL","NL"
"G88700","G88700",50,"NL","NL"
"G89148","G89148",49,"NL","NL"
"G88989","G88989",48,"NL","NL"
"G89018","G89018",54,"NL","NL"
"G88922","G88922",53,"NL","NL"
"TZFG219","TZFG219",52,"TZ","TZ Urban"
"G88737","G88737",55,"NL","NL"
