"","Feature","Subset","N","Prev","Estimate","Std","Tvalue","Pvalue","Padj","Tanzania","Keep","Sign"
"Bacteroides pectinophilus","Bacteroides pectinophilus","Macrophages",16,0.03,0.000793878886342267,0.000172351406817909,4.6061642373538,4.23945931134297e-06,0.00092844158918411,NA,FALSE,"Neutral"
"Anaerotruncus colihominis","Anaerotruncus colihominis","Macrophages",65,0.14,0.000426897565671941,9.52839404057162e-05,4.48026775398062,7.6798879190378e-06,0.00167421556635024,NA,FALSE,"Neutral"
"Coprococcus comes","Coprococcus comes","Macrophages",442,0.94,-0.000481885076165288,0.000107672632020077,-4.47546481519496,7.85363045964579e-06,0.00170423780974314,NA,TRUE,"Negative"
"Streptococcus mitis oralis pneumoniae","Streptococcus mitis oralis pneumoniae","Macrophages",54,0.11,0.000451169444663476,0.000101604194210709,4.44046083105417,9.23830265177325e-06,0.00199547337278302,NA,FALSE,"Neutral"
"Bacteroides ovatus","Bacteroides ovatus","Macrophages",441,0.94,-0.000449825275259011,0.000105288663715954,-4.27230491283032,1.98321447403038e-05,0.00426391111916532,NA,TRUE,"Negative"
"Bacteroides intestinalis","Bacteroides intestinalis","Macrophages",93,0.2,-0.00035793384640946,8.51076686583932e-05,-4.205659161528,2.66476553091924e-05,0.00570259823616717,"Positive",FALSE,"Neutral"
"Blautia hydrogenotrophica","Blautia hydrogenotrophica","Macrophages",48,0.1,0.000434696832642403,0.000107482598462569,4.04434614402988,5.35371579214329e-05,0.0114034146372652,NA,FALSE,"Neutral"
"Bacteroides salyersiae","Bacteroides salyersiae","Macrophages",95,0.2,-0.000335162264422521,8.47193103075343e-05,-3.95614958627341,7.75924905572953e-05,0.0164496079981466,NA,FALSE,"Neutral"
"Bacteroides uniformis","Bacteroides uniformis","Macrophages",456,0.97,0.000422750543436463,0.000108743948412255,3.88757765014923,0.000103021929708231,0.0217376271684368,"Positive",TRUE,"Positive"
"Anaerostipes unclassified","Anaerostipes unclassified","Macrophages",15,0.03,-0.000639663180735628,0.000181751373913625,-3.5194406895632,0.000437657349934331,0.0919080434862095,NA,FALSE,"Neutral"
"Ruminococcus lactaris","Ruminococcus lactaris","Macrophages",269,0.57,0.000274199979400995,8.20351479303346e-05,3.34246949409842,0.000838598645427811,0.175267116894413,NA,TRUE,"Positive"
"Erysipelotrichaceae bacterium 6 1 45","Erysipelotrichaceae bacterium 6 1 45","Macrophages",192,0.41,0.000256004369278134,7.69384887990849e-05,3.32739014339958,0.00088518311101698,0.184118087091532,NA,TRUE,"Positive"
"Granulicatella unclassified","Granulicatella unclassified","Macrophages",97,0.21,0.000271801915275784,8.38428027562376e-05,3.2418037844705,0.00119827134001017,0.248042167382105,NA,FALSE,"Neutral"
"Lactococcus phage P680","Lactococcus phage P680","Macrophages",18,0.04,0.000518620279099275,0.00016185629065182,3.2042021784307,0.00136585520355449,0.281366171932225,NA,FALSE,"Neutral"
"Coriobacteriaceae bacterium phI","Coriobacteriaceae bacterium phI","Macrophages",22,0.05,-0.000469333907347317,0.000147993469078062,-3.1713149929593,0.00152988869935219,0.3136271833672,NA,FALSE,"Neutral"
"Leuconostoc mesenteroides","Leuconostoc mesenteroides","Macrophages",21,0.04,0.000467243744709038,0.000152449414463463,3.06491006445302,0.00219302527548517,0.447377156198976,NA,FALSE,"Neutral"
"Streptococcus infantis","Streptococcus infantis","Macrophages",69,0.15,0.000285378977938788,9.43261817342639e-05,3.02544821270046,0.00249968776861378,0.507436617028598,NA,FALSE,"Neutral"
"Eubacterium ventriosum","Eubacterium ventriosum","Macrophages",386,0.82,0.000298714931966663,9.89186230316086e-05,3.01980479319057,0.00254661749154352,0.51441673329179,NA,FALSE,"Neutral"
"Desulfovibrio piger","Desulfovibrio piger","Macrophages",126,0.27,-0.000236919121424255,7.95265103386865e-05,-2.97912130703669,0.00290951358620202,0.584812230826605,NA,FALSE,"Neutral"
"Coprococcus sp ART55 1","Coprococcus sp ART55 1","Macrophages",177,0.38,0.000224067268249607,7.70613088848002e-05,2.90764939620436,0.00366318244828678,0.732636489657356,NA,FALSE,"Neutral"
"Holdemania filiformis","Holdemania filiformis","Macrophages",180,0.38,-0.000222606918348398,7.67903590312589e-05,-2.89889149050315,0.00376683411336214,0.749599988559066,NA,FALSE,"Neutral"
"Butyrivibrio crossotus","Butyrivibrio crossotus","Macrophages",52,0.11,0.000300760297466558,0.000104742786225905,2.87141776826417,0.00410952946179225,0.813686833434865,NA,FALSE,"Neutral"
"Bacteroides clarus","Bacteroides clarus","Macrophages",118,0.25,-0.000227849913396826,8.08328142315106e-05,-2.81877991707982,0.00484622595390899,0.95470651292007,NA,FALSE,"Neutral"
"Eubacterium cylindroides","Eubacterium cylindroides","Macrophages",71,0.15,-0.000259063284865741,9.38643786565446e-05,-2.75997442878378,0.00580900237021372,1,NA,FALSE,"Neutral"
"Actinomyces viscosus","Actinomyces viscosus","Macrophages",30,0.06,0.000349834550772226,0.000128843291667426,2.71519414200646,0.00665438921825944,1,NA,FALSE,"Neutral"
"Collinsella aerofaciens","Collinsella aerofaciens","Macrophages",431,0.92,0.00028188487709702,0.000104950092340314,2.68589451244094,0.00726583448580317,1,"Positive",FALSE,"Neutral"
"Clostridium scindens","Clostridium scindens","Macrophages",38,0.08,-0.000310989066097827,0.000116766240798662,-2.6633474193458,0.00777020781336488,1,NA,FALSE,"Neutral"
"Pseudoflavonifractor capillosus","Pseudoflavonifractor capillosus","Macrophages",128,0.27,0.000211724605313553,8.0096134208316e-05,2.64338107458338,0.0082428145115099,1,NA,FALSE,"Neutral"
"Dialister invisus","Dialister invisus","Macrophages",236,0.5,-0.000209491508448007,8.03979263100942e-05,-2.60568298291675,0.0092057987586228,1,NA,FALSE,"Neutral"
"Bacteroidales bacterium ph8","Bacteroidales bacterium ph8","Macrophages",381,0.81,-0.000261030854725838,0.000100926638736497,-2.5863424958335,0.00973782690810832,1,"Positive",FALSE,"Neutral"
"Bacteroides cellulosilyticus","Bacteroides cellulosilyticus","Macrophages",203,0.43,0.000200063017963484,7.76265004814902e-05,2.57725154067957,0.00999724800493345,1,NA,FALSE,"Neutral"
"Flavonifractor plautii","Flavonifractor plautii","Macrophages",133,0.28,0.00020386261555788,7.91416292858384e-05,2.57592138799143,0.010035717510984,1,NA,FALSE,"Neutral"
"Escherichia coli","Escherichia coli","Macrophages",273,0.58,0.000212075335833396,8.24517255188233e-05,2.57211519224035,0.0101465266335408,1,NA,FALSE,"Neutral"
"Streptococcus australis","Streptococcus australis","Macrophages",171,0.36,0.00019589650652188,7.70372521070824e-05,2.54288024512585,0.0110346060531631,1,NA,FALSE,"Neutral"
"Lachnospiraceae bacterium 3 1 46FAA","Lachnospiraceae bacterium 3 1 46FAA","Macrophages",368,0.78,0.000245203107361528,9.64464160272958e-05,2.54237655956165,0.0110504939570157,1,"Positive",FALSE,"Neutral"
"Bacteroides xylanisolvens","Bacteroides xylanisolvens","Macrophages",344,0.73,-0.000230019953350349,9.15031836959962e-05,-2.51379180548025,0.0119861412010543,1,NA,FALSE,"Neutral"
"Coprococcus eutactus","Coprococcus eutactus","Macrophages",70,0.15,-0.000230708056434542,9.31670196780837e-05,-2.47628460405515,0.0133200898847696,1,NA,FALSE,"Neutral"
"Olsenella unclassified","Olsenella unclassified","Macrophages",137,0.29,-0.000198579646482195,8.05105807480358e-05,-2.46650371463182,0.0136888486322145,1,NA,FALSE,"Neutral"
"Streptococcus anginosus","Streptococcus anginosus","Macrophages",50,0.11,-0.00025865217400052,0.00010511928027668,-2.46055883677791,0.0139173641478726,1,NA,FALSE,"Neutral"
"Clostridium citroniae","Clostridium citroniae","Macrophages",64,0.14,0.000232726158062541,9.6637457201939e-05,2.40823967021632,0.0160781714455282,1,NA,FALSE,"Neutral"
"C2likevirus unclassified","C2likevirus unclassified","Macrophages",43,0.09,0.00026538832952407,0.00011194745069975,2.37065094260929,0.0178076574203181,1,NA,FALSE,"Neutral"
"Clostridium hathewayi","Clostridium hathewayi","Macrophages",74,0.16,0.000216594924774873,9.15619871144806e-05,2.3655550911544,0.0180542494375586,1,NA,FALSE,"Neutral"
"Bifidobacterium dentium","Bifidobacterium dentium","Macrophages",27,0.06,0.000323435848975671,0.000137280809624031,2.35601647354397,0.0185238813150423,1,NA,FALSE,"Neutral"
"Clostridiaceae bacterium JC118","Clostridiaceae bacterium JC118","Macrophages",42,0.09,0.000263305137138717,0.000113096455031872,2.3281466873963,0.0199578473481289,1,NA,FALSE,"Neutral"
"Lachnospiraceae bacterium 8 1 57FAA","Lachnospiraceae bacterium 8 1 57FAA","Macrophages",245,0.52,-0.000184842560001025,7.95666486500728e-05,-2.3231160685672,0.0202267650456423,1,NA,FALSE,"Neutral"
"Peptostreptococcaceae noname unclassified","Peptostreptococcaceae noname unclassified","Macrophages",369,0.78,0.000220421273780548,9.5270639635375e-05,2.31363276896383,0.0207423165214083,1,NA,FALSE,"Neutral"
"Bacteroides stercoris","Bacteroides stercoris","Macrophages",245,0.52,-0.000183657626615855,7.95684734558506e-05,-2.3081707947779,0.021044423233794,1,NA,FALSE,"Neutral"
"Megasphaera elsdenii","Megasphaera elsdenii","Macrophages",14,0.03,-0.000420256776580776,0.000182172980294622,-2.30691058520923,0.0211146686733929,1,NA,FALSE,"Neutral"
"Actinomyces massiliensis","Actinomyces massiliensis","Macrophages",15,0.03,0.000406605613383862,0.000176526487617954,2.30336885342587,0.021313183967757,1,NA,FALSE,"Neutral"
"Subdoligranulum unclassified","Subdoligranulum unclassified","Macrophages",470,1,0.000250601908148616,0.000109562045572453,2.28730585340243,0.0222340679835291,1,NA,FALSE,"Neutral"
"Coprobacter fastidiosus","Coprobacter fastidiosus","Macrophages",173,0.37,0.000176143784513404,7.73412831215104e-05,2.27748722809092,0.0228138509151216,1,NA,FALSE,"Neutral"
"Eggerthella lenta","Eggerthella lenta","Macrophages",198,0.42,0.000174512570178992,7.73762797442842e-05,2.25537555896623,0.0241678474717847,1,NA,FALSE,"Neutral"
"Desulfovibrio desulfuricans","Desulfovibrio desulfuricans","Macrophages",105,0.22,-0.000186725118116822,8.2953980456937e-05,-2.25094826177455,0.024447171382239,1,NA,FALSE,"Neutral"
"Clostridium clostridioforme","Clostridium clostridioforme","Macrophages",31,0.07,-0.000281971894531945,0.000126989599709129,-2.22043297386404,0.026449632968781,1,NA,FALSE,"Neutral"
"Clostridium bolteae","Clostridium bolteae","Macrophages",106,0.23,0.000181567712200234,8.2572809139257e-05,2.19888016518882,0.0279480054287392,1,"Positive",FALSE,"Neutral"
"Coprobacillus unclassified","Coprobacillus unclassified","Macrophages",96,0.2,-0.000182496020652193,8.47678810248982e-05,-2.152891147516,0.0313915638743101,1,NA,FALSE,"Neutral"
"Ruminococcus flavefaciens","Ruminococcus flavefaciens","Macrophages",61,0.13,-0.000208796573932671,9.79913987520477e-05,-2.13076429759921,0.0331741991823917,1,"Negative",FALSE,"Neutral"
"Lactobacillus delbrueckii","Lactobacillus delbrueckii","Macrophages",77,0.16,-0.000193334904491049,9.11447169006274e-05,-2.12118607710238,0.0339723390120287,1,NA,FALSE,"Neutral"
"Eubacterium dolichum","Eubacterium dolichum","Macrophages",14,0.03,0.000385365308728206,0.000183462818770963,2.10050903670732,0.0357514701047074,1,NA,FALSE,"Neutral"
"Eubacterium eligens","Eubacterium eligens","Macrophages",397,0.84,0.000208882539586938,0.000101164482711543,2.06478137374101,0.0390130811739048,1,NA,FALSE,"Neutral"
"Butyrivibrio unclassified","Butyrivibrio unclassified","Macrophages",82,0.17,0.000180742688985007,8.81525697004692e-05,2.05033942401392,0.0404015007866242,1,NA,FALSE,"Neutral"
"Scardovia unclassified","Scardovia unclassified","Macrophages",15,0.03,-0.000355928607008232,0.000176180553189171,-2.02024911697297,0.0434293401401197,1,NA,FALSE,"Neutral"
"Bacteroides plebeius","Bacteroides plebeius","Macrophages",77,0.16,0.000180700353913082,8.99294067113491e-05,2.0093577898616,0.0445715557835356,1,NA,FALSE,"Neutral"
"Rothia mucilaginosa","Rothia mucilaginosa","Macrophages",81,0.17,-0.000182388491407428,9.16352299389754e-05,-1.99037522499687,0.0466229361219819,1,NA,FALSE,"Neutral"
"Methanobrevibacter smithii","Methanobrevibacter smithii","Macrophages",167,0.35,0.000156018053789089,7.88147227670863e-05,1.97955468612323,0.0478274471897524,1,"Positive",FALSE,"Neutral"
"Turicibacter sanguinis","Turicibacter sanguinis","Macrophages",71,0.15,-0.000185930291081989,9.52937109148785e-05,-1.95112866627758,0.0511169722489517,1,NA,FALSE,"Neutral"
"Ruminococcus callidus","Ruminococcus callidus","Macrophages",265,0.56,0.000159282989114715,8.18888527507476e-05,1.94511198733653,0.0518370137118546,1,NA,FALSE,"Neutral"
"Eubacterium rectale","Eubacterium rectale","Macrophages",470,1,-0.000204893633586476,0.000108491192407939,-1.88857389285622,0.0590269528016842,1,"Negative",FALSE,"Neutral"
"Bacteroides fragilis","Bacteroides fragilis","Macrophages",194,0.41,0.00014542675154862,7.75387141817391e-05,1.87553731169389,0.0607973783945018,1,"Positive",FALSE,"Neutral"
"Bacteroides coprocola","Bacteroides coprocola","Macrophages",74,0.16,0.000172018532155311,9.24670929632054e-05,1.86032161975461,0.0629191731912297,1,NA,FALSE,"Neutral"
"Alistipes indistinctus","Alistipes indistinctus","Macrophages",247,0.52,-0.000145441134182355,8.02583346791033e-05,-1.81216237246726,0.0700419859943501,1,NA,FALSE,"Neutral"
"Clostridium innocuum","Clostridium innocuum","Macrophages",85,0.18,0.000156363885459456,8.73259413543854e-05,1.79057772563712,0.0734426551118629,1,NA,FALSE,"Neutral"
"Megamonas funiformis","Megamonas funiformis","Macrophages",25,0.05,-0.00025117075079877,0.000140310951814842,-1.79010082641461,0.0735192897674901,1,NA,FALSE,"Neutral"
"Ruminococcus albus","Ruminococcus albus","Macrophages",172,0.37,-0.000137350748703327,7.73004799758774e-05,-1.77684211981851,0.0756762058090867,1,NA,FALSE,"Neutral"
"Roseburia intestinalis","Roseburia intestinalis","Macrophages",340,0.72,0.000162039218751124,9.2017532322002e-05,1.76096027205002,0.078327565783471,1,"Negative",FALSE,"Neutral"
"Lachnospiraceae bacterium 1 1 57FAA","Lachnospiraceae bacterium 1 1 57FAA","Macrophages",208,0.44,0.000135580961417766,7.72782149898655e-05,1.75445255089739,0.0794356085086326,1,NA,FALSE,"Neutral"
"Clostridium nexile","Clostridium nexile","Macrophages",29,0.06,-0.000221920743328022,0.000130829183510973,-1.6962633058809,0.08991998710438,1,NA,FALSE,"Neutral"
"Lachnospiraceae bacterium 5 1 57FAA","Lachnospiraceae bacterium 5 1 57FAA","Macrophages",40,0.08,-0.000195773381297534,0.000115566466732802,-1.6940327660114,0.0903430607371446,1,NA,FALSE,"Neutral"
"Clostridium leptum","Clostridium leptum","Macrophages",379,0.8,0.000164715110869041,9.98252355574742e-05,1.65003478278002,0.0990205409840431,1,NA,FALSE,"Neutral"
"Anaerotruncus unclassified","Anaerotruncus unclassified","Macrophages",216,0.46,0.000129633609574052,7.88612346270392e-05,1.64381917411175,0.100298358532048,1,NA,FALSE,"Neutral"
"Deinococcus unclassified","Deinococcus unclassified","Macrophages",35,0.07,-0.00019696981151716,0.000120649097185404,-1.6325842141568,0.102641404187789,1,NA,FALSE,"Neutral"
"Ruminococcaceae bacterium D16","Ruminococcaceae bacterium D16","Macrophages",98,0.21,0.00013974085640704,8.57311256638382e-05,1.62998975372119,0.103188621199354,1,NA,FALSE,"Neutral"
"Slackia piriformis","Slackia piriformis","Macrophages",39,0.08,-0.000185264598703917,0.000115355166993497,-1.60603641373395,0.108351082641034,1,NA,FALSE,"Neutral"
"Granulicatella adiacens","Granulicatella adiacens","Macrophages",15,0.03,0.000275980630142324,0.000176426162272921,1.56428404147565,0.117836234903397,1,NA,FALSE,"Neutral"
"Erysipelotrichaceae bacterium 3 1 53","Erysipelotrichaceae bacterium 3 1 53","Macrophages",14,0.03,0.000283220297563099,0.000182105689614658,1.55525232716453,0.119971350597645,1,NA,FALSE,"Neutral"
"Mitsuokella unclassified","Mitsuokella unclassified","Macrophages",198,0.42,0.000119284713092409,7.70198245489178e-05,1.54875337344669,0.121526380521159,1,NA,FALSE,"Neutral"
"Streptococcus thermophilus","Streptococcus thermophilus","Macrophages",321,0.68,-0.000133108084322097,8.87631607216054e-05,-1.49958702732065,0.133806565359999,1,NA,FALSE,"Neutral"
"Bifidobacterium breve","Bifidobacterium breve","Macrophages",18,0.04,0.00024387204971793,0.000163030408004471,1.49586848676255,0.134773055404576,1,NA,FALSE,"Neutral"
"Atopobium parvulum","Atopobium parvulum","Macrophages",21,0.04,0.000227507688712301,0.000152328009375585,1.49353811977777,0.135381489606994,1,NA,FALSE,"Neutral"
"Clostridiales bacterium 1 7 47FAA","Clostridiales bacterium 1 7 47FAA","Macrophages",42,0.09,0.000167892676518547,0.000112424096523594,1.49338693136228,0.135421036515005,1,NA,FALSE,"Neutral"
"Erysipelotrichaceae bacterium 21 3","Erysipelotrichaceae bacterium 21 3","Macrophages",148,0.31,0.000117143478330217,7.85660851172499e-05,1.49101839751078,0.136041748701858,1,NA,FALSE,"Neutral"
"Ruminococcus bromii","Ruminococcus bromii","Macrophages",428,0.91,0.000148483935636956,0.000104137600326114,1.42584364506161,0.153997679430825,1,"Positive",FALSE,"Neutral"
"Roseburia hominis","Roseburia hominis","Macrophages",423,0.9,-0.000150618231368985,0.000105828113131302,-1.42323459156936,0.15475231309808,1,NA,FALSE,"Neutral"
"Bifidobacterium bifidum","Bifidobacterium bifidum","Macrophages",216,0.46,0.000109240778887087,7.84637385817018e-05,1.39224539719501,0.16393161047463,1,NA,FALSE,"Neutral"
"Methanosphaera stadtmanae","Methanosphaera stadtmanae","Macrophages",18,0.04,0.00021718423583876,0.000164210937613749,1.32259299529495,0.186052352245065,1,"Positive",FALSE,"Neutral"
"Megamonas rupellensis","Megamonas rupellensis","Macrophages",28,0.06,-0.000172853307049901,0.000132943096712664,-1.30020521053076,0.193611477085923,1,NA,FALSE,"Neutral"
"Megamonas unclassified","Megamonas unclassified","Macrophages",47,0.1,-0.000137215245808731,0.000107326663056894,-1.27848236310108,0.201159436646029,1,NA,FALSE,"Neutral"
"Lachnospiraceae bacterium 3 1 57FAA CT1","Lachnospiraceae bacterium 3 1 57FAA CT1","Macrophages",81,0.17,-0.000113810120335939,9.02886544825908e-05,-1.26051408106744,0.207563306376278,1,NA,FALSE,"Neutral"
"Ruminococcus champanellensis","Ruminococcus champanellensis","Macrophages",16,0.03,0.000219949470106767,0.000176883315699921,1.24347211175025,0.213772543769864,1,"Negative",FALSE,"Neutral"
"Lachnospiraceae bacterium 9 1 43BFAA","Lachnospiraceae bacterium 9 1 43BFAA","Macrophages",19,0.04,-0.000191448822985912,0.000158268668560214,-1.20964449077344,0.226492473418413,1,NA,FALSE,"Neutral"
"Acidaminococcus unclassified","Acidaminococcus unclassified","Macrophages",30,0.06,0.000155108203277109,0.000129337754488551,1.19924923616049,0.230507696028116,1,NA,FALSE,"Neutral"
"Bifidobacterium longum","Bifidobacterium longum","Macrophages",457,0.97,-0.000126733372939794,0.000106291745327779,-1.19231622878125,0.233213590706722,1,"Positive",FALSE,"Neutral"
"Eubacterium siraeum","Eubacterium siraeum","Macrophages",341,0.72,0.000110738102122139,9.30017064041373e-05,1.1907104332143,0.233843520439753,1,NA,FALSE,"Neutral"
"Ruminococcus gnavus","Ruminococcus gnavus","Macrophages",213,0.45,9.22437299446084e-05,7.80304029259524e-05,1.1821511421919,0.237221556779665,1,NA,FALSE,"Neutral"
"Parabacteroides distasonis","Parabacteroides distasonis","Macrophages",356,0.76,-0.000110583052375174,9.43332098948617e-05,-1.17226003968722,0.24116799911351,1,NA,FALSE,"Neutral"
"Ruminococcus torques","Ruminococcus torques","Macrophages",470,1,0.000125106101192845,0.000107582654823026,1.16288356518665,0.244951598908673,1,NA,FALSE,"Neutral"
"Streptococcus vestibularis","Streptococcus vestibularis","Macrophages",108,0.23,9.5218624042056e-05,8.23852845535338e-05,1.15577222993244,0.247848819666366,1,NA,FALSE,"Neutral"
"Lactobacillus casei paracasei","Lactobacillus casei paracasei","Macrophages",23,0.05,0.000171389300374823,0.000148355706982287,1.15525923377714,0.24805874279303,1,NA,FALSE,"Neutral"
"Turicibacter unclassified","Turicibacter unclassified","Macrophages",101,0.21,-9.0590277611093e-05,8.44233374907337e-05,-1.07304781241367,0.283319510726929,1,NA,FALSE,"Neutral"
"Actinomyces turicensis","Actinomyces turicensis","Macrophages",20,0.04,0.000167964016746221,0.000158038828130289,1.0628022159703,0.287940883511716,1,NA,FALSE,"Neutral"
"Mitsuokella multacida","Mitsuokella multacida","Macrophages",31,0.07,-0.000135330008179542,0.000129546668256669,-1.04464290746108,0.296256155261145,1,NA,FALSE,"Neutral"
"Dorea unclassified","Dorea unclassified","Macrophages",15,0.03,0.000189570232442221,0.000182475554588869,1.0388801550396,0.298928232200501,1,NA,FALSE,"Neutral"
"Dialister succinatiphilus","Dialister succinatiphilus","Macrophages",16,0.03,0.000177249948290324,0.000171844490439457,1.03145552026163,0.302394545411012,1,NA,FALSE,"Neutral"
"Oscillibacter sp KLE 1745","Oscillibacter sp KLE 1745","Macrophages",15,0.03,0.000179825721450209,0.000176603968915227,1.01824280934778,0.308629028825045,1,NA,FALSE,"Neutral"
"Catenibacterium mitsuokai","Catenibacterium mitsuokai","Macrophages",57,0.12,-0.000103998957024097,0.000102362888417282,-1.0159830250212,0.309703774332307,1,NA,FALSE,"Neutral"
"Enterococcus faecium","Enterococcus faecium","Macrophages",14,0.03,0.000184385710884315,0.000182319334878677,1.01133382812642,0.311922685566925,1,NA,FALSE,"Neutral"
"Bacteroides nordii","Bacteroides nordii","Macrophages",48,0.1,-0.000107196808492938,0.000107250565712656,-0.999498769825957,0.317618371588022,1,NA,FALSE,"Neutral"
"Parabacteroides johnsonii","Parabacteroides johnsonii","Macrophages",81,0.17,8.86760366692171e-05,8.95976695152102e-05,0.989713651582907,0.322378695278718,1,NA,FALSE,"Neutral"
"Bifidobacterium catenulatum","Bifidobacterium catenulatum","Macrophages",239,0.51,-7.97566553731861e-05,8.1123666183078e-05,-0.983149050404024,0.325598246978515,1,NA,FALSE,"Neutral"
"Lachnospiraceae bacterium 1 4 56FAA","Lachnospiraceae bacterium 1 4 56FAA","Macrophages",109,0.23,8.09825298011878e-05,8.24776611963392e-05,0.981872286708128,0.326226846295572,1,NA,FALSE,"Neutral"
"Eubacterium biforme","Eubacterium biforme","Macrophages",184,0.39,7.69187243754132e-05,7.83768034495948e-05,0.981396548340744,0.326461272032852,1,NA,FALSE,"Neutral"
"Veillonella atypica","Veillonella atypica","Macrophages",91,0.19,8.39098423867723e-05,8.65257484351485e-05,0.969767310937081,0.332225758105611,1,"Negative",FALSE,"Neutral"
"Burkholderiales bacterium 1 1 47","Burkholderiales bacterium 1 1 47","Macrophages",124,0.26,-7.69041973653567e-05,8.01125983212349e-05,-0.959951355678003,0.337142303865808,1,NA,FALSE,"Neutral"
"Alistipes putredinis","Alistipes putredinis","Macrophages",410,0.87,-9.88163879812424e-05,0.000103857576319745,-0.951460562463133,0.341432658976493,1,NA,FALSE,"Neutral"
"Clostridium symbiosum","Clostridium symbiosum","Macrophages",53,0.11,-9.70376777994822e-05,0.00010245637284115,-0.947112171830741,0.343643355994389,1,NA,FALSE,"Neutral"
"Actinomyces graevenitzii","Actinomyces graevenitzii","Macrophages",59,0.13,9.23755272050364e-05,9.84042930363051e-05,0.938734727467181,0.347928117374672,1,NA,FALSE,"Neutral"
"Bacteroides thetaiotaomicron","Bacteroides thetaiotaomicron","Macrophages",380,0.81,-8.89108108256725e-05,9.75734659912357e-05,-0.911219150846386,0.36223916409215,1,NA,FALSE,"Neutral"
"Alistipes senegalensis","Alistipes senegalensis","Macrophages",303,0.64,7.62324910322711e-05,8.69859608920941e-05,0.876376949227903,0.380881930582024,1,NA,FALSE,"Neutral"
"Parabacteroides merdae","Parabacteroides merdae","Macrophages",349,0.74,-8.07614501674248e-05,9.28513514844612e-05,-0.869792941903924,0.384469884389246,1,NA,FALSE,"Neutral"
"Roseburia unclassified","Roseburia unclassified","Macrophages",131,0.28,6.79952299049895e-05,7.93739316792217e-05,0.856644347413485,0.391696840763672,1,"Positive",FALSE,"Neutral"
"Bacteroides finegoldii","Bacteroides finegoldii","Macrophages",117,0.25,6.90568233545905e-05,8.15099659478672e-05,0.847219386630077,0.396927542526472,1,NA,FALSE,"Neutral"
"Alistipes sp AP11","Alistipes sp AP11","Macrophages",52,0.11,8.76585594238501e-05,0.000103898736287898,0.843692258017004,0.398895833130633,1,NA,FALSE,"Neutral"
"Bifidobacterium animalis","Bifidobacterium animalis","Macrophages",62,0.13,-8.12494151278296e-05,9.75981314397175e-05,-0.83248945373523,0.405186355903445,1,NA,FALSE,"Neutral"
"Barnesiella intestinihominis","Barnesiella intestinihominis","Macrophages",408,0.87,-8.59062335113463e-05,0.000103536836351632,-0.829716616215617,0.406752450758609,1,NA,FALSE,"Neutral"
"Megamonas hypermegale","Megamonas hypermegale","Macrophages",37,0.08,-9.26194230306853e-05,0.00011825130678298,-0.783242279095186,0.43353488692472,1,NA,FALSE,"Neutral"
"Prevotella stercorea","Prevotella stercorea","Macrophages",37,0.08,9.25563314443511e-05,0.000119727131529951,0.773060627625554,0.439535789854908,1,NA,FALSE,"Neutral"
"Parabacteroides unclassified","Parabacteroides unclassified","Macrophages",197,0.42,-5.85060132333687e-05,7.77581294594951e-05,-0.752410244948666,0.4518521604514,1,NA,FALSE,"Neutral"
"Dorea formicigenerans","Dorea formicigenerans","Macrophages",456,0.97,-7.80762686159693e-05,0.000106735293592741,-0.731494391291758,0.464523465701197,1,NA,FALSE,"Neutral"
"Odoribacter unclassified","Odoribacter unclassified","Macrophages",150,0.32,5.68927210418425e-05,7.85829637791847e-05,0.723982887712265,0.469121925773197,1,NA,FALSE,"Neutral"
"Streptococcus salivarius","Streptococcus salivarius","Macrophages",451,0.96,-7.74009032603961e-05,0.000107824184179542,-0.717843625243786,0.472898945352311,1,"Negative",FALSE,"Neutral"
"Megasphaera unclassified","Megasphaera unclassified","Macrophages",29,0.06,-9.37926454609723e-05,0.000130882781232467,-0.716615620311301,0.473656447673154,1,NA,FALSE,"Neutral"
"Streptococcus gordonii","Streptococcus gordonii","Macrophages",25,0.05,0.00010049534414746,0.000141326977752127,0.711083939852721,0.477076959719813,1,NA,FALSE,"Neutral"
"Lactobacillus sakei","Lactobacillus sakei","Macrophages",47,0.1,7.59416771120951e-05,0.000107367884340245,0.707303469549967,0.479422370832468,1,NA,FALSE,"Neutral"
"Bacteroides caccae","Bacteroides caccae","Macrophages",367,0.78,6.71666097933571e-05,9.53320831179356e-05,0.704554097598655,0.481132032277327,1,NA,FALSE,"Neutral"
"Eubacterium ramulus","Eubacterium ramulus","Macrophages",408,0.87,7.16616894253118e-05,0.000102341745182235,0.7002195369808,0.483834154069197,1,NA,FALSE,"Neutral"
"Veillonella parvula","Veillonella parvula","Macrophages",202,0.43,5.41934887765841e-05,7.74268754954998e-05,0.699931237438788,0.484014168774671,1,NA,FALSE,"Neutral"
"Bacteroides coprophilus","Bacteroides coprophilus","Macrophages",24,0.05,0.000103897893844866,0.000149823036223809,0.693470753654073,0.488057620849159,1,NA,FALSE,"Neutral"
"Bacteroides eggerthii","Bacteroides eggerthii","Macrophages",119,0.25,-5.56847029946035e-05,8.09639409414783e-05,-0.687771646823035,0.491639623908181,1,NA,FALSE,"Neutral"
"Streptococcus mutans","Streptococcus mutans","Macrophages",53,0.11,-7.07936009627459e-05,0.000103621924472822,-0.683191335452508,0.494528642342705,1,NA,FALSE,"Neutral"
"Bifidobacterium pseudocatenulatum","Bifidobacterium pseudocatenulatum","Macrophages",126,0.27,-5.25575032210125e-05,8.02842836911272e-05,-0.654642487977021,0.512738576037186,1,NA,FALSE,"Neutral"
"Faecalibacterium prausnitzii","Faecalibacterium prausnitzii","Macrophages",469,1,-6.85670192901214e-05,0.000106235996173753,-0.645421719188076,0.51869387712567,1,NA,FALSE,"Neutral"
"Paraprevotella xylaniphila","Paraprevotella xylaniphila","Macrophages",186,0.39,4.89429906482147e-05,7.71640480402304e-05,0.634271942585201,0.525942501528248,1,NA,FALSE,"Neutral"
"Sutterella wadsworthensis","Sutterella wadsworthensis","Macrophages",253,0.54,-5.07639909718035e-05,8.04979327465906e-05,-0.630624778050013,0.528324767867572,1,NA,FALSE,"Neutral"
"Clostridium sp L2 50","Clostridium sp L2 50","Macrophages",80,0.17,5.51529434634366e-05,9.01762784727597e-05,0.611612548194669,0.540831639393099,1,NA,FALSE,"Neutral"
"Phascolarctobacterium succinatutens","Phascolarctobacterium succinatutens","Macrophages",99,0.21,5.05566396142409e-05,8.48763260196614e-05,0.595650660026562,0.55144498899322,1,NA,FALSE,"Neutral"
"Clostridium bartlettii","Clostridium bartlettii","Macrophages",371,0.79,5.53643515564288e-05,9.63416556398177e-05,0.574666806260976,0.565551532548345,1,"Negative",FALSE,"Neutral"
"Streptococcus sanguinis","Streptococcus sanguinis","Macrophages",139,0.3,-4.44949611252067e-05,7.89212034106387e-05,-0.563789694053356,0.572931370180999,1,NA,FALSE,"Neutral"
"Porphyromonas asaccharolytica","Porphyromonas asaccharolytica","Macrophages",15,0.03,9.86718079318076e-05,0.000176883133148016,0.557836160948363,0.576989952454735,1,NA,FALSE,"Neutral"
"Alistipes onderdonkii","Alistipes onderdonkii","Macrophages",390,0.83,-5.45491758909198e-05,0.000101656637173962,-0.536602207267307,0.591574619558174,1,NA,FALSE,"Neutral"
"Blautia producta","Blautia producta","Macrophages",40,0.08,-6.19510583391843e-05,0.000115479843204874,-0.536466422363221,0.591668427120968,1,NA,FALSE,"Neutral"
"Streptococcus parasanguinis","Streptococcus parasanguinis","Macrophages",391,0.83,-5.29960656158586e-05,9.97402435522265e-05,-0.531340848271626,0.595214438613615,1,"Negative",FALSE,"Neutral"
"Eubacterium sp 3 1 31","Eubacterium sp 3 1 31","Macrophages",31,0.07,6.75258746525097e-05,0.000129055763325023,0.523230213922705,0.600845331420475,1,NA,FALSE,"Neutral"
"Alistipes finegoldii","Alistipes finegoldii","Macrophages",370,0.79,-5.12741430023695e-05,9.91615573975219e-05,-0.517076822390154,0.605133381311498,1,NA,FALSE,"Neutral"
"Veillonella unclassified","Veillonella unclassified","Macrophages",301,0.64,-4.42766787607481e-05,8.63659998613916e-05,-0.512663303056846,0.608217408929635,1,NA,FALSE,"Neutral"
"Escherichia unclassified","Escherichia unclassified","Macrophages",211,0.45,3.8052613491403e-05,7.74411482377594e-05,0.491374603260969,0.623190613870222,1,NA,FALSE,"Neutral"
"Acidaminococcus intestini","Acidaminococcus intestini","Macrophages",20,0.04,-7.59345953722437e-05,0.000154536996200091,-0.491368392290513,0.623195005527887,1,NA,FALSE,"Neutral"
"Oscillibacter unclassified","Oscillibacter unclassified","Macrophages",450,0.96,5.2649927220152e-05,0.000109516241372504,0.480749946860125,0.630722598890945,1,"Positive",FALSE,"Neutral"
"Roseburia inulinivorans","Roseburia inulinivorans","Macrophages",431,0.92,5.04376739272956e-05,0.000104935512820842,0.480653999503567,0.630790794223163,1,"Negative",FALSE,"Neutral"
"Ruminococcus sp 5 1 39BFAA","Ruminococcus sp 5 1 39BFAA","Macrophages",443,0.94,5.11601177330167e-05,0.000106544877389334,0.480174354568627,0.631131752762288,1,NA,FALSE,"Neutral"
"Odoribacter splanchnicus","Odoribacter splanchnicus","Macrophages",189,0.4,-3.66999345268098e-05,7.80102586276261e-05,-0.470450107106979,0.638061149609976,1,"Positive",FALSE,"Neutral"
"Bifidobacterium adolescentis","Bifidobacterium adolescentis","Macrophages",465,0.99,4.96738323851516e-05,0.000106227295395791,0.467618347996833,0.640085028874383,1,"Positive",FALSE,"Neutral"
"Eggerthella unclassified","Eggerthella unclassified","Macrophages",287,0.61,3.89002742616214e-05,8.42512928985621e-05,0.46171723807796,0.644311200236337,1,"Positive",FALSE,"Neutral"
"Haemophilus parainfluenzae","Haemophilus parainfluenzae","Macrophages",191,0.41,-3.49317282790545e-05,7.77784562520687e-05,-0.449118302963559,0.653372571977377,1,NA,FALSE,"Neutral"
"Lactobacillus acidophilus","Lactobacillus acidophilus","Macrophages",27,0.06,-6.10917912988644e-05,0.00013736441252974,-0.444742493152204,0.656531821575756,1,NA,FALSE,"Neutral"
"Bacteroides vulgatus","Bacteroides vulgatus","Macrophages",441,0.94,4.57408815068328e-05,0.000105212880683818,0.434746023581388,0.6637720935419,1,NA,FALSE,"Neutral"
"Lactococcus lactis","Lactococcus lactis","Macrophages",160,0.34,3.18465419866241e-05,7.69556920474539e-05,0.413829583482744,0.679022856797941,1,NA,FALSE,"Neutral"
"Bacteroides faecis","Bacteroides faecis","Macrophages",152,0.32,3.1952995128579e-05,7.77893304884172e-05,0.410763210429441,0.68126991341859,1,NA,FALSE,"Neutral"
"Alloscardovia omnicolens","Alloscardovia omnicolens","Macrophages",21,0.04,-6.21462945070992e-05,0.000152213987394062,-0.408282415900522,0.683089928316709,1,NA,FALSE,"Neutral"
"Actinomyces oris","Actinomyces oris","Macrophages",14,0.03,-7.32345284815004e-05,0.000182143642782932,-0.402070186818307,0.687655553256258,1,NA,FALSE,"Neutral"
"Lachnospiraceae bacterium 2 1 58FAA","Lachnospiraceae bacterium 2 1 58FAA","Macrophages",120,0.25,-3.23049405931437e-05,8.06563655147253e-05,-0.40052561737667,0.688792499963343,1,NA,FALSE,"Neutral"
"Alistipes shahii","Alistipes shahii","Macrophages",401,0.85,-3.86410435122508e-05,0.000103758634883739,-0.372412797793144,0.709606815843234,1,NA,FALSE,"Neutral"
"Gordonibacter pamelaeae","Gordonibacter pamelaeae","Macrophages",263,0.56,2.90484792778114e-05,8.17076084982313e-05,0.355517433586864,0.722222214435858,1,NA,FALSE,"Neutral"
"Subdoligranulum variabile","Subdoligranulum variabile","Macrophages",152,0.32,-2.75677285778143e-05,7.80501155141693e-05,-0.353205480814563,0.723954482624284,1,NA,FALSE,"Neutral"
"Rothia unclassified","Rothia unclassified","Macrophages",19,0.04,5.25511912709675e-05,0.000162389181940047,0.323612636279978,0.74624957494977,1,NA,FALSE,"Neutral"
"Eubacterium limosum","Eubacterium limosum","Macrophages",25,0.05,4.30643156145477e-05,0.000140712243800673,0.306045262667766,0.759587369370018,1,NA,FALSE,"Neutral"
"Akkermansia muciniphila","Akkermansia muciniphila","Macrophages",272,0.58,-2.58270450838435e-05,8.51196762404819e-05,-0.303420386737332,0.761586538354568,1,"Positive",FALSE,"Neutral"
"Lachnospiraceae bacterium 5 1 63FAA","Lachnospiraceae bacterium 5 1 63FAA","Macrophages",465,0.99,-3.23004637267908e-05,0.000107269734635715,-0.301114418120658,0.763344134882798,1,NA,FALSE,"Neutral"
"Oxalobacter formigenes","Oxalobacter formigenes","Macrophages",105,0.22,-2.53886983366312e-05,8.46389521805919e-05,-0.299964705168609,0.764220896460287,1,NA,FALSE,"Neutral"
"Collinsella intestinalis","Collinsella intestinalis","Macrophages",22,0.05,4.42047508279989e-05,0.000148300894970301,0.298074740795404,0.765662824497114,1,NA,FALSE,"Neutral"
"Bacteroides massiliensis","Bacteroides massiliensis","Macrophages",204,0.43,2.27361292113753e-05,7.75792576535981e-05,0.293069692841033,0.769485285712274,1,NA,FALSE,"Neutral"
"Paraprevotella unclassified","Paraprevotella unclassified","Macrophages",228,0.48,2.22261753542018e-05,7.9146286757542e-05,0.280823981323215,0.778861080784889,1,NA,FALSE,"Neutral"
"Eubacterium hallii","Eubacterium hallii","Macrophages",462,0.98,-2.93061512718873e-05,0.000107068934972529,-0.27371292410265,0.78432049404056,1,NA,FALSE,"Neutral"
"Bifidobacterium angulatum","Bifidobacterium angulatum","Macrophages",60,0.13,2.61648713139892e-05,9.80789900702759e-05,0.266773457753199,0.789658429936612,1,NA,FALSE,"Neutral"
"Paraprevotella clara","Paraprevotella clara","Macrophages",221,0.47,1.87191482773094e-05,7.89142122230317e-05,0.237208834124889,0.812507891005783,1,NA,FALSE,"Neutral"
"Alistipes unclassified","Alistipes unclassified","Macrophages",41,0.09,-2.67846329448925e-05,0.000115687514890939,-0.231525700678616,0.816919199983689,1,"Negative",FALSE,"Neutral"
"Dorea longicatena","Dorea longicatena","Macrophages",452,0.96,-2.43108654137881e-05,0.000106420749972893,-0.228441026961193,0.819315997792542,1,NA,FALSE,"Neutral"
"Coprococcus catus","Coprococcus catus","Macrophages",429,0.91,2.22363809551356e-05,0.000105775665560692,0.210222084987749,0.833505896629328,1,NA,FALSE,"Neutral"
"Methanobrevibacter unclassified","Methanobrevibacter unclassified","Macrophages",124,0.26,1.68531367801193e-05,8.12303880390946e-05,0.207473301395633,0.835651637647315,1,"Positive",FALSE,"Neutral"
"Clostridium ramosum","Clostridium ramosum","Macrophages",45,0.1,2.20312220382257e-05,0.000109986004589844,0.200309322266808,0.841249660112208,1,NA,FALSE,"Neutral"
"Clostridium asparagiforme","Clostridium asparagiforme","Macrophages",54,0.11,2.05138448878096e-05,0.000103066278398478,0.199035467337807,0.84224591615804,1,NA,FALSE,"Neutral"
"Bacteroides dorei","Bacteroides dorei","Macrophages",382,0.81,-1.76278272561626e-05,9.77570061537827e-05,-0.180322904206294,0.856908932088976,1,NA,FALSE,"Neutral"
"Parasutterella excrementihominis","Parasutterella excrementihominis","Macrophages",142,0.3,1.35997505573625e-05,7.92569212275692e-05,0.171590699546779,0.863768685497255,1,NA,FALSE,"Neutral"
"Collinsella tanakaei","Collinsella tanakaei","Macrophages",17,0.04,2.46777907006673e-05,0.000166729374188766,0.148011055764702,0.8823420930207,1,NA,FALSE,"Neutral"
"Solobacterium moorei","Solobacterium moorei","Macrophages",15,0.03,2.61092423661571e-05,0.000176478527538562,0.147945717421356,0.88239365417349,1,NA,FALSE,"Neutral"
"Bilophila wadsworthia","Bilophila wadsworthia","Macrophages",256,0.54,-1.17969329516405e-05,8.13087992650997e-05,-0.145088023169273,0.884649262055569,1,"Positive",FALSE,"Neutral"
"Veillonella dispar","Veillonella dispar","Macrophages",78,0.17,-1.28131096331868e-05,8.97757236015777e-05,-0.14272354617882,0.886516276552368,1,NA,FALSE,"Neutral"
"Lactobacillus ruminis","Lactobacillus ruminis","Macrophages",28,0.06,-1.83595543028839e-05,0.000132852557867592,-0.138194962878938,0.890093841858336,1,NA,FALSE,"Neutral"
"Parabacteroides goldsteinii","Parabacteroides goldsteinii","Macrophages",58,0.12,1.31643859982139e-05,0.000100361447422063,0.131169750301149,0.895648142786715,1,NA,FALSE,"Neutral"
"Adlercreutzia equolifaciens","Adlercreutzia equolifaciens","Macrophages",380,0.81,-1.07930170547578e-05,9.85312288477346e-05,-0.109539048492299,0.912780880937817,1,NA,FALSE,"Neutral"
"Peptostreptococcus unclassified","Peptostreptococcus unclassified","Macrophages",33,0.07,-1.34329551521384e-05,0.000125389401940023,-0.107129908463586,0.91469171736132,1,NA,FALSE,"Neutral"
"Leuconostoc unclassified","Leuconostoc unclassified","Macrophages",15,0.03,1.86420938222186e-05,0.000176294244093918,0.105744200090205,0.915791031698295,1,NA,FALSE,"Neutral"
"Prevotella copri","Prevotella copri","Macrophages",252,0.54,-5.90434285223132e-06,8.09062668052224e-05,-0.0729775712732577,0.941827902597433,1,"Negative",FALSE,"Neutral"
"Erysipelotrichaceae bacterium 2 2 44A","Erysipelotrichaceae bacterium 2 2 44A","Macrophages",121,0.26,5.08157704925393e-06,8.01869268210568e-05,0.0633716398758348,0.949473986642273,1,NA,FALSE,"Neutral"
"Ruminococcus obeum","Ruminococcus obeum","Macrophages",470,1,-5.78106090254676e-06,0.00010717773830893,-0.053939008172419,0.956986664395679,1,NA,FALSE,"Neutral"
"Bilophila unclassified","Bilophila unclassified","Macrophages",388,0.82,-4.90702680071717e-06,0.000101703813980126,-0.0482482082891804,0.961521029371512,1,"Positive",FALSE,"Neutral"
"Lachnospiraceae bacterium 7 1 58FAA","Lachnospiraceae bacterium 7 1 58FAA","Macrophages",393,0.83,4.16882617057026e-06,0.000101625679147255,0.0410213855941828,0.967281056084213,1,NA,FALSE,"Neutral"
"Anaerostipes hadrus","Anaerostipes hadrus","Macrophages",457,0.97,2.76448891361868e-06,0.000105921854209775,0.0260993251510088,0.979179520149434,1,"Positive",FALSE,"Neutral"
"Holdemania unclassified","Holdemania unclassified","Macrophages",149,0.32,1.7286112247633e-06,7.77110862600432e-05,0.0222440749184599,0.982254456770573,1,NA,FALSE,"Neutral"
"Actinomyces odontolyticus","Actinomyces odontolyticus","Macrophages",156,0.33,-1.67489917965668e-06,7.82226727037343e-05,-0.0214119400650027,0.982918201342408,1,NA,FALSE,"Neutral"
