"","SampleID","Order","Cohort","Residency"
"GCF_000159455","GCF_000159455",12,"Ref","Ref"
"GCF_000439275","GCF_000439275",10,"Ref","Ref"
"GCF_000179455","GCF_000179455",9,"Ref","Ref"
"GCF_000160715","GCF_000160715",6,"Ref","Ref"
"GCF_000010005","GCF_000010005",5,"Ref","Ref"
"GCF_000159475","GCF_000159475",7,"Ref","Ref"
"GCF_000016825","GCF_000016825",8,"Ref","Ref"
"GCF_000168255","GCF_000168255",4,"Ref","Ref"
"GCF_000179435","GCF_000179435",3,"Ref","Ref"
"GCF_000410995","GCF_000410995",2,"Ref","Ref"
"GCF_000236455","GCF_000236455",1,"Ref","Ref"
"GCF_000159615","GCF_000159615",11,"Ref","Ref"
