metadata	feature	value	coef	stderr	N	N.not.0	pval	qval
Ascomycota	Bacteroidetes		0.0750054597670592	0.0213139678071597	315	315	0.000497274079003918	0.00248637039501959
Ascomycota	Actinobacteria		-0.0343615123246975	0.0160857820142033	315	315	0.0334433568981292	0.083608392245323
Ascomycota	Proteobacteria		-0.0141354672271708	0.00848585465362438	315	315	0.0967600468915728	0.161266744819288
Ascomycota	Verrucomicrobia		-0.00842053413142602	0.00755684156602803	315	128	0.266008493226716	0.307443937546727
Ascomycota	Firmicutes		-0.019156743197375	0.0187394692318229	315	315	0.307443937546727	0.307443937546727
