"","SampleID","Order","Cohort","Residency"
"TZFG216","TZFG216",4,"TZ","TZ Urban"
"GCF_000184945","GCF_000184945",2,"Ref","Ref"
"GCF_000162455","GCF_000162455",1,"Ref","Ref"
"TZFG055","TZFG055",3,"TZ","TZ Urban"
