{
  "preset": "ts-jest",
  "testEnvironment": "node",
  "collectCoverage": true,
  "collectCoverageFrom": [
    "<rootDir>/src/**/*.ts",
    "!<rootDir>/src/**/*.d.ts"
  ],
  "coverageProvider": "babel",
  "coverageDirectory": "coverage",
  "coverageReporters": ["text", "clover", "lcov", "cobertura", "html-spa"],
  "roots": ["<rootDir>/tests", "<rootDir>/__mocks__", "<rootDir>/src"],
  "testMatch": ["**/*.test.ts"]
}
