{
  "preset": "ts-jest",
  "testEnvironment": "node",
  "collectCoverage": true,
  "collectCoverageFrom": [
    "<rootDir>/src/**/*.ts",
    "!<rootDir>/src/**/index.ts"
  ],
  "coverageProvider": "babel",
  "coverageDirectory": "coverage",
  "coverageReporters": ["text", "clover", "lcov", "cobertura", "html"],
  "modulePaths": [
    "<rootDir>/src/"
  ],
  "roots": ["<rootDir>/tests", "<rootDir>/__mocks__", "<rootDir>/src"],
  "testMatch": ["**/*.test.ts"],
  "setupFiles": ["<rootDir>/jest.setup.ts"]
}
