{
  "name": "posix",
  "dependencies": [],
  "configure-pre-commands": [],
  "configure-arguments": [],
  "configure-post-commands": [],
  "install-pre-commands": [],
  "install-arguments": [],
  "install-post-commands": []
}
