{
  "name": "zip",
  "dependencies": [
    "zlib1g-dev",
    "libzip-dev"
  ],
  "configure-pre-commands": [],
  "configure-arguments": [],
  "configure-post-commands": [],
  "install-pre-commands": [],
  "install-arguments": [],
  "install-post-commands": []
}
