module gitlab.com/up5tech/ovalgrowth

go 1.22.2

require (
	github.com/FortAwesome/Font-Awesome v0.0.0-20240716171331-37eff7fa00de // indirect
	github.com/google/docsy v0.11.0 // indirect
	github.com/google/docsy/dependencies v0.7.2 // indirect
	github.com/twbs/bootstrap v5.3.3+incompatible // indirect
)
