{
    "PF_CODE": "PF001",
    "H_CODE": 15,
    "LOT_ID": 17,
    "DATE": "2025-03-04",
    "TIME": "17:48:21",
    "EC_101": 591,
    "EC_102": 530,
    "EC_103": 374,
    "EC_104": 351,
    "EC_105": 459,
    "EC_106": 400,
    "EC_107": 501,
    "EC_108": 440,
    "EC_109": 436,
    "EC_110": 394,
    "EC_111": 385,
    "EC_112": 587,
    "EC_113": 591,
    "EC_114": 456,
    "EC_115": 351,
    "EC_116": 509,
    "EC_117": 466,
    "EC_118": 393,
    "EC_119": 458,
    "EC_120": 388,
    "EC_121": 306,
    "EC_122": 439,
    "EC_123": 586,
    "EC_124": 592,
    "EC_201": 500,
    "EC_202": 379,
    "EC_203": 553,
    "EC_204": 368,
    "EC_205": 530,
    "EC_206": 537,
    "EC_207": 381,
    "EC_208": 570,
    "EC_209": 595,
    "EC_210": 386,
    "EC_211": 326,
    "EC_212": 437,
    "EC_213": 448,
    "EC_214": 312,
    "EC_215": 306,
    "EC_216": 447,
    "EC_217": 571,
    "EC_218": 513,
    "EC_219": 559,
    "EC_220": 351,
    "EC_221": 393,
    "EC_222": 412,
    "EC_223": 531,
    "EC_224": 300,
    "EC_301": 546,
    "EC_302": 329,
    "EC_303": 426,
    "EC_304": 411,
    "EC_305": 329,
    "EC_306": 517,
    "EC_307": 302,
    "EC_308": 339,
    "EC_309": 390,
    "EC_310": 470,
    "EC_311": 415,
    "EC_312": 536,
    "EC_313": 478,
    "EC_314": 473,
    "EC_315": 499,
    "EC_316": 553,
    "EC_317": 576,
    "EC_318": 512,
    "EC_319": 397,
    "EC_320": 481,
    "EC_321": 391,
    "EC_322": 374,
    "EC_323": 498,
    "EC_324": 504,
    "EC_401": 474,
    "EC_402": 471,
    "EC_403": 387,
    "EC_404": 525,
    "EC_405": 540,
    "EC_406": 342,
    "EC_407": 489,
    "EC_408": 379,
    "EC_409": 300,
    "EC_410": 565,
    "EC_411": 475,
    "EC_412": 598,
    "EC_413": 349,
    "EC_414": 465,
    "EC_415": 584,
    "EC_416": 580,
    "EC_417": 513,
    "EC_418": 590,
    "EC_419": 346,
    "EC_420": 397,
    "EC_421": 592,
    "EC_422": 597,
    "EC_423": 547,
    "EC_424": 349,
    "TEMP_101": 33.0,
    "TEMP_HI_101": 35.5,
    "TEMP_LO_101": 27.9,
    "TEMP_102": 32.3,
    "TEMP_HI_102": 36.3,
    "TEMP_LO_102": 27.6,
    "TEMP_103": 30.1,
    "TEMP_HI_103": 36.1,
    "TEMP_LO_103": 25.7,
    "TEMP_201": 32.6,
    "TEMP_HI_201": 35.6,
    "TEMP_LO_201": 25.2,
    "TEMP_202": 30.6,
    "TEMP_HI_202": 34.1,
    "TEMP_LO_202": 27.5,
    "TEMP_203": 32.7,
    "TEMP_HI_203": 35.5,
    "TEMP_LO_203": 26.7,
    "TEMP_301": 30.2,
    "TEMP_HI_301": 37.2,
    "TEMP_LO_301": 27.4,
    "TEMP_302": 31.5,
    "TEMP_HI_302": 34.8,
    "TEMP_LO_302": 27.9,
    "TEMP_303": 30.4,
    "TEMP_HI_303": 35.1,
    "TEMP_LO_303": 26.3,
    "TEMP_401": 30.7,
    "TEMP_HI_401": 34.3,
    "TEMP_LO_401": 27.4,
    "TEMP_402": 31.2,
    "TEMP_HI_402": 36.4,
    "TEMP_LO_402": 26.4,
    "TEMP_403": 30.3,
    "TEMP_HI_403": 37.3,
    "TEMP_LO_403": 28.7,
    "HUMIDITY_101": 68.17,
    "HUMIDITY_HI_101": 70.16,
    "HUMIDITY_LO_101": 52.11,
    "HUMIDITY_102": 60.12,
    "HUMIDITY_HI_102": 80.86,
    "HUMIDITY_LO_102": 55.96,
    "HUMIDITY_103": 61.14,
    "HUMIDITY_HI_103": 77.83,
    "HUMIDITY_LO_103": 56.52,
    "HUMIDITY_201": 62.30,
    "HUMIDITY_HI_201": 98.13,
    "HUMIDITY_LO_201": 57.58,
    "HUMIDITY_202": 64.94,
    "HUMIDITY_HI_202": 75.83,
    "HUMIDITY_LO_202": 56.79,
    "HUMIDITY_203": 67.57,
    "HUMIDITY_HI_203": 75.63,
    "HUMIDITY_LO_203": 58.61,
    "HUMIDITY_301": 66.34,
    "HUMIDITY_HI_301": 82.98,
    "HUMIDITY_LO_301": 58.93,
    "HUMIDITY_302": 65.89,
    "HUMIDITY_HI_302": 96.13,
    "HUMIDITY_LO_302": 57.63,
    "HUMIDITY_303": 67.44,
    "HUMIDITY_HI_303": 98.01,
    "HUMIDITY_LO_303": 53.09,
    "HUMIDITY_401": 66.53,
    "HUMIDITY_HI_401": 76.66,
    "HUMIDITY_LO_401": 58.06,
    "HUMIDITY_402": 61.95,
    "HUMIDITY_HI_402": 91.06,
    "HUMIDITY_LO_402": 51.49,
    "HUMIDITY_403": 60.62,
    "HUMIDITY_HI_403": 85.57,
    "HUMIDITY_LO_403": 50.93,
    "OUTER_TEMP": 31.0,
    "OUTER_TEMP_HI": 36.1,
    "OUTER_TEMP_LO": 26.2,
    "NH3_101": 221,
    "NH3_HI_101": 383,
    "NH3_LO_101": 144,
    "NH3_102": 216,
    "NH3_HI_102": 322,
    "NH3_LO_102": 191,
    "NH3_103": 224,
    "NH3_HI_103": 397,
    "NH3_LO_103": 91,
    "NH3_201": 240,
    "NH3_HI_201": 298,
    "NH3_LO_201": 76,
    "NH3_202": 230,
    "NH3_HI_202": 295,
    "NH3_LO_202": 86,
    "NH3_203": 223,
    "NH3_HI_203": 284,
    "NH3_LO_203": 44,
    "NH3_301": 230,
    "NH3_HI_301": 285,
    "NH3_LO_301": 31,
    "NH3_302": 237,
    "NH3_HI_302": 395,
    "NH3_LO_302": 196,
    "NH3_303": 211,
    "NH3_HI_303": 304,
    "NH3_LO_303": 93,
    "NH3_401": 226,
    "NH3_HI_401": 375,
    "NH3_LO_401": 178,
    "CO2_101": 239,
    "CO2_HI_101": 262,
    "CO2_LO_101": 187,
    "CO2_102": 228,
    "CO2_HI_102": 302,
    "CO2_LO_102": 175,
    "CO2_103": 228,
    "CO2_HI_103": 301,
    "CO2_LO_103": 41,
    "CO2_201": 237,
    "CO2_HI_201": 297,
    "CO2_LO_201": 170,
    "CO2_202": 230,
    "CO2_HI_202": 329,
    "CO2_LO_202": 128,
    "CO2_203": 238,
    "CO2_HI_203": 396,
    "CO2_LO_203": 104,
    "CO2_301": 229,
    "CO2_HI_301": 343,
    "CO2_LO_301": 91,
    "CO2_302": 233,
    "CO2_HI_302": 362,
    "CO2_LO_302": 82,
    "CO2_303": 240,
    "CO2_HI_303": 289,
    "CO2_LO_303": 180,
    "CO2_401": 213,
    "CO2_HI_401": 338,
    "CO2_LO_401": 185,
    "FS_101": "15:42",
    "FE_101": "16:25",
    "FS_102": "16:54",
    "FE_102": "17:47",
    "FS_201": "16:37",
    "FE_201": "17:17",
    "FS_202": "14:39",
    "FE_202": "15:32",
    "FS_301": "16:41",
    "FE_301": "17:19",
    "FS_302": "15:03",
    "FE_302": "15:45",
    "FS_401": "15:39",
    "FE_401": "16:19",
    "FS_402": "17:12",
    "FE_402": "18:10",
    "F_001": 234.08,
    "F_002": 255.46,
    "W_001": 18,
    "W_002": 22
}
