{
  "key": "-----BEGIN RSA PRIVATE KEY-----\nMIIEowIBAAKCAQEAkc6zIM6NSLNSXWoHQ9+Q/Kro37Sx4O/TKSCfIwGRyxr1JnnL\n3hmU018DS8K096q2aqrjPBnrBpx2PFpLkoxdoVLi4V6X3RnAGl4EDMrXvmd8Su6m\nZIQ96xDA5OSMnIAxAiPqCRHRCptDlEQTwG1FXULUuVH46ZhENGx7thRg3K+4+yKX\nb9YBYctINCxM5Wn2nqgHpIa846hJMEG8uXmaXQzmL5usoY4JrkrNUgLTHCfARX2K\nZOHLxQBbdc6/xh4p8s/SjjR4W4hG4nEBwWna20gp9SedygQyGuwDHLoFhmVgtAk0\nqKY8mXYxAuDzwe4hEeSAgUvARjac4zktgli+uQIDAQABAoIBAQCCUzDE+BpMiwvp\ntyW7Qw9C6DiyC76agYJKVoAnN/XqhrPsqhzQ7iiaLWiyxNwgKxRVj10AkWIDTMJZ\n+5Nk79WYpo9oRbaTx7pvVu1jycLAy5rLFzjey1zUyOrBLI+KKwKjGRrM9IHWayUi\nVx8YdhLz4xJkeqJzmMgN25FQFDLnzUeaBiCuEdeBzd2J0zP7B5CZzMFhHYgT1XGY\nLm5jIMVss7Au0x/rDiCSCb/6pG484I3q3OPih0XeTSB79+41qz8pZ6M1+36Dy3bf\n87D8tqiJ2Ubj+DV1xbioLcFW0NJJrlqb+6MmUFpTUoW/NjrsuS5wykVc2k1IEJsg\n/KnCGNoBAoGBAMY/XVaVQiaPMzniTlxfHdFQL0qfhLZ8Cij5WwAD0r5oewcXogVw\nZV9p1lhXqx4RZgIUaE2xNFqCogk3Nq3zeMfKX7ZQoRwnybImtkPmX+sZQFMChts1\ndHWKJvQckE8ZTQvqenYgq5KYdGPx5HXlqBq7921xn7skXuYqyLFVr9vhAoGBALxI\nh0e9jo9VJz7SdCVFu8WlDIapvpq+BPpD0dPSQ1is9ESYOjLEnE/j3MiEiV3kyOFk\nZ06WYhJN9DeUzLH+cmw7nqsNjWWgoivnC3kuDHl8/YgIgmOvWsjsy+eNZlKx7qn/\nMCiWoWCTmUTY2uJGkyeIOXT1XVQybrw/CPWjOv3ZAoGAAcjkQDlLxSkY3vaImhBJ\nJm9AXb2d5j6roL7N8OwX45rxMJkn3kCqyPcc9OKlKboiXvZsEfb8b6wpZUfX+Czu\n822A+xUyvhwllrL+hRH33xf1Gko1iJesmrpJq3zuV6f0p5zOyW113fX9ZkDxO5Z7\nsvHqQlP5iifDqvLLp70LvkECgYAg51fk3KaWO95g5yxu+xHGh4J54h4yMrTx+3om\n1173lzoU5rl898kNWRfTXv4Wj43ffclj/XnkEwVz1Sg0ju/2JDElWXf1Y64TmAv0\nQGzjqkkwRbRrsVBfPqqfq6FPIFNCGBuVbEWFeCXX10HhO04qIW9RFjQaK7oYYbey\nHbWIeQKBgALJ+WnEuSIYSuANHmu1DY5SnjuuVt7WHhcQND5is0hB0XwEhMoNMJV4\nn83L8AEgDYy/uRwBgbkRTGImAbOGVRGiN8nzdwxRdNxG9Nni3h847jy4KAcEeNDq\nwt920kexpHIb95HuMvZqLnlBNnFaG+/rgZ4p7FZxGZA8XxZsSsGc\n-----END RSA PRIVATE KEY-----",
  "pub": "-----BEGIN PUBLIC KEY-----\nMIIBIjANBgkqhkiG9w0BAQEFAAOCAQ8AMIIBCgKCAQEAkc6zIM6NSLNSXWoHQ9+Q\n/Kro37Sx4O/TKSCfIwGRyxr1JnnL3hmU018DS8K096q2aqrjPBnrBpx2PFpLkoxd\noVLi4V6X3RnAGl4EDMrXvmd8Su6mZIQ96xDA5OSMnIAxAiPqCRHRCptDlEQTwG1F\nXULUuVH46ZhENGx7thRg3K+4+yKXb9YBYctINCxM5Wn2nqgHpIa846hJMEG8uXma\nXQzmL5usoY4JrkrNUgLTHCfARX2KZOHLxQBbdc6/xh4p8s/SjjR4W4hG4nEBwWna\n20gp9SedygQyGuwDHLoFhmVgtAk0qKY8mXYxAuDzwe4hEeSAgUvARjac4zktgli+\nuQIDAQAB\n-----END PUBLIC KEY-----"
}