{
  "key": "-----BEGIN RSA PRIVATE KEY-----\nMIIEowIBAAKCAQEAgP+fAHdTbrf6zTA/8CbX1rR4+qRKG9SS3OUU1Enc8VgNtQQh\nez8GvymnjjTfHfSYDZZvhsBwSu0HFj6WUE1UrIRu33zb/g1DC3ltqZZ0nibMdYRz\nrejIbMMR53KBtpZyJ4xWEZEAT8q43cNgVYH+AsgK83ZUVhg8DAm1HJZK65h/SIy6\n09g835tk3fvQ7DyxCANJl8KkBGC7fHBJZFlj4tLESE0WSeB87wW/xpIcrx6l0vbW\nCpqoJjNQRSdUj8GbEcaZJdLXnUOCt4mdN3L2YriluyqQLSA0X993h4w4diiqsKHH\nUgcFFYPDy7s3YyKymM6AS1mGXiwucONz/IDYhQIDAQABAoIBAAK65jeRTu+57xHm\nooPHnqvJmAHd9j+OiSkpo/42LfnhnjCljLvaAp+LFyO4VLyCj7FB7MxSSE4dpBfB\nbVb3vAIGr34FW3aN+0xD3qFHMOKj+ZHHItecZJmAq2FVmA8wMexKWQv4IKSPqsfu\nuZw1qxWN/EVYzMIhsyuiDPY07BL+WIG9rs/S9PFonDIBVvw3BUxd0IeVcRm0aIvD\nW4SrTgeEBz5JeKVXTkkr3LkCKyz5+ZGLfKy/KhMNX4F6GC4msKJCARoFBw3HXniT\n0WWP/wxs+vehco0tS1Xk3UGbOWC7gpX+86DiTM79N21RfPMv7ntvQ9ORcVv17DZD\nleh5CUUCgYEAx0f4B/iGrTlfUBO/orrzpoUVxoR6I8dlG9qeYpKcq1CR3bcJ320c\nu2l6kOvzR+fj3qVdtDwJOe1esxoH7X7/6eKrhv0igQaA4Ni8Ud0tGNLAf7XX1BIp\n5yPQMUyVl/9vuPt9Lw0S1R77UwYEvywCJxEX/P9cNBFQ623RgyhBWwsCgYEApba3\nqkXb2QqKCxQmN99VroYLboOxNgN8xuoBSNJS1TaC1kRZYA5sVpEk80LsUSb+gd44\n7hV5GaYDk5kzZkgm4HGePA1ZNQhgw3jdipcb2uaHHlcyN3fUbjzyFZntxTOPLB+K\njB41B03Ul2765VtTLbNRgRzfzbQqCq7xbKpcVK8CgYA7TCn8zTHd55156XZziKep\nnB4/pPnnHZTzddj9Qd0GiQHudGGmrwQGrDtBVkRc2B6RCKnaUKb6KqysJInJXKnv\nwXgCwd37gKDmxvc6cNLTeRq4pbZkL0dytNBlawF0ahindYXpcz1wVzi3mqnc7M5z\nK3301VNtVt26QEJAgcD4wwKBgAREAtBQQguBOPJ2D1HK3vLCIpMysqIYTuLz7RqJ\nx3YTlCSd18sgM+u6ir/0Tg78uPpw1PhT9y0Q1/C5tdgBLXcDlbYoBc7Wq178wn8p\nyp7E5l+CkRlabU51JSonLzavUBUrrq5SrLzGZR2MzsqOokJ/5i4zpxMtexORU0ef\nzwajAoGBAKS8sUt32kR58n94vy9X8CibIYrTrvzoZGlEf6nUFODBDmJdZNB+cCDq\nuLTJITuinuenNjo6MrykcOUZi2K+6XA8y2zBalK8khntATYMekGASx50dqTd11Eu\nZDG+rQV0VIat5RDXxW80dBybcmATnBBjJ7hLrjJlXSuQ2k3DXydE\n-----END RSA PRIVATE KEY-----",
  "pub": "-----BEGIN PUBLIC KEY-----\nMIIBIjANBgkqhkiG9w0BAQEFAAOCAQ8AMIIBCgKCAQEAgP+fAHdTbrf6zTA/8CbX\n1rR4+qRKG9SS3OUU1Enc8VgNtQQhez8GvymnjjTfHfSYDZZvhsBwSu0HFj6WUE1U\nrIRu33zb/g1DC3ltqZZ0nibMdYRzrejIbMMR53KBtpZyJ4xWEZEAT8q43cNgVYH+\nAsgK83ZUVhg8DAm1HJZK65h/SIy609g835tk3fvQ7DyxCANJl8KkBGC7fHBJZFlj\n4tLESE0WSeB87wW/xpIcrx6l0vbWCpqoJjNQRSdUj8GbEcaZJdLXnUOCt4mdN3L2\nYriluyqQLSA0X993h4w4diiqsKHHUgcFFYPDy7s3YyKymM6AS1mGXiwucONz/IDY\nhQIDAQAB\n-----END PUBLIC KEY-----"
}