<?xml version="1.0" encoding="UTF-8" standalone="no"?>
<svg
   width="330"
   height="330"
   viewBox="0 0 17.179742 17.183364"
   version="1.1"
   id="svg122"
   sodipodi:docname="eagle-scout.svg"
   inkscape:version="1.1 (c4e8f9ed74, 2021-05-24)"
   xmlns:inkscape="http://www.inkscape.org/namespaces/inkscape"
   xmlns:sodipodi="http://sodipodi.sourceforge.net/DTD/sodipodi-0.dtd"
   xmlns="http://www.w3.org/2000/svg"
   xmlns:svg="http://www.w3.org/2000/svg">
  <defs
     id="defs126" />
  <sodipodi:namedview
     id="namedview124"
     pagecolor="#ffffff"
     bordercolor="#666666"
     borderopacity="1.0"
     inkscape:pageshadow="2"
     inkscape:pageopacity="0.0"
     inkscape:pagecheckerboard="0"
     showgrid="false"
     height="330px"
     inkscape:zoom="1.9753735"
     inkscape:cx="184.77518"
     inkscape:cy="152.12313"
     inkscape:window-width="2560"
     inkscape:window-height="1360"
     inkscape:window-x="1920"
     inkscape:window-y="0"
     inkscape:window-maximized="1"
     inkscape:current-layer="svg122" />
  <g
     id="g188"
     transform="matrix(0.12963579,0,0,0.12963579,1.6521526,0.15381847)">
    <ellipse
       cx="53.516998"
       cy="65.088997"
       rx="53.516998"
       ry="65.088997"
       id="ellipse2" />
    <ellipse
       cx="53.516998"
       cy="65.088997"
       rx="51.657001"
       ry="62.609001"
       fill="#999999"
       id="ellipse4" />
    <ellipse
       cx="53.518002"
       cy="65.087997"
       rx="46.698002"
       ry="56.823002"
       fill="#595959"
       id="ellipse6" />
    <path
       d="m 53.518,102.695 c -17.004,0 -30.788,-16.837 -30.788,-37.606 0,-9.442 2.85,-18.071 7.555,-24.676 -0.324,-1.347 0.191,-2.156 0.213,-2.188 0.537,-0.588 1.25,-0.568 1.821,-0.408 5.521,-6.405 12.983,-10.335 21.199,-10.335 8.206,0 15.661,3.922 21.18,10.314 0.558,-0.14 1.232,-0.132 1.745,0.43 0.021,0.031 0.504,0.802 0.231,2.082 4.751,6.618 7.631,15.288 7.631,24.781 0,20.769 -13.784,37.606 -30.787,37.606 z"
       fill="#595959"
       id="path8" />
    <path
       d="m 76.674,40.308 c -0.008,0.038 -0.01,0.07 -0.019,0.108 -0.126,0.521 -0.378,1.141 -0.835,1.848 0.326,0.046 0.723,0.17 0.935,0.504 0.22,0.349 0.177,0.797 -0.13,1.334 -0.024,0.05 -0.209,0.405 -0.55,0.935 3.356,5.626 5.338,12.555 5.338,20.052 0,14.843 -7.763,27.464 -18.596,32.146 -2.909,1.257 -6.038,1.948 -9.299,1.948 -3.185,0 -6.241,-0.662 -9.092,-1.862 C 33.486,92.712 25.623,80.026 25.623,65.09 c 0,-7.464 1.962,-14.365 5.291,-19.978 a 11.82,11.82 0 0 1 -0.599,-1.009 c -0.306,-0.537 -0.35,-0.985 -0.129,-1.334 0.211,-0.334 0.608,-0.458 0.935,-0.504 -0.457,-0.707 -0.709,-1.327 -0.835,-1.848 L 30.285,40.414 C 25.58,47.018 22.73,55.647 22.73,65.09 c 0,20.769 13.784,37.606 30.788,37.606 17.004,0 30.787,-16.837 30.787,-37.606 0,-9.494 -2.88,-18.164 -7.631,-24.782 z M 34.895,39.722 c 2.743,-3.008 5.972,-5.366 9.531,-6.865 2.851,-1.201 5.907,-1.862 9.092,-1.862 3.261,0 6.39,0.691 9.299,1.948 3.459,1.495 6.604,3.803 9.284,6.731 a 34.19,34.19 0 0 0 1.556,-1.423 c 0.032,-0.021 0.476,-0.313 1.041,-0.455 -5.519,-6.392 -12.974,-10.314 -21.18,-10.314 -8.216,0 -15.678,3.93 -21.199,10.335 0.527,0.147 0.934,0.413 0.964,0.434 0.534,0.521 1.074,1.01 1.612,1.471 z"
       fill="#cccccc"
       id="path10" />
    <path
       d="m 74.772,48.946 c -0.233,0.575 -0.612,1.125 -1.144,1.655 0.086,0.219 0.284,0.885 -0.068,1.782 -0.284,0.722 -0.84,1.409 -1.663,2.056 0.115,0.216 0.355,0.804 0.081,1.585 -0.19,0.543 -0.583,1.058 -1.175,1.543 0.163,0.322 0.622,1.408 0.036,2.506 -0.359,0.672 -1.033,1.201 -2.015,1.585 0.262,0.165 0.498,0.38 0.601,0.656 0.074,0.2 0.111,0.513 -0.137,0.87 -0.55,0.794 -1.082,1.485 -1.813,1.856 0.095,0.281 0.192,0.772 -0.046,1.259 -0.274,0.561 -0.899,0.928 -1.847,1.097 -0.068,0.029 -0.2,0.073 -0.409,0.103 0.034,0.343 0.01,0.95 -0.456,1.501 -0.39,0.462 -0.997,0.771 -1.812,0.93 0.083,0.496 0.201,1.578 -0.09,2.478 v 0.475 c 0.622,0.723 1.114,1.356 1.146,1.397 0.054,0.081 0.572,0.97 0.008,1.582 v 3.978 c 0,0 -0.217,0.394 -0.809,0.39 a 3.032,3.032 0 0 1 -0.345,0.19 v 3.275 a 39.83,39.83 0 0 0 1.524,-0.219 c 0.076,-0.56 0.1,-1.279 0.1,-1.895 0,-0.682 -0.025,-1.223 -0.025,-1.233 l -0.001,-0.017 c 0,-0.175 0.123,-0.325 0.295,-0.36 3.274,-0.654 11.809,-3.61 11.895,-3.64 a 0.366,0.366 0 0 1 0.467,0.227 c 0.067,0.191 -2.171,1.223 -2.18,1.27 -0.375,1.875 -1.222,2.801 -1.812,3.236 0.129,0.854 -0.306,1.763 -0.328,1.815 -0.023,0.055 -0.586,1.358 -1.208,2.098 -0.556,0.661 -0.816,1.079 -0.881,1.803 -0.089,0.981 -0.914,1.763 -1.476,1.95 l -0.05,0.012 c -0.04,0.008 -2.522,0.442 -6.319,0.801 v 7.693 C 73.649,92.555 81.412,79.933 81.412,65.09 c 0,-7.497 -1.982,-14.425 -5.338,-20.052 a 17.49,17.49 0 0 1 -1.246,1.695 c 0.019,0.038 0.462,0.938 -0.056,2.213 z M 62.816,32.942 v 12.576 c 0.139,-0.063 0.274,-0.114 0.4,-0.154 0.023,-0.01 4.383,-1.816 8.884,-5.691 -2.68,-2.928 -5.825,-5.235 -9.284,-6.731 z"
       fill="#333333"
       id="path12" />
    <path
       d="m 34.895,39.722 c 4.481,3.841 8.805,5.633 8.829,5.643 0.216,0.068 0.46,0.17 0.702,0.316 V 32.856 c -3.559,1.5 -6.788,3.858 -9.531,6.866 z M 38.13,88.74 38.081,88.728 c -0.562,-0.187 -1.387,-0.969 -1.477,-1.95 -0.065,-0.725 -0.325,-1.142 -0.881,-1.803 -0.622,-0.739 -1.185,-2.042 -1.208,-2.098 -0.023,-0.053 -0.458,-0.962 -0.328,-1.815 -0.591,-0.435 -1.438,-1.361 -1.812,-3.236 -0.01,-0.047 -2.248,-1.079 -2.181,-1.27 a 0.367,0.367 0 0 1 0.467,-0.227 c 0.086,0.03 8.62,2.985 11.895,3.64 a 0.368,0.368 0 0 1 0.295,0.36 v 0.017 c -10e-4,0.011 -0.025,0.552 -0.025,1.233 0,0.616 0.024,1.335 0.1,1.895 0.276,0.046 0.788,0.126 1.5,0.217 v -3.149 a 3.188,3.188 0 0 1 -0.647,-0.313 c -0.592,0.004 -0.808,-0.39 -0.808,-0.39 v -3.978 c -0.565,-0.612 -0.048,-1.501 0.007,-1.582 0.033,-0.043 0.59,-0.761 1.272,-1.544 -0.451,-0.947 -0.31,-2.247 -0.217,-2.806 -0.814,-0.159 -1.421,-0.468 -1.811,-0.93 A 1.998,1.998 0 0 1 41.765,67.498 1.573,1.573 0 0 1 41.357,67.395 C 40.409,67.226 39.784,66.859 39.51,66.298 39.272,65.811 39.368,65.32 39.464,65.039 38.733,64.668 38.2,63.977 37.651,63.183 c -0.248,-0.357 -0.212,-0.67 -0.137,-0.87 0.103,-0.276 0.339,-0.492 0.601,-0.656 -0.981,-0.384 -1.656,-0.913 -2.015,-1.585 -0.586,-1.098 -0.128,-2.184 0.035,-2.506 -0.592,-0.485 -0.984,-1 -1.175,-1.543 -0.274,-0.781 -0.034,-1.369 0.081,-1.585 C 34.219,53.791 33.662,53.104 33.378,52.382 33.026,51.485 33.224,50.819 33.311,50.6 32.78,50.071 32.401,49.52 32.167,48.945 31.65,47.67 32.093,46.77 32.111,46.732 a 17.248,17.248 0 0 1 -1.197,-1.621 c -3.329,5.613 -5.291,12.514 -5.291,19.978 0,14.937 7.862,27.622 18.803,32.231 V 89.54 C 40.642,89.181 38.17,88.748 38.13,88.74 Z"
       fill="#595959"
       id="path14" />
    <path
       d="m 53.518,30.994 c -3.185,0 -6.241,0.661 -9.092,1.862 V 45.68 c 0.842,0.51 1.65,1.582 1.133,3.845 -0.512,2.239 -0.158,3.228 -0.154,3.237 0,0 0.363,1.488 1.012,1.881 0.803,0.487 1.911,0.172 2.595,-0.067 0.365,-0.738 0.826,-1.465 1.413,-2.166 l 0.266,-1.121 C 50.098,48.58 48.991,48.421 49,48.421 c -0.269,-0.006 -0.467,0.048 -0.574,0.173 -0.278,0.324 -0.178,0.687 -0.27,0.763 -0.093,0.077 -1.158,-0.111 -1.604,-0.878 -0.374,-0.643 0.008,-1.374 0.02,-1.399 0.47,-1.045 2.102,-1.033 2.782,-0.98 0.585,-1.327 2.297,-1.471 2.375,-1.477 a 0.38,0.38 0 0 1 0.134,0.016 c 0.024,0.008 2.49,0.763 5.359,0.126 a 0.366,0.366 0 0 1 0.377,0.573 c -0.368,0.508 -0.906,1.441 -0.965,1.997 0.292,0.228 0.617,0.626 0.617,1.164 0,0.1 -0.048,0.377 -0.048,0.407 0,0.125 0.066,0.245 0.209,0.475 0.208,0.334 0.475,0.766 0.475,1.479 0,0.147 -0.021,0.316 -0.047,0.489 0.146,0.341 0.634,1.574 0.659,2.772 0.047,0.101 0.161,0.348 0.302,0.711 0.504,0.1 1.18,0.137 1.721,-0.191 0.648,-0.393 1.011,-1.881 1.011,-1.881 0.004,-0.01 0.358,-0.998 -0.154,-3.237 -0.579,-2.535 0.505,-3.579 1.437,-4.007 V 32.942 c -2.909,-1.257 -6.037,-1.948 -9.298,-1.948 z m 0.115,53.264 c 4.184,-0.027 7.355,-0.333 9.183,-0.564 v -3.275 c -0.31,0.147 -0.754,0.299 -1.197,0.238 -0.182,0.295 -0.582,0.813 -1.257,1.046 -0.532,0.182 -1.117,0.125 -1.737,-0.121 -0.117,0.289 -0.327,0.646 -0.728,0.866 -0.473,0.259 -1.074,0.273 -1.757,-0.007 -1.102,1.263 -2.651,1.22 -2.671,1.218 -0.02,0.002 -1.772,0.105 -2.671,-1.218 -0.683,0.28 -1.285,0.266 -1.757,0.007 -0.401,-0.22 -0.61,-0.578 -0.728,-0.866 -0.62,0.246 -1.205,0.303 -1.737,0.121 C 45.9,81.471 45.5,80.952 45.319,80.657 45.006,80.7 44.692,80.636 44.424,80.543 v 3.149 c 1.826,0.232 5.007,0.539 9.209,0.566 z m 9.056,-11.523 0.127,0.147 v -0.475 a 2.59,2.59 0 0 1 -0.127,0.328 z M 55.066,89.99 v 4.829 a 1.488,1.488 0 0 1 -2.975,0 c 0,-0.555 0.308,-1.034 0.758,-1.289 V 90.001 A 104.796,104.796 0 0 1 44.426,89.54 v 7.781 c 2.851,1.201 5.907,1.862 9.092,1.862 3.261,0 6.39,-0.691 9.299,-1.948 v -7.693 c -2.212,0.208 -4.868,0.391 -7.751,0.448 z"
       fill="#ffffff"
       id="path16" />
    <path
       d="m 31.12,42.264 c -0.327,0.046 -0.723,0.17 -0.935,0.504 -0.221,0.349 -0.177,0.797 0.129,1.334 a 12,12 0 0 0 0.599,1.009 c 0.292,0.448 0.686,1.006 1.197,1.621 -0.019,0.038 -0.461,0.938 0.056,2.213 0.233,0.575 0.612,1.125 1.144,1.655 -0.086,0.219 -0.285,0.885 0.067,1.782 0.284,0.722 0.841,1.409 1.663,2.056 -0.115,0.216 -0.355,0.804 -0.081,1.585 0.19,0.543 0.583,1.058 1.175,1.543 -0.163,0.322 -0.621,1.408 -0.035,2.506 0.359,0.672 1.033,1.201 2.015,1.585 -0.262,0.165 -0.498,0.38 -0.601,0.656 -0.075,0.2 -0.111,0.513 0.137,0.87 0.55,0.794 1.083,1.485 1.813,1.856 -0.096,0.281 -0.192,0.772 0.046,1.259 0.274,0.561 0.899,0.928 1.847,1.097 0.068,0.029 0.199,0.073 0.408,0.103 -0.033,0.343 -0.009,0.95 0.457,1.501 0.39,0.462 0.997,0.771 1.811,0.93 -0.092,0.559 -0.234,1.858 0.217,2.806 a 36.995,36.995 0 0 0 -1.272,1.544 c -0.055,0.081 -0.572,0.97 -0.007,1.582 v 3.978 c 0,0 0.215,0.394 0.808,0.39 0.203,0.132 0.878,0.52 1.542,0.428 0.182,0.295 0.581,0.813 1.257,1.046 0.532,0.182 1.117,0.125 1.737,-0.121 0.117,0.289 0.326,0.646 0.728,0.866 0.472,0.259 1.074,0.273 1.757,-0.007 0.898,1.323 2.651,1.22 2.671,1.218 0.02,0.002 1.569,0.045 2.671,-1.218 0.683,0.28 1.284,0.266 1.757,0.007 0.401,-0.22 0.611,-0.578 0.728,-0.866 0.62,0.246 1.205,0.303 1.737,0.121 0.676,-0.232 1.076,-0.751 1.257,-1.046 0.443,0.061 0.887,-0.091 1.197,-0.238 0.154,-0.073 0.277,-0.146 0.345,-0.19 0.592,0.004 0.809,-0.39 0.809,-0.39 v -3.978 c 0.564,-0.612 0.046,-1.501 -0.008,-1.582 -0.034,-0.043 -0.589,-0.76 -1.272,-1.544 0.45,-0.946 0.31,-2.248 0.217,-2.806 0.814,-0.159 1.422,-0.468 1.812,-0.93 0.466,-0.551 0.49,-1.158 0.456,-1.501 0.209,-0.029 0.341,-0.073 0.409,-0.103 0.947,-0.169 1.572,-0.536 1.847,-1.097 0.238,-0.487 0.142,-0.978 0.046,-1.259 0.731,-0.371 1.263,-1.062 1.813,-1.856 0.248,-0.357 0.211,-0.67 0.137,-0.87 -0.103,-0.276 -0.339,-0.492 -0.601,-0.656 0.981,-0.384 1.656,-0.913 2.015,-1.585 0.586,-1.098 0.127,-2.184 -0.036,-2.506 0.592,-0.485 0.985,-1 1.175,-1.543 0.274,-0.781 0.034,-1.369 -0.081,-1.585 0.822,-0.647 1.379,-1.334 1.663,-2.056 0.352,-0.897 0.154,-1.563 0.068,-1.782 0.531,-0.529 0.91,-1.08 1.144,-1.655 0.517,-1.275 0.074,-2.175 0.056,-2.213 a 17.66,17.66 0 0 0 1.246,-1.695 c 0.341,-0.529 0.526,-0.885 0.55,-0.935 0.307,-0.537 0.35,-0.985 0.13,-1.334 -0.212,-0.334 -0.608,-0.458 -0.935,-0.504 0.457,-0.707 0.709,-1.327 0.835,-1.848 0.009,-0.038 0.011,-0.071 0.019,-0.108 0.272,-1.28 -0.211,-2.051 -0.231,-2.082 -1.032,-1.131 -2.723,-0.018 -2.786,0.025 -4.991,4.859 -10.415,7.102 -10.44,7.114 -0.972,0.305 -2.501,1.249 -1.836,4.161 0.512,2.239 0.158,3.228 0.154,3.237 0,0 -0.363,1.488 -1.011,1.881 -0.542,0.328 -1.217,0.291 -1.721,0.191 a 10.467,10.467 0 0 0 -0.302,-0.711 c -0.025,-1.198 -0.513,-2.432 -0.659,-2.772 0.025,-0.172 0.047,-0.342 0.047,-0.489 0,-0.713 -0.267,-1.145 -0.475,-1.479 -0.143,-0.23 -0.209,-0.35 -0.209,-0.475 0,-0.03 0.048,-0.307 0.048,-0.407 0,-0.538 -0.325,-0.936 -0.617,-1.164 0.059,-0.556 0.597,-1.489 0.965,-1.997 a 0.368,0.368 0 0 0 -0.377,-0.573 c -2.869,0.637 -5.334,-0.118 -5.359,-0.126 a 0.38,0.38 0 0 0 -0.134,-0.016 c -0.079,0.005 -1.79,0.15 -2.375,1.477 -0.68,-0.053 -2.312,-0.065 -2.782,0.98 -0.012,0.025 -0.394,0.756 -0.02,1.399 0.446,0.767 1.512,0.955 1.604,0.878 0.092,-0.077 -0.009,-0.439 0.27,-0.763 0.107,-0.125 0.306,-0.179 0.574,-0.173 -0.009,0 1.099,0.159 1.691,2.868 l -0.266,1.121 c -0.586,0.7 -1.047,1.428 -1.413,2.166 -0.685,0.239 -1.792,0.554 -2.595,0.067 -0.649,-0.393 -1.012,-1.881 -1.012,-1.881 -0.004,-0.01 -0.358,-0.998 0.154,-3.237 0.666,-2.913 -0.867,-3.857 -1.835,-4.161 -0.023,-0.01 -4.348,-1.802 -8.829,-5.643 a 34.272,34.272 0 0 1 -1.613,-1.471 c -0.063,-0.042 -1.753,-1.156 -2.785,-0.025 -0.021,0.032 -0.537,0.841 -0.213,2.188 l 0.001,0.003 c 0.122,0.519 0.374,1.138 0.831,1.845 z"
       id="path18" />
    <path
       d="m 44.426,83.691 a 38.36,38.36 0 0 1 -1.5,-0.217 c -0.076,-0.56 -0.1,-1.279 -0.1,-1.895 0,-0.682 0.024,-1.223 0.025,-1.233 v -0.017 a 0.367,0.367 0 0 0 -0.295,-0.36 c -3.274,-0.654 -11.809,-3.61 -11.895,-3.64 a 0.367,0.367 0 0 0 -0.467,0.227 c -0.067,0.191 2.171,1.223 2.181,1.27 0.375,1.875 1.221,2.801 1.812,3.236 -0.13,0.854 0.305,1.763 0.328,1.815 0.023,0.055 0.586,1.358 1.208,2.098 0.556,0.661 0.815,1.079 0.881,1.803 0.09,0.981 0.914,1.763 1.477,1.95 l 0.049,0.012 c 0.066,0.012 6.577,1.156 14.719,1.261 v 3.529 a 1.481,1.481 0 0 0 0.73,2.776 c 0.821,0 1.487,-0.667 1.487,-1.487 V 89.99 C 62.9,89.834 69.072,88.752 69.135,88.74 l 0.05,-0.012 c 0.562,-0.187 1.386,-0.969 1.476,-1.95 0.065,-0.725 0.325,-1.142 0.881,-1.803 0.623,-0.739 1.185,-2.042 1.208,-2.098 0.022,-0.053 0.458,-0.962 0.328,-1.815 0.591,-0.435 1.438,-1.361 1.812,-3.236 0.009,-0.047 2.247,-1.079 2.18,-1.27 a 0.367,0.367 0 0 0 -0.467,-0.227 c -0.086,0.03 -8.62,2.985 -11.895,3.64 a 0.368,0.368 0 0 0 -0.294,0.377 c 0,0.011 0.025,0.552 0.025,1.233 0,0.616 -0.024,1.335 -0.1,1.895 a 39.83,39.83 0 0 1 -1.524,0.219 c -1.828,0.232 -4.999,0.538 -9.183,0.564 -4.201,-0.026 -7.382,-0.333 -9.206,-0.566 z"
       id="path20" />
    <path
       d="m 60.883,55.283 c 1.069,-0.592 1.508,-2.78 1.508,-3.585 0,-0.577 -0.07,-1.349 -0.295,-2.337 -0.408,-1.782 0.043,-2.891 1.368,-3.306 0.055,-0.022 5.558,-2.285 10.65,-7.228 0.099,-0.064 1.264,-0.733 1.773,-0.105 0.078,0.169 0.265,0.699 0.041,1.575 -0.405,1.576 -2.114,4.152 -7.902,7.534 -0.067,-0.237 -0.538,-0.696 -0.645,-0.719 0.122,-0.504 0.111,-0.831 0.109,-0.86 l -0.002,-0.005 c 3.854,-2.301 6.647,-5.067 6.505,-5.847 -0.036,-0.199 -0.384,-0.119 -0.519,0.034 -0.034,0.039 -3.463,3.908 -8.239,6.195 -0.077,0.038 -1.943,0.94 -2.18,2.517 -0.243,1.623 1.082,2.648 1.197,2.718 -1.801,1.527 -1.144,3.001 -1.082,3.104 l -3.714,2.035 a 15.517,15.517 0 0 0 -0.385,-1.398 c 0.561,0.05 1.223,0.004 1.812,-0.322 z m 1.752,3.397 a 0.367,0.367 0 0 0 0.47,0.222 c 1.916,-0.684 3.092,-1.556 3.806,-2.431 a 3.348,3.348 0 0 1 -0.492,1.819 c -0.748,1.237 -2.279,2.112 -4.55,2.6 a 0.368,0.368 0 0 0 0.155,0.719 c 0.952,-0.205 1.785,-0.478 2.502,-0.815 a 1.2,1.2 0 0 1 -0.112,0.929 c -0.337,0.583 -1.378,1.305 -4.416,1.439 a 0.367,0.367 0 0 0 0.032,0.733 14.37,14.37 0 0 0 2.257,-0.258 c -0.062,0.24 -0.2,0.554 -0.513,0.829 -0.574,0.506 -1.566,0.696 -2.876,0.575 0.984,-2.325 1.062,-4.651 0.821,-6.553 l 4.173,-3.057 c 0.689,0.124 2.265,0.102 3.343,-1.709 -0.01,1.131 -0.614,3.146 -4.376,4.489 a 0.366,0.366 0 0 0 -0.224,0.469 z m -1.623,6.981 c -0.081,0.72 -0.921,0.871 -1.598,0.936 a 8.818,8.818 0 0 0 -0.31,-0.816 c 0.747,0.061 1.376,0.021 1.908,-0.12 z"
       fill="#b3b3b3"
       id="path22" />
    <path
       d="m 65.255,54.489 c -1.121,0.441 -1.476,0.11 -1.5,-0.009 -0.077,-0.386 0.118,-0.989 0.496,-1.537 0.286,-0.415 0.585,-0.674 0.812,-0.791 0.328,0.042 1.552,-0.024 2.267,-1.188 -0.03,0.958 -0.334,2.722 -2.075,3.525 z m 0.571,-3.218 c -0.656,0.403 -1.274,-0.088 -1.268,-0.078 -0.626,-0.661 -0.889,-1.306 -0.78,-1.916 0.214,-1.203 1.766,-1.982 1.777,-1.988 0.398,-0.191 0.783,-0.394 1.16,-0.602 -0.089,0.522 -0.377,1.486 -1.313,2.508 a 0.368,0.368 0 0 0 0.542,0.496 c 0.604,-0.659 1.274,-1.867 1.279,-1.867 0.083,0.05 0.17,0.418 0.155,0.779 -0.061,1.999 -1.537,2.658 -1.552,2.668 z M 47.554,49.078 v -0.001 l 10e-4,0.005 z m 2.539,-0.811 c 0.257,0.081 0.515,0.207 0.735,0.407 a 0.215,0.215 0 0 0 0.305,-0.014 c 0.081,-0.088 -0.67,-0.937 -1.978,-0.954 -0.063,-0.013 -1.173,0.063 -1.523,0.848 -0.671,-0.21 -0.394,-1.167 -0.392,-1.169 0.202,-0.449 1.016,-0.691 1.637,-0.6 0.025,0.013 0.653,0.086 0.969,0.422 a 0.217,0.217 0 0 0 0.306,0.01 c 0.087,-0.082 -0.225,-0.59 -0.214,-0.629 0.265,-0.994 1.512,-1.192 1.781,-1.224 0.402,0.116 2.383,0.606 4.829,0.253 -0.313,0.534 -0.667,1.295 -0.667,1.865 0,0.011 0,0.006 0,0 -0.369,0.04 -0.825,0.103 -1.075,0.053 -0.182,-0.037 -0.484,-0.215 -0.776,-0.387 -0.44,-0.26 -0.895,-0.528 -1.297,-0.562 0,-0.002 -0.408,-0.099 -0.886,-0.053 a 1.394,1.394 0 0 0 -0.413,-0.061 c -0.465,0 -0.842,0.206 -0.842,0.459 0,0.253 0.377,0.46 0.842,0.46 0.379,0 0.696,-0.138 0.802,-0.326 0.233,0.013 0.408,0.051 0.412,0.052 0.319,0.03 0.738,0.277 1.107,0.496 0.346,0.204 0.673,0.396 0.945,0.451 0.454,0.091 1.268,-0.009 1.594,-0.055 a 0.71,0.71 0 0 1 0.224,0.494 c 0,0.047 -0.047,0.322 -0.047,0.404 0,0.347 0.147,0.632 0.319,0.862 0.394,0.525 0.362,1.135 0.362,1.154 H 51.36 c -0.339,-1.41 -0.823,-2.209 -1.267,-2.656 z m 0.98,4.508 c 0,0 0.205,-0.774 0.287,-1.117 h 5.814 c 0.138,0.328 0.597,1.497 0.597,2.557 0,0.056 0.013,0.112 0.038,0.163 0.012,0.024 0.516,1.071 0.887,2.67 a 1.28,1.28 0 0 1 -0.585,-0.153 c 0,0 0.294,0.631 0.68,0.587 0.046,0.229 0.088,0.472 0.126,0.719 A 1.284,1.284 0 0 1 58.22,58.047 c 0,0 0.333,0.713 0.756,0.567 0.067,0.542 0.11,1.117 0.11,1.717 v 0.017 a 1.706,1.706 0 0 1 -1.215,-0.162 c 0,0 0.551,1.183 1.206,0.642 a 11.917,11.917 0 0 1 -0.172,1.598 1.69,1.69 0 0 1 -1.069,-0.188 c 0,0 0.414,0.885 0.95,0.771 -0.137,0.587 -0.323,1.18 -0.574,1.771 a 2.943,2.943 0 0 0 -1.928,-0.44 c -0.023,0.004 -2.344,0.5 -2.573,3.168 l -0.238,3.958 -0.239,-3.958 a 3.44,3.44 0 0 0 -2.573,-3.168 2.96,2.96 0 0 0 -1.367,0.161 10.04,10.04 0 0 1 -0.147,-0.469 c 0.297,0.161 0.673,0.093 1.051,-0.714 0,0 -0.522,0.312 -1.2,0.162 a 12.688,12.688 0 0 1 -0.091,-0.388 c 0.242,-0.005 0.514,-0.199 0.787,-0.782 0,0 -0.377,0.224 -0.902,0.203 a 14.757,14.757 0 0 1 -0.203,-1.639 c 0.148,-0.118 0.303,-0.322 0.457,-0.651 0,0 -0.188,0.114 -0.482,0.174 -0.033,-0.907 0.028,-1.904 0.241,-2.932 0.224,0.123 0.506,0.074 0.791,-0.534 0,0 -0.295,0.177 -0.705,0.15 a 10.307,10.307 0 0 1 2.182,-4.306 z m -5.906,11.69 a 1.651,1.651 0 0 1 -0.513,-0.829 c 0.65,0.134 1.403,0.221 2.257,0.258 a 0.367,0.367 0 0 0 0.032,-0.733 c -3.038,-0.134 -4.078,-0.856 -4.416,-1.439 a 1.2,1.2 0 0 1 -0.112,-0.929 c 0.716,0.337 1.55,0.611 2.501,0.815 a 0.36765371,0.36765371 0 1 0 0.154,-0.719 c -2.271,-0.488 -3.802,-1.363 -4.55,-2.6 A 3.357,3.357 0 0 1 40.028,56.47 c 0.713,0.875 1.889,1.747 3.805,2.431 A 0.367,0.367 0 1 0 44.08,58.21 c -3.761,-1.343 -4.366,-3.358 -4.376,-4.489 1.078,1.811 2.653,1.833 3.343,1.709 l 4.808,3.515 c -0.201,2.816 0.526,5.185 0.778,5.906 -0.065,0.046 -0.131,0.092 -0.193,0.146 -1.509,0.204 -2.641,0.024 -3.273,-0.532 z m 2.668,1.315 c -0.085,0.163 -0.279,0.718 -0.31,0.816 -0.677,-0.064 -1.517,-0.216 -1.598,-0.936 0.533,0.142 1.161,0.182 1.908,0.12 z M 41.537,49.195 C 40.6,48.174 40.312,47.21 40.223,46.687 c 0.377,0.208 0.762,0.411 1.16,0.602 0.012,0.006 1.564,0.785 1.778,1.988 0.109,0.61 -0.154,1.255 -0.78,1.916 0.007,-0.01 -0.612,0.481 -1.268,0.078 -0.015,-0.009 -1.491,-0.669 -1.551,-2.667 -0.016,-0.361 0.071,-0.729 0.154,-0.779 0.005,0 0.675,1.208 1.279,1.867 a 0.36768635,0.36768635 0 1 0 0.542,-0.497 z m 0.339,2.958 c 0.228,0.117 0.527,0.376 0.812,0.791 0.378,0.547 0.573,1.15 0.495,1.537 -0.023,0.119 -0.378,0.45 -1.499,0.009 -1.741,-0.803 -2.045,-2.567 -2.075,-3.525 0.715,1.163 1.938,1.23 2.267,1.188 z"
       fill="#b3b3b3"
       id="path24" />
    <path
       d="m 31.012,40.297 c -0.225,-0.876 -0.038,-1.406 0.041,-1.575 0.51,-0.628 1.674,0.041 1.772,0.105 5.094,4.943 10.596,7.206 10.65,7.228 1.324,0.416 1.775,1.524 1.368,3.306 -0.225,0.988 -0.295,1.76 -0.295,2.337 0,0.805 0.439,2.993 1.508,3.585 0.832,0.46 1.806,0.363 2.57,0.172 a 11.351,11.351 0 0 0 -0.549,1.872 l -4.309,-2.361 c 0.062,-0.102 0.719,-1.577 -1.082,-3.104 0.115,-0.07 1.44,-1.095 1.197,-2.718 -0.236,-1.576 -2.103,-2.479 -2.18,-2.517 -4.776,-2.287 -8.206,-6.156 -8.239,-6.195 -0.133,-0.152 -0.482,-0.233 -0.518,-0.034 -0.143,0.779 2.65,3.545 6.504,5.847 l -0.001,0.005 c -10e-4,0.029 -0.012,0.356 0.109,0.86 -0.106,0.023 -0.578,0.482 -0.645,0.719 -5.787,-3.38 -7.496,-5.956 -7.901,-7.532 z"
       fill="#b3b3b3"
       id="path26" />
    <path
       d="m 30.963,43.757 c -0.162,-0.285 -0.216,-0.5 -0.156,-0.595 0.078,-0.124 0.521,-0.188 0.813,-0.197 1.214,1.555 3.387,3.466 7.208,5.665 v 0.002 c 0.016,0.517 0.108,0.956 0.243,1.333 a 0.364,0.364 0 0 0 -0.172,0.261 5.1,5.1 0 0 0 -0.021,0.518 C 33.589,48.948 30.989,43.81 30.963,43.757 Z"
       fill="#b3b3b3"
       id="path28" />
    <path
       d="m 32.86,48.7 c -0.242,-0.58 -0.234,-1.042 -0.187,-1.33 1.429,1.567 3.511,3.291 6.262,4.187 0.041,0.315 0.11,0.662 0.225,1.02 -0.012,0.021 -0.078,0.19 -0.115,0.4 C 34.726,51.396 33.317,49.792 32.86,48.7 Z m 1.215,3.446 c -0.177,-0.431 -0.181,-0.774 -0.149,-1.001 1.161,0.936 2.835,1.798 5.063,2.594 0.01,0.512 0.118,1.157 0.463,1.843 -0.024,0.034 -0.079,0.19 -0.099,0.3 -3.65,-1.382 -4.89,-2.788 -5.278,-3.736 z m 1.585,3.657 c -0.158,-0.434 -0.079,-0.763 -0.013,-0.928 0.949,0.633 2.167,1.225 3.649,1.773 -0.094,1.005 0.603,2.026 0.609,2.038 -2.988,-1.059 -3.969,-2.135 -4.245,-2.883 z m 1.09,3.929 c -0.379,-0.704 -0.147,-1.418 -0.01,-1.728 0.971,0.635 4.015,1.699 4.015,1.699 0.293,0.269 0.625,0.517 1.002,0.741 a 2.037,2.037 0 0 0 -0.055,1.169 C 38.339,61.374 37.147,60.468 36.75,59.732 Z m 1.452,2.837 c 0.082,-0.22 0.581,-0.465 0.969,-0.586 0.822,0.201 1.789,0.333 2.905,0.392 0,0 0.549,0.783 1.8,1.061 0.022,0.249 0.114,0.69 0.415,1.131 -0.834,0.013 -2.521,0 -4.071,-0.025 -1.798,-0.944 -2.027,-1.949 -2.018,-1.973 z m 1.97,3.412 c -0.139,-0.258 -0.067,-0.547 -0.013,-0.707 0.641,0.01 4.975,0.059 5.015,0.082 a 1.61,1.61 0 0 0 0.135,0.756 c -2.743,0.99 -4.826,0.45 -5.137,-0.131 z m 2.618,2.554 a 1.278,1.278 0 0 1 -0.291,-1.012 c 0.697,-0.036 1.748,-0.229 3.273,-0.799 0.363,0.308 0.871,0.506 1.524,0.588 a 29.312,29.312 0 0 1 -0.703,1.953 c -2.417,0.224 -3.405,-0.267 -3.803,-0.73 z m 3.473,1.491 c -0.32,0.687 -0.673,1.292 -1.045,1.663 -0.137,0.137 -0.276,0.282 -0.414,0.431 -0.203,-0.693 -0.13,-1.588 -0.042,-2.096 0.451,0.037 0.951,0.038 1.501,0.002 z"
       fill="#b3b3b3"
       id="path30" />
    <path
       d="m 43.574,74.706 c 0.001,0.002 1.158,-1.492 2.163,-2.497 1.04,-1.041 1.853,-3.342 2.576,-5.674 0.518,-1.672 2.154,-1.48 2.225,-1.471 0.048,0.012 1.78,0.398 1.96,2.498 l 0.467,7.74 c -0.188,0.067 -0.446,0.119 -0.661,0.026 -0.207,-0.09 -0.356,-0.321 -0.451,-0.675 l 0.204,-5.881 A 0.36654911,0.36654911 0 0 0 51.324,68.76 l -0.196,5.621 c -1.179,-0.559 -1.141,-1.392 -1.123,-1.543 0.247,-0.474 0.456,-1.158 0.465,-2.128 v -0.003 a 0.368,0.368 0 0 0 -0.363,-0.368 0.368,0.368 0 0 0 -0.37,0.364 c -0.024,1.604 -3.059,4.697 -3.099,4.749 -0.409,0.424 -0.827,0.639 -1.217,0.61 a 1.167,1.167 0 0 1 -0.653,-0.287 c 0.386,-0.224 0.819,-0.59 1.277,-1.186 0.101,-0.122 2.671,-3.255 3.784,-6.526 a 0.368,0.368 0 0 0 -0.695,-0.237 c -1.068,3.142 -3.638,6.273 -3.663,6.305 -1.163,1.512 -1.979,1.212 -1.987,1.209 -0.064,-0.038 -0.098,-0.411 0.09,-0.634 z m 11.844,7.466 c -0.304,0.454 -0.928,0.655 -1.948,0.75 -1.021,-0.094 -1.645,-0.295 -1.947,-0.75 -0.277,-0.415 -0.205,-1.079 -0.205,-1.079 v -2.307 h 1.031 v 1.643 a 1.08,1.08 0 1 0 2.16,0 v -1.643 h 1.113 v 2.307 c 0,0 0.072,0.664 -0.204,1.079 z m -10.06,-5.378 c -0.691,-0.054 -1.157,-0.516 -1.339,-0.73 a 1.876,1.876 0 0 1 -0.315,0.033 v 3.381 c 0.022,0.007 0.281,-0.086 0.354,-0.167 a 0.368,0.368 0 0 1 0.549,0.489 l -0.02,0.02 c 0.233,0.094 0.504,0.162 0.716,0.1 0.101,-0.03 0.248,-0.1 0.362,-0.373 a 0.365,0.365 0 0 1 0.48,-0.196 0.365,0.365 0 0 1 0.196,0.48 1.47,1.47 0 0 1 -0.35,0.514 c 0.145,0.21 0.416,0.525 0.83,0.665 0.445,0.149 0.966,0.068 1.549,-0.241 a 0.37,0.37 0 0 1 0.535,0.268 c 0,0.006 0.092,0.552 0.492,0.768 0.283,0.153 0.683,0.117 1.184,-0.105 -0.002,-0.335 0.002,-0.711 0.002,-2.915 h -0.271 v 1.238 a 0.432,0.432 0 0 1 -0.864,0 V 78.785 H 48.04 v 0.836 a 0.4325,0.4325 0 1 1 -0.865,0 v -0.836 h -2.777 a 0.3675,0.3675 0 0 1 0,-0.735 h 2.462 v -1.809 c -0.491,0.407 -0.995,0.593 -1.502,0.553 z m 17.562,-0.73 c -0.181,0.214 -0.647,0.676 -1.338,0.73 -0.551,0.043 -1.099,-0.18 -1.631,-0.665 v 1.921 h 2.591 a 0.3675,0.3675 0 0 1 0,0.735 h -2.777 v 0.836 a 0.432,0.432 0 1 1 -0.864,0 V 78.785 H 57.49 v 1.238 a 0.432,0.432 0 0 1 -0.864,0 v -1.238 h -0.271 c 0,2.203 0.004,2.58 0.001,2.915 0.502,0.222 0.901,0.258 1.184,0.105 0.399,-0.216 0.491,-0.762 0.491,-0.768 a 0.366,0.366 0 0 1 0.2,-0.271 0.364,0.364 0 0 1 0.335,0.003 c 0.584,0.31 1.104,0.391 1.55,0.241 0.414,-0.14 0.687,-0.455 0.83,-0.665 a 1.489,1.489 0 0 1 -0.35,-0.514 0.36707799,0.36707799 0 1 1 0.677,-0.284 c 0.115,0.272 0.262,0.343 0.362,0.373 0.213,0.062 0.483,-0.006 0.717,-0.1 L 62.331,79.8 a 0.36760101,0.36760101 0 0 1 0.549,-0.489 c 0.072,0.081 0.331,0.174 0.354,0.167 V 76.097 A 1.786,1.786 0 0 1 62.92,76.064 Z"
       fill="#b3b3b3"
       id="path32" />
    <path
       d="m 54.921,76.005 c -0.482,0.206 -1.106,0.005 -1.451,-0.14 -0.345,0.145 -0.969,0.346 -1.451,0.14 -0.325,-0.139 -0.573,-0.398 -0.742,-0.772 v 2.819 h 4.387 v -2.819 c -0.17,0.373 -0.418,0.633 -0.743,0.772 z"
       fill="#b3b3b3"
       id="path34" />
    <path
       d="m 63.365,74.706 c 0.189,0.223 0.155,0.596 0.092,0.635 -0.008,0.003 -0.825,0.303 -1.988,-1.209 -0.025,-0.031 -2.595,-3.163 -3.663,-6.305 a 0.36714915,0.36714915 0 1 0 -0.695,0.237 c 1.113,3.271 3.684,6.404 3.784,6.526 0.458,0.596 0.892,0.961 1.277,1.186 a 1.16,1.16 0 0 1 -0.653,0.287 c -0.39,0.028 -0.808,-0.187 -1.217,-0.61 -0.04,-0.052 -3.074,-3.146 -3.099,-4.749 a 0.368,0.368 0 0 0 -0.734,0.004 v 0.003 c 0.009,0.97 0.218,1.654 0.465,2.128 0.019,0.151 0.057,0.984 -1.123,1.543 l -0.196,-5.621 a 0.368,0.368 0 0 0 -0.38,-0.354 0.366,0.366 0 0 0 -0.354,0.366 l 0.205,5.881 c -0.095,0.354 -0.245,0.585 -0.452,0.675 -0.214,0.093 -0.472,0.041 -0.661,-0.026 l 0.467,-7.74 c 0.18,-2.1 1.913,-2.486 1.961,-2.498 0.069,-0.009 1.706,-0.201 2.224,1.471 0.724,2.332 1.536,4.633 2.576,5.674 1.006,1.004 2.163,2.498 2.164,2.496 z"
       fill="#b3b3b3"
       id="path36" />
    <path
       d="m 60.677,70.026 c 0.549,0.035 1.05,0.034 1.501,-0.002 0.087,0.508 0.161,1.402 -0.043,2.096 A 19.182,19.182 0 0 0 61.721,71.689 C 61.35,71.318 60.997,70.713 60.677,70.026 Z m 3.472,-1.491 c -0.398,0.463 -1.386,0.954 -3.804,0.731 a 29.548,29.548 0 0 1 -0.704,-1.953 c 0.654,-0.082 1.162,-0.281 1.525,-0.588 1.525,0.569 2.577,0.763 3.273,0.799 0.028,0.19 0.042,0.625 -0.29,1.011 z m 2.619,-2.554 c -0.312,0.58 -2.395,1.12 -5.137,0.131 0.141,-0.32 0.147,-0.608 0.135,-0.756 0.04,-0.022 4.373,-0.071 5.015,-0.082 0.054,0.161 0.125,0.45 -0.013,0.707 z m -0.048,-1.44 c -1.55,0.025 -3.237,0.038 -4.07,0.025 0.3,-0.441 0.392,-0.882 0.414,-1.131 1.25,-0.277 1.801,-1.061 1.801,-1.061 1.115,-0.059 2.082,-0.19 2.904,-0.392 0.389,0.121 0.888,0.366 0.969,0.586 0.008,0.025 -0.22,1.03 -2.018,1.973 z m 3.469,-4.809 c -0.397,0.735 -1.587,1.641 -4.952,1.881 a 2.027,2.027 0 0 0 -0.055,-1.169 6.023,6.023 0 0 0 1.002,-0.741 c 0,0 3.044,-1.064 4.015,-1.699 0.137,0.31 0.369,1.024 -0.01,1.728 z m 1.09,-3.929 c -0.275,0.748 -1.255,1.824 -4.246,2.883 0.007,-0.011 0.704,-1.032 0.609,-2.038 1.483,-0.548 2.701,-1.141 3.65,-1.773 0.066,0.165 0.146,0.494 -0.013,0.928 z m 1.585,-3.657 c -0.387,0.947 -1.628,2.353 -5.277,3.736 a 1.156,1.156 0 0 0 -0.1,-0.3 4.273,4.273 0 0 0 0.463,-1.843 c 2.229,-0.796 3.902,-1.658 5.063,-2.594 0.032,0.227 0.028,0.57 -0.149,1.001 z M 74.079,48.7 c -0.457,1.092 -1.865,2.695 -6.185,4.276 a 1.838,1.838 0 0 0 -0.115,-0.4 c 0.115,-0.357 0.184,-0.704 0.226,-1.02 2.75,-0.896 4.833,-2.62 6.261,-4.187 0.048,0.289 0.055,0.752 -0.187,1.331 z"
       fill="#b3b3b3"
       id="path38" />
    <path
       d="m 75.977,43.757 c -0.026,0.053 -2.626,5.191 -7.915,6.986 0.001,-0.31 -0.021,-0.509 -0.021,-0.518 a 0.364,0.364 0 0 0 -0.172,-0.261 4.29,4.29 0 0 0 0.243,-1.333 v -0.002 c 3.821,-2.199 5.994,-4.11 7.208,-5.665 0.294,0.009 0.736,0.073 0.814,0.197 0.059,0.096 0.005,0.312 -0.157,0.596 z"
       fill="#b3b3b3"
       id="path40" />
    <path
       fill="#ffffff"
       d="m 19.129,47.597 -0.093,-4.505 -2.573,3.699 -4.314,-1.304 2.723,3.591 -2.573,3.699 4.256,-1.48 2.723,3.59 -0.092,-4.505 4.256,-1.481 z m 76.341,-2.11 -4.314,1.304 -2.574,-3.699 -0.093,4.505 -4.313,1.304 4.257,1.481 -0.093,4.505 2.723,-3.59 4.257,1.48 -2.574,-3.699 z"
       id="path42" />
    <path
       d="m 49.137,74.693 a 0.431,0.431 0 0 0 -0.432,0.432 v 2.278 a 0.432,0.432 0 0 0 0.864,0 v -2.278 a 0.433,0.433 0 0 0 -0.432,-0.432 z m 1.018,2.711 a 0.432,0.432 0 0 0 0.864,0 v -1.872 l -0.864,-0.407 z m -2.9,0 a 0.4325,0.4325 0 0 0 0.865,0 v -2.083 l -0.864,0.833 v 1.25 z m 10.548,-2.711 a 0.431,0.431 0 0 0 -0.432,0.432 v 2.278 a 0.432,0.432 0 0 0 0.864,0 v -2.278 a 0.433,0.433 0 0 0 -0.432,-0.432 z m -1.882,2.711 a 0.4325,0.4325 0 0 0 0.865,0 v -2.278 l -0.864,0.407 v 1.871 z m 2.899,0 a 0.432,0.432 0 0 0 0.864,0 V 76.155 L 58.82,75.322 Z"
       fill="#b3b3b3"
       id="path44" />
    <path
       d="m 55.88,47.482 c 0,-0.01 0,-0.005 0,0 z M 54.372,62.49 c 0,0 -0.766,0.472 -1.651,0 0,0 0.821,1.769 1.651,0 z m -2.593,0 c 0,0 -0.766,0.472 -1.65,0 0,0 0.821,1.769 1.65,0 z"
       id="path46" />
    <path
       d="m 53.039,63.282 c 0,0 -0.766,0.472 -1.65,0 0,0 0.821,1.769 1.65,0 z m 1.122,0.072 c 0,0 0.821,1.769 1.65,0 10e-4,0 -0.766,0.472 -1.65,0 z m 2.412,0 c 0,0 0.821,1.769 1.65,0 10e-4,0 -0.766,0.472 -1.65,0 z m 0.534,-1.116 c 0,0 -0.767,0.472 -1.65,0 0,0 0.821,1.769 1.65,0 z m -1.368,-0.792 c 0,0 -0.767,0.472 -1.65,0 0,0 0.821,1.769 1.65,0 z m -4.314,-0.108 c 0,0 0.821,1.768 1.65,0 0,0 -0.766,0.473 -1.65,0 z m -0.799,0 c 0,0 -0.766,0.472 -1.65,0 10e-4,0 0.822,1.768 1.65,0 z m -0.533,-1.08 c 0,0 0.821,1.769 1.65,0 0,0 -0.766,0.472 -1.65,0 z m 1.692,-1.008 c 0,0 0.822,1.769 1.651,0 0,0 -0.767,0.472 -1.651,0 z m 2.884,-1.203 c 0,0 -0.575,0.354 -1.238,0 0,0 0.616,1.327 1.238,0 z m -3.578,0 c 0,0 0.616,1.327 1.237,0 0,0 -0.574,0.354 -1.237,0 z m -0.634,0 c 0,0 -0.575,0.354 -1.238,0 0,0 0.616,1.327 1.238,0 z m 6.588,0 c 0,0 -0.574,0.354 -1.238,0 0,0 0.616,1.327 1.238,0 z m 0.396,-1.187 c 0,0 -0.575,0.354 -1.238,0 0,0 0.616,1.327 1.238,0 z m -3.182,0.072 c 0,0 0.616,1.326 1.238,0 0,0 -0.575,0.353 -1.238,0 z m 3.238,-2.711 c 0,0 -0.575,0.354 -1.237,0 0,0 0.615,1.326 1.237,0 z m -5.158,-0.079 c 0,0 -0.575,0.354 -1.238,0 0,0 0.616,1.326 1.238,0 z m 3.132,-2.079 c 0,0 -0.575,0.353 -1.238,0 -10e-4,0 0.616,1.327 1.238,0 z m -1.882,4.869 c 0,0 -0.575,0.354 -1.238,0 0,0 0.616,1.326 1.238,0 z m -1.872,0 c 0,0 -0.574,0.354 -1.238,0 0,0 0.616,1.326 1.238,0 z m 2.66,2.283 c 0,0 0.821,1.768 1.65,0 0,0 -0.766,0.471 -1.65,0 z m 4.062,-0.073 c 0,0 -0.766,0.472 -1.65,0 0,0 0.821,1.769 1.65,0 z m -8.064,0.144 c 0,0 -0.767,0.472 -1.65,0 0,0 0.821,1.769 1.65,0 z m 2.598,1.045 c 0,0 0.821,1.769 1.65,0 0,0 -0.767,0.471 -1.65,0 z m 4.097,-0.036 c 0,0 -0.766,0.471 -1.65,0 0,0 0.822,1.768 1.65,0 z m -0.605,1.008 c 0,0 0.821,1.768 1.65,0 0,0 -0.766,0.471 -1.65,0 z m -3.96,3.168 c 0,0 0.821,1.769 1.65,0 0,0 -0.766,0.471 -1.65,0 z"
       id="path48" />
    <path
       d="m 33.157,77.949 c 2.694,0.896 6.713,2.184 8.948,2.673 a 29.99,29.99 0 0 0 -0.014,1.23 l -7.068,-1.148 c -0.124,-0.046 -1.339,-0.548 -1.866,-2.755 z m 1.734,3.477 7.222,1.174 c 0.012,0.257 0.029,0.512 0.054,0.75 l -7.104,-1.136 a 1.975,1.975 0 0 1 -0.172,-0.788 z"
       fill="#b3b3b3"
       id="path50" />
    <path
       d="m 70.98,84.501 c -0.632,0.751 -0.968,1.299 -1.051,2.21 -0.061,0.667 -0.655,1.204 -0.966,1.313 -0.417,0.075 -7.029,1.231 -15.33,1.25 -8.301,-0.019 -14.915,-1.174 -15.331,-1.25 -0.312,-0.11 -0.906,-0.646 -0.966,-1.313 -0.083,-0.911 -0.42,-1.459 -1.051,-2.21 -0.35,-0.416 -0.693,-1.067 -0.9,-1.492 l 7.145,1.143 c 0.042,0.007 4.316,0.791 11.103,0.841 6.787,-0.05 11.06,-0.833 11.102,-0.841 l 7.144,-1.143 c -0.205,0.426 -0.549,1.077 -0.899,1.492 z"
       fill="#b3b3b3"
       id="path52" />
    <path
       d="m 72.203,82.214 -7.104,1.136 c 0.025,-0.237 0.042,-0.492 0.054,-0.75 l 7.222,-1.174 c 0,0.347 -0.102,0.628 -0.172,0.788 z m 0.039,-1.51 c -0.063,0.01 -5.478,0.891 -7.067,1.148 0.004,-0.504 -0.005,-0.947 -0.015,-1.23 2.236,-0.489 6.254,-1.777 8.949,-2.673 -0.527,2.207 -1.743,2.709 -1.867,2.755 z"
       fill="#b3b3b3"
       id="path54" />
    <path
       d="m 8.499,60.773 c -0.072,1.157 -0.085,1.955 0.35,2.445 0.408,0.461 1.257,0.708 2.75,0.8 1.721,0.105 2.729,-0.049 2.797,-1.145 l 0.013,-0.216 0.527,0.032 0.012,0.19 c 0.06,0.92 0.837,1.395 2.446,1.492 1.087,0.066 1.828,-0.089 2.265,-0.476 0.574,-0.508 0.63,-1.427 0.689,-2.399 l 0.12,-1.957 c -0.409,-0.025 -11.44,-0.7 -11.85,-0.724 z"
       fill="#ffffff"
       id="path56" />
    <path
       d="M 11.937,62.316 C 11.043,62.261 10.337,62.218 9.994,61.78 9.808,61.543 9.756,61.223 9.832,60.802 l 0.035,-0.188 4.184,0.255 -0.013,0.216 c -0.066,1.08 -0.277,1.342 -2.058,1.233 z m 3.42,-0.881 0.014,-0.474 0.222,0.003 3.424,0.209 0.004,0.199 c 0.009,0.479 -0.084,0.796 -0.296,1 -0.326,0.312 -0.879,0.305 -1.624,0.259 -1.553,-0.094 -1.786,-0.43 -1.744,-1.196 z"
       fill="#595959"
       id="path58" />
    <path
       d="m 17.044,66.445 -5.584,0.407 c -1.284,0.093 -2.193,0.439 -2.701,1.026 -0.375,0.434 -0.539,1.012 -0.487,1.718 0.052,0.706 0.298,1.255 0.73,1.629 0.588,0.508 1.537,0.717 2.821,0.624 l 5.583,-0.407 c 2.236,-0.163 3.308,-1.086 3.188,-2.745 -0.12,-1.657 -1.315,-2.415 -3.55,-2.252 z"
       fill="#ffffff"
       id="path60" />
    <path
       d="m 9.807,69.484 c -0.021,-0.293 0.096,-0.795 1.123,-0.87 l 6.894,-0.502 c 0.467,-0.035 0.796,0.037 1.005,0.217 a 0.682,0.682 0 0 1 0.232,0.48 0.683,0.683 0 0 1 -0.16,0.509 c -0.181,0.209 -0.496,0.328 -0.964,0.361 l -6.894,0.502 C 10.018,70.257 9.828,69.777 9.807,69.484 Z"
       fill="#595959"
       id="path62" />
    <path
       d="m 13.739,76.026 -4.242,0.903 0.358,1.681 4.241,-0.903 7.738,0.161 -0.342,-1.606 -4.765,0.236 -0.094,-0.442 4.446,-1.726 -0.342,-1.606 z m 7.429,8.021 c -1.879,0.883 -2.339,2.113 -2.785,3.303 -0.385,1.027 -0.748,1.997 -1.975,2.573 -0.423,0.199 -0.734,0.25 -0.98,0.162 A 0.698,0.698 0 0 1 15.034,89.701 C 14.737,89.076 15.199,88.754 15.74,88.5 l 1.728,-0.812 -0.731,-1.556 -1.869,0.879 c -0.753,0.354 -1.238,0.819 -1.441,1.384 -0.252,0.701 -0.025,1.447 0.211,1.949 0.328,0.695 0.751,1.129 1.296,1.325 0.678,0.244 1.567,0.11 2.645,-0.396 1.9,-0.894 2.432,-2.291 2.901,-3.524 0.353,-0.925 0.687,-1.801 1.562,-2.212 0.343,-0.162 1.056,-0.497 1.391,0.214 0.089,0.19 0.104,0.374 0.041,0.548 -0.09,0.248 -0.332,0.458 -0.762,0.66 l -1.369,0.644 0.732,1.557 1.556,-0.732 c 1.021,-0.48 1.538,-1.155 1.538,-2.003 0,-0.395 -0.109,-0.827 -0.328,-1.292 -0.342,-0.728 -0.796,-1.196 -1.35,-1.396 -0.626,-0.226 -1.407,-0.121 -2.323,0.31 z m 2.705,6.592 -4.627,3.152 c -1.067,0.729 -1.682,1.482 -1.826,2.244 -0.106,0.558 0.042,1.136 0.438,1.718 0.43,0.632 0.916,0.991 1.486,1.099 0.714,0.135 1.577,-0.138 2.566,-0.812 l 1.164,-0.793 -0.962,-1.412 -1.557,1.047 c -0.385,0.262 -0.704,0.364 -0.976,0.312 a 0.692,0.692 0 0 1 -0.452,-0.308 0.668,0.668 0 0 1 -0.113,-0.508 c 0.051,-0.271 0.266,-0.532 0.656,-0.798 l 5.713,-3.892 c 0.852,-0.58 1.251,-0.266 1.413,-0.027 a 0.69,0.69 0 0 1 0.121,0.534 c -0.052,0.271 -0.265,0.531 -0.649,0.793 l -1.221,0.832 0.968,1.421 0.936,-0.638 c 2.229,-1.519 1.852,-2.728 1.117,-3.808 -0.397,-0.582 -0.881,-0.932 -1.439,-1.037 -0.761,-0.142 -1.689,0.154 -2.756,0.881 z m 4.146,5.78 -4.018,3.899 c -0.925,0.897 -1.399,1.745 -1.411,2.522 -0.009,0.572 0.237,1.121 0.73,1.629 0.494,0.509 1.034,0.771 1.606,0.779 0.777,0.011 1.639,-0.438 2.563,-1.333 l 4.018,-3.899 c 0.925,-0.897 1.398,-1.746 1.41,-2.522 0.009,-0.572 -0.237,-1.12 -0.73,-1.628 -0.493,-0.509 -1.034,-0.771 -1.606,-0.78 -0.776,-0.012 -1.639,0.437 -2.562,1.333 z"
       fill="#ffffff"
       id="path64" />
    <path
       d="m 24.727,102.01 4.96,-4.813 c 0.336,-0.326 0.634,-0.483 0.911,-0.479 0.181,0.002 0.35,0.079 0.485,0.218 a 0.686,0.686 0 0 1 0.205,0.494 c -0.005,0.276 -0.17,0.569 -0.506,0.896 l -4.96,4.812 c -0.74,0.717 -1.193,0.471 -1.398,0.26 v 0.001 c -0.204,-0.211 -0.437,-0.672 0.303,-1.389 z"
       fill="#595959"
       id="path66" />
    <path
       d="m 30.14,105.621 c -0.466,0.667 -1.215,1.737 -1.215,2.759 0,0.113 0.01,0.225 0.029,0.335 0.099,0.558 0.44,1.034 1.044,1.457 1.482,1.036 2.552,0.655 4.091,-1.456 l 4.915,-7.028 -1.409,-0.985 c -0.235,0.338 -4.957,7.088 -4.957,7.088 -0.458,0.654 -0.817,1.168 -1.251,1.245 a 0.664,0.664 0 0 1 -0.508,-0.125 0.632,0.632 0 0 1 -0.287,-0.533 c 0,-0.405 0.339,-0.889 0.758,-1.488 l 4.957,-7.087 -1.409,-0.986 z m 9.487,-1.955 1.38,0.596 -4.143,9.58 1.578,0.683 4.142,-9.58 1.38,0.596 0.57,-1.316 -4.338,-1.876 z m 5.662,3.538 c -0.395,2.039 0.327,3.137 1.023,4.198 0.603,0.917 1.172,1.782 0.914,3.113 -0.054,0.278 -0.218,1.128 -0.99,0.979 -0.228,-0.043 -0.387,-0.138 -0.487,-0.287 -0.141,-0.208 -0.16,-0.505 -0.066,-0.99 l 0.363,-1.875 -1.688,-0.327 c -0.066,0.348 -0.392,2.027 -0.392,2.027 a 3.854,3.854 0 0 0 -0.076,0.734 c 0,1.492 1.07,2.037 2.042,2.225 0.754,0.146 1.355,0.06 1.835,-0.264 0.596,-0.404 1.014,-1.201 1.239,-2.37 0.399,-2.062 -0.415,-3.315 -1.134,-4.421 -0.54,-0.832 -1.05,-1.616 -0.866,-2.566 0.072,-0.372 0.222,-1.145 0.994,-0.997 0.771,0.15 0.604,1.013 0.55,1.295 l -0.288,1.484 1.688,0.326 0.326,-1.688 c 0.157,-0.814 0.071,-1.473 -0.258,-1.959 -0.327,-0.484 -0.896,-0.808 -1.689,-0.961 -1.68,-0.325 -2.675,0.435 -3.04,2.324 z m 12.931,-2.236 c -1.638,0.285 -2.274,1.549 -1.891,3.757 l 0.958,5.517 c 0.383,2.208 1.408,3.183 3.047,2.899 1.638,-0.284 2.274,-1.548 1.891,-3.757 l -0.958,-5.516 c -0.221,-1.27 -0.653,-2.139 -1.289,-2.586 -0.468,-0.329 -1.06,-0.434 -1.758,-0.314 z"
       fill="#ffffff"
       id="path68" />
    <path
       d="m 57.911,107.785 c -0.176,-1.014 0.283,-1.25 0.572,-1.301 a 0.684,0.684 0 0 1 0.522,0.109 c 0.226,0.158 0.374,0.46 0.455,0.923 l 1.182,6.81 c 0.08,0.463 0.042,0.798 -0.117,1.023 a 0.685,0.685 0 0 1 -0.456,0.278 0.676,0.676 0 0 1 -0.521,-0.109 c -0.226,-0.158 -0.375,-0.46 -0.455,-0.923 z"
       fill="#595959"
       id="path70" />
    <path
       d="m 62.08,104.332 4.385,11.031 1.598,-0.635 -2.17,-5.459 2.071,-0.823 -0.53,-1.333 -2.071,0.824 -1.155,-2.907 2.144,-0.853 -0.53,-1.332 c -0.345,0.136 -3.398,1.349 -3.742,1.487 z m 9.203,-4.936 6.371,10.131 1.063,-0.875 -1.65,-2.558 1.203,-0.99 2.111,2.179 1.314,-1.081 c -0.317,-0.319 -8.165,-8.175 -8.429,-8.438 -0.245,0.203 -1.744,1.435 -1.983,1.632 z"
       fill="#ffffff"
       id="path72" />
    <path
       fill="#595959"
       d="m 72.983,100.204 0.353,-0.29 3.929,4.161 -0.958,0.788 z"
       id="path74" />
    <path
       d="m 78.239,92.268 6.161,5.994 -0.282,0.358 -7.261,-4.601 -1.705,2.159 9.318,7.355 0.8,-1.013 -8.076,-6.376 0.263,-0.375 8.854,5.434 0.935,-1.185 -7.339,-7.35 0.302,-0.344 8.076,6.377 0.938,-1.187 -9.317,-7.356 z m 2.328,-3.456 10.477,5.582 1.894,-3.553 c -0.259,-0.138 -1.006,-0.537 -1.266,-0.674 l -1.085,2.036 -3.919,-2.089 1.048,-1.967 -1.266,-0.674 -1.048,1.967 -2.761,-1.471 1.085,-2.036 -1.266,-0.674 z m 3.18,-6.701 -0.67,1.829 11.149,4.079 0.591,-1.615 c -0.376,-0.136 -5.275,-1.929 -5.275,-1.929 l 0.195,-0.532 c 0.164,-0.449 0.786,-0.771 1.761,-0.414 l 2.451,0.897 c 0.342,0.125 0.966,0.316 1.484,0.291 l 0.585,-1.598 c -0.592,-0.013 -1.21,-0.209 -1.479,-0.308 l -2.418,-0.885 c -1.599,-0.585 -2.142,-0.173 -2.465,0.628 l -0.447,-0.121 c 0.134,-1.009 -0.495,-1.754 -1.924,-2.276 -2.322,-0.849 -2.886,0.172 -3.538,1.954 z"
       fill="#ffffff"
       id="path76" />
    <path
       d="m 84.918,82.784 0.074,-0.204 c 0.429,-1.171 1.158,-1.006 2.141,-0.647 0.68,0.249 1.108,0.468 1.285,0.85 0.127,0.272 0.111,0.591 -0.051,1.033 l -0.074,0.203 z"
       fill="#595959"
       id="path78" />
    <path
       d="m 85.226,77.518 11.531,2.823 0.409,-1.67 -11.531,-2.823 z m 0.905,-5.846 c -0.22,1.639 0.795,2.622 3.017,2.92 l 5.548,0.747 c 2.222,0.3 3.46,-0.38 3.681,-2.02 0.1,-0.753 -0.021,-1.348 -0.372,-1.81 -0.441,-0.578 -1.266,-0.952 -2.452,-1.112 l -1.396,-0.187 -0.228,1.692 1.857,0.262 c 0.461,0.062 0.767,0.199 0.935,0.418 a 0.693,0.693 0 0 1 0.13,0.531 0.67,0.67 0 0 1 -0.255,0.453 c -0.22,0.168 -0.554,0.219 -1.021,0.155 l -6.851,-0.922 c -1.021,-0.137 -1.108,-0.637 -1.069,-0.924 0.048,-0.361 0.31,-0.765 1.279,-0.634 l 1.464,0.197 0.229,-1.704 -1.121,-0.151 c -2.67,-0.357 -3.2,0.792 -3.375,2.089 z m 0.68,-8.127 0.003,2.569 11.874,1.494 -0.002,-1.377 -3.025,-0.345 -0.003,-1.558 3.023,-0.251 -0.002,-1.701 z"
       fill="#ffffff"
       id="path80" />
    <path
       fill="#595959"
       d="m 88.518,65.311 -0.001,-0.457 5.708,-0.4 0.002,1.24 z"
       id="path82" />
    <path
       d="m 16.399,34.873 9.977,6.435 2.183,-3.384 -1.206,-0.777 -1.25,1.938 -3.732,-2.408 1.208,-1.873 -1.206,-0.777 -1.208,1.873 -2.628,-1.695 1.25,-1.938 -1.205,-0.778 c -0.201,0.313 -1.981,3.073 -2.183,3.384 z m 6.08,-8.034 7.583,9.259 0.946,-1 -1.957,-2.333 1.072,-1.131 2.365,1.899 1.169,-1.236 -9.413,-7.323 z"
       fill="#ffffff"
       id="path84" />
    <path
       fill="#595959"
       d="m 24.267,27.43 0.314,-0.331 4.415,3.638 -0.852,0.901 z"
       id="path86" />
    <path
       d="m 30.407,19.485 c -1.354,0.964 -1.381,2.379 -0.081,4.205 l 3.248,4.561 c 1.627,2.283 2.607,2.29 3.579,1.599 0.293,-0.21 0.504,-0.422 0.643,-0.649 0.197,-0.285 0.294,-0.612 0.285,-0.956 l -0.013,-0.526 0.705,0.68 0.702,-0.5 c -0.226,-0.315 -3.123,-4.385 -3.349,-4.7 l -2.065,1.471 0.832,1.168 0.665,-0.474 1.078,1.514 c 0.597,0.838 0.285,1.25 0.046,1.42 -0.424,0.302 -0.871,0.131 -1.327,-0.508 l -4.01,-5.63 c -0.598,-0.839 -0.286,-1.25 -0.047,-1.42 a 0.685,0.685 0 0 1 0.519,-0.127 c 0.272,0.046 0.537,0.254 0.809,0.636 l 0.867,1.217 1.402,-0.999 -0.619,-0.888 c -1.275,-1.753 -2.469,-2.091 -3.869,-1.094 z m 5.869,-3.278 4.614,10.938 3.733,-1.575 -0.558,-1.322 -2.149,0.907 -4.057,-9.617 z m 7.659,-2.669 2.459,11.613 3.939,-0.834 -0.297,-1.403 -2.256,0.478 -0.921,-4.344 2.181,-0.462 -0.297,-1.403 -2.182,0.462 -0.647,-3.06 2.257,-0.478 -0.297,-1.402 z m 16.023,-0.424 c -0.56,0.354 -0.957,1.035 -1.18,2.022 -0.457,2.025 0.23,3.144 0.895,4.227 0.573,0.935 1.115,1.816 0.816,3.139 -0.062,0.277 -0.253,1.121 -1.02,0.948 -0.673,-0.153 -0.645,-0.712 -0.515,-1.294 l 0.421,-1.863 -1.677,-0.378 -0.455,2.014 c -0.46,2.037 0.766,2.768 1.874,3.018 0.75,0.169 1.353,0.102 1.843,-0.208 0.609,-0.385 1.05,-1.169 1.312,-2.331 0.462,-2.048 -0.313,-3.326 -0.998,-4.454 -0.514,-0.847 -0.999,-1.648 -0.786,-2.592 0.082,-0.362 0.194,-0.72 0.466,-0.891 0.154,-0.098 0.342,-0.123 0.558,-0.073 a 0.698,0.698 0 0 1 0.457,0.303 c 0.141,0.223 0.158,0.544 0.053,1.007 0,0 -0.231,1.028 -0.333,1.475 0.303,0.068 1.375,0.311 1.677,0.378 l 0.379,-1.677 c 0.362,-1.617 -0.26,-2.618 -1.856,-2.979 -0.784,-0.175 -1.433,-0.105 -1.931,0.209 z m 8.906,2.371 c -0.721,0.284 -1.348,1.028 -1.863,2.213 l -2.235,5.133 c -0.515,1.186 -0.633,2.152 -0.349,2.873 0.208,0.528 0.641,0.938 1.287,1.22 1.554,0.677 2.725,0.049 3.582,-1.918 l 0.562,-1.291 -1.566,-0.682 -0.759,1.716 c -0.39,0.895 -0.871,0.91 -1.205,0.765 a 0.66,0.66 0 0 1 -0.366,-0.369 c -0.102,-0.257 -0.059,-0.592 0.13,-1.025 l 2.759,-6.337 c 0.41,-0.943 0.916,-0.892 1.182,-0.777 0.333,0.145 0.651,0.504 0.26,1.405 l -0.59,1.354 c 0.284,0.125 1.292,0.562 1.577,0.687 l 0.451,-1.038 c 0.476,-1.092 0.585,-1.932 0.336,-2.567 -0.205,-0.52 -0.656,-0.917 -1.421,-1.25 -0.648,-0.283 -1.242,-0.32 -1.772,-0.112 z m 8.473,5.029 c -0.773,0.07 -1.583,0.608 -2.408,1.597 l -3.582,4.303 c -0.824,0.99 -1.206,1.884 -1.136,2.657 0.052,0.57 0.354,1.089 0.899,1.542 1.277,1.064 2.652,0.729 4.087,-0.993 l 3.583,-4.302 c 1.435,-1.723 1.514,-3.136 0.236,-4.2 -0.543,-0.453 -1.108,-0.657 -1.679,-0.604 z"
       fill="#ffffff"
       id="path88" />
    <path
       d="m 71.84,28.962 c -0.028,-0.274 0.108,-0.584 0.409,-0.944 l 4.423,-5.312 c 0.299,-0.36 0.579,-0.548 0.854,-0.573 a 0.681,0.681 0 0 1 0.507,0.167 c 0.226,0.188 0.506,0.621 -0.153,1.413 l -4.423,5.312 c -0.3,0.36 -0.58,0.548 -0.855,0.573 -0.18,0.017 -0.355,-0.041 -0.506,-0.167 -0.151,-0.126 -0.24,-0.287 -0.256,-0.469 z"
       fill="#595959"
       id="path90" />
    <path
       d="m 77.445,31.169 c -1.403,1.196 -2.775,2.618 -1.284,4.368 1.172,1.376 2.304,1.277 4.326,-0.376 l 6.529,-5.56 -1.116,-1.31 -6.584,5.608 c -0.606,0.516 -1.085,0.924 -1.524,0.888 a 0.66,0.66 0 0 1 -0.461,-0.248 c -0.501,-0.586 0.179,-1.166 0.965,-1.836 l 6.585,-5.609 -1.115,-1.309 c -0.311,0.268 -6.321,5.384 -6.321,5.384 z m 10.587,1.827 0.769,1.291 -8.969,5.338 0.879,1.478 8.969,-5.338 0.769,1.292 1.233,-0.733 -2.417,-4.062 z"
       fill="#ffffff"
       id="path92" />
    <path
       d="m 41.679,84.935 -1.197,-0.15 -0.309,2.462 1.042,0.131 c 0.504,0.063 0.648,-0.006 0.806,-0.125 a 0.72,0.72 0 0 0 0.276,-0.48 c 0.031,-0.244 -0.018,-0.494 -0.306,-0.645 0.11,-0.039 0.321,-0.113 0.365,-0.465 0.034,-0.256 -0.073,-0.653 -0.677,-0.728 z"
       id="path94" />
    <path
       d="m 41.352,86.962 -0.631,-0.079 0.083,-0.658 0.655,0.083 c 0.186,0.023 0.36,0.128 0.333,0.344 -0.032,0.25 -0.19,0.342 -0.44,0.31 z m 0.107,-1.077 -0.604,-0.076 0.067,-0.539 0.59,0.074 c 0.233,0.029 0.37,0.109 0.344,0.312 -0.024,0.196 -0.195,0.254 -0.397,0.229 z"
       fill="#b3b3b3"
       id="path96" />
    <path
       d="m 43.011,87.589 1.875,0.184 0.043,-0.437 -1.369,-0.134 0.063,-0.64 1.203,0.118 0.043,-0.437 -1.204,-0.118 0.051,-0.52 1.31,0.129 0.043,-0.437 -1.816,-0.178 z m 5.259,-2.06 -1.131,-0.069 -0.151,2.478 0.518,0.031 0.054,-0.894 0.594,0.036 c 0.666,0.04 0.824,-0.518 0.838,-0.743 0.029,-0.485 -0.243,-0.81 -0.722,-0.839 z"
       id="path98" />
    <path
       d="m 48.065,86.677 -0.479,-0.03 0.044,-0.728 0.41,0.025 c 0.321,0.019 0.45,0.127 0.434,0.37 -0.006,0.109 -0.023,0.385 -0.409,0.363 z"
       fill="#b3b3b3"
       id="path100" />
    <path
       d="m 51.742,86.381 c 0.007,-0.215 -0.097,-0.706 -0.756,-0.729 l -1.255,-0.044 -0.086,2.479 0.508,0.018 0.033,-0.97 0.536,0.019 c 0.383,0.013 0.399,0.145 0.387,0.483 -0.009,0.256 0.008,0.385 0.038,0.503 l 0.573,0.02 0.003,-0.065 c -0.109,-0.046 -0.106,-0.135 -0.094,-0.498 0.017,-0.463 -0.091,-0.543 -0.292,-0.64 0.249,-0.074 0.395,-0.304 0.405,-0.576 z"
       id="path102" />
    <path
       d="m 50.81,86.739 -0.608,-0.022 0.023,-0.662 0.646,0.022 c 0.304,0.011 0.356,0.205 0.352,0.337 -0.01,0.246 -0.144,0.334 -0.413,0.325 z"
       fill="#b3b3b3"
       id="path104" />
    <path
       d="m 53.05,87.099 1.21,0.009 0.003,-0.439 -1.209,-0.01 0.004,-0.521 1.317,0.01 0.003,-0.438 -1.824,-0.016 -0.021,2.482 1.883,0.015 0.004,-0.439 -1.375,-0.011 z m 3.248,-1.414 -1.133,0.02 0.044,2.482 0.519,-0.01 -0.017,-0.896 0.595,-0.011 c 0.667,-0.012 0.781,-0.58 0.777,-0.805 -0.009,-0.487 -0.305,-0.789 -0.785,-0.78 z"
       id="path106" />
    <path
       d="m 56.184,86.845 -0.48,0.008 -0.013,-0.729 0.411,-0.008 c 0.321,-0.006 0.458,0.092 0.462,0.334 0.002,0.111 0.007,0.388 -0.38,0.395 z"
       fill="#b3b3b3"
       id="path108" />
    <path
       d="m 58.104,85.63 -0.779,2.517 0.546,-0.022 0.151,-0.519 0.916,-0.04 0.18,0.505 0.563,-0.024 -0.98,-2.442 z"
       id="path110" />
    <path
       fill="#b3b3b3"
       d="m 58.142,87.172 0.276,-0.994 0.007,-10e-4 0.349,0.968 z"
       id="path112" />
    <path
       d="m 62.288,87.304 c -0.034,-0.462 -0.15,-0.53 -0.359,-0.605 0.238,-0.101 0.359,-0.345 0.339,-0.617 -0.015,-0.214 -0.172,-0.691 -0.83,-0.644 l -1.251,0.092 0.181,2.475 0.507,-0.038 L 60.804,87 61.337,86.96 c 0.383,-0.028 0.413,0.102 0.438,0.439 0.019,0.255 0.049,0.382 0.093,0.497 l 0.571,-0.042 -0.005,-0.065 c -0.114,-0.034 -0.12,-0.123 -0.146,-0.485 z"
       id="path114" />
    <path
       d="m 61.379,86.538 -0.607,0.044 -0.048,-0.661 0.645,-0.048 c 0.303,-0.021 0.375,0.167 0.386,0.298 0.017,0.245 -0.107,0.347 -0.376,0.367 z"
       fill="#b3b3b3"
       id="path116" />
    <path
       d="m 63.658,87.294 -0.066,-0.639 1.203,-0.125 -0.045,-0.436 -1.204,0.124 -0.053,-0.519 1.31,-0.137 -0.046,-0.436 -1.816,0.189 0.257,2.469 1.874,-0.195 -0.046,-0.438 z m 4.077,-1.369 c -0.063,-0.466 -0.331,-1.147 -1.16,-1.034 l -1.085,0.149 0.336,2.458 1.065,-0.146 c 0.812,-0.111 0.918,-0.9 0.844,-1.427 z"
       id="path118" />
    <path
       d="m 66.771,86.937 -0.5,0.068 -0.221,-1.609 0.494,-0.068 c 0.219,-0.03 0.572,-0.019 0.672,0.707 0.056,0.403 -0.027,0.844 -0.445,0.902 z"
       fill="#b3b3b3"
       id="path120" />
  </g>
</svg>
