<?xml version="1.0" encoding="UTF-8"?>
<svg width="75.59mm" height="68.965mm" version="1.1" viewBox="0 0 75.59 68.965" xmlns="http://www.w3.org/2000/svg" xmlns:cc="http://creativecommons.org/ns#" xmlns:dc="http://purl.org/dc/elements/1.1/" xmlns:rdf="http://www.w3.org/1999/02/22-rdf-syntax-ns#">
 <metadata>
  <rdf:RDF>
   <cc:Work rdf:about="">
    <dc:format>image/svg+xml</dc:format>
    <dc:type rdf:resource="http://purl.org/dc/dcmitype/StillImage"/>
    <dc:title/>
   </cc:Work>
  </rdf:RDF>
 </metadata>
 <g transform="translate(-68.038 -114.35)">
  <g transform="matrix(.35278 0 0 -.35278 54.788 198.21)">
   <g transform="scale(.1)">
    <g fill="#e32124">
     <path d="m886.59 589.84c-26.891 18.359-32.614 53.012-14.43 79.629 18.008 26.371 52.32 34.441 80.266 15.351 17.008-11.609 23.238-24.558 26.308-39.031l-18.605-4.879c-2.703 11.891-7.461 21.91-18.008 29.11-17.66 12.058-40.352 6.3-52.773-11.899-12.422-18.191-9.719-41.68 7.945-53.75 11.336-7.742 21.734-8.082 34.683-6.09l3.215-17.66c-16.465-3.449-31.332-2.582-48.601 9.219"/>
     <path d="m1067.3 597.09-56.1 29.101-13.382-25.781 49.732-25.801-8.09-15.589-49.728 25.8-13.816-26.629 56.814-29.472-8.08-15.59-74.246 38.512 51.446 99.179 73.53-38.148-8.08-15.582"/>
     <path d="m1131.7 571.35-26.77 10.019-13.15-35.141 26.92-10.07c13.15-4.93 24.1-1.18 28.13 9.578 4.31 11.524-1.53 20.524-15.13 25.614zm-10.93-96.153-12.06 46.121-23.03 8.61-13.66-36.481-18.39 6.883 39.18 104.67 46.65-17.461c24.07-9.008 34.12-27.258 26.45-47.75-6.49-17.34-20.72-23.949-36.89-22.5l13.43-50.199-21.68 8.109"/>
     <path d="m1215.6 448.37-19.23 4.699 22.21 90.871-34.43 8.418 4.32 17.68 88.08-21.527-4.32-17.684-34.42 8.41-22.21-90.867"/>
     <path d="m1314.2 543.27-17.44-110.37-19.4 3.063 17.44 110.37 19.4-3.062"/>
     <path d="m1421.8 515.19-63.36 4.649-2.24-30.41 56.21-4.121-1.31-17.84-56.2 4.133-3.33-45.383-19.59 1.441 8.18 111.45 82.95-6.089-1.31-17.829"/>
     <path d="m1461.5 534.13 1.81-111.74-19.63-0.321-1.82 111.74 19.64 0.32"/>
     <path d="m1572.3 524.35-62.94-5.872 2.7-28.921 55.78 5.203 1.63-17.481-55.78-5.203 2.79-29.879 63.72 5.942 1.63-17.481-83.27-7.762-10.37 111.24 82.48 7.691 1.63-17.48"/>
     <path d="m1633.8 535.99-21.5-4.758 16.41-74.179 21.5 4.75c22.91 5.07 34.46 23.808 29.7 45.308-4.75 21.512-23.2 33.942-46.11 28.879zm20.28-91.636-40.68-9-24.13 109.09 40.67 9c34.29 7.579 63.18-10.711 70.01-41.57 6.83-30.851-11.59-59.941-45.87-67.519"/>
     <path d="m1764.5 512.69c-7.73-2.742-16.38 1.321-19.15 9.149-2.77 7.82 1.42 16.422 9.15 19.148 7.82 2.762 16.48-1.289 19.25-9.109 2.77-7.828-1.42-16.418-9.25-19.188"/>
     <path d="m1891.7 525.92c-29.22-14.391-62.2-2.352-76.45 26.578-14.11 28.648-4.27 62.5 26.09 77.449 18.47 9.11 32.82 8.172 46.93 3.731l-4.9-18.61c-11.68 3.5-22.74 4.282-34.2-1.371-19.19-9.449-25.32-32.051-15.59-51.808 9.73-19.762 31.53-28.961 50.72-19.512 12.32 6.07 17.72 14.961 22.37 27.223l16.95-5.891c-5.09-16.031-13.16-28.551-31.92-37.789"/>
     <path d="m1974.1 686.91-52.9-34.57 15.89-24.32 46.89 30.652 9.61-14.692-46.89-30.652 16.41-25.117 53.57 35.019 9.61-14.699-70.01-45.75-61.11 93.508 69.33 45.32 9.6-14.699"/>
    </g>
    <path d="m1447.3 2377c-526.22 0-954.32-428.11-954.32-954.32 0-264.64 105.82-510.67 297.96-692.78l10.453-9.91 10.583 9.777c27.632 25.532 56.687 49.141 86.878 70.953 146.34-129.2 338.33-207.84 548.44-207.84 209.96 0 401.82 78.539 548.13 207.58 30.04-21.731 58.97-45.258 86.52-70.719l10.58-9.781 10.45 9.922c192.57 182.49 298.63 428.53 298.63 692.8 0 526.21-428.1 954.32-954.31 954.32" fill="#fff"/>
    <path d="m2092.1 762.08c-23.65 21.211-48.24 41.004-73.55 59.57 159.07 151.28 258.54 364.68 258.54 601 0 457.55-372.25 829.8-829.8 829.8-457.56 0-829.82-372.25-829.82-829.8 0-236.19 99.356-449.47 258.26-600.73-25.469-18.652-50.187-38.531-73.926-59.813-179.43 175.21-278.06 409.2-278.06 660.54 0 509.24 414.3 923.54 923.54 923.54 509.23 0 923.53-414.3 923.53-923.54 0-250.99-98.86-484.98-278.72-660.57zm-525.38 203.16v-168.66c0-24.094-19.59-43.691-43.68-43.691h-196.04v212.35zm-64.61 30.782h-112.85v43.8c0 37.07 22.82 62.96 55.49 62.96 33.24 0 57.36-26.48 57.36-62.96zm-853.85 426.63c0 440.58 358.44 799.02 799.03 799.02 440.58 0 799.02-358.44 799.02-799.02 0-229.74-97.59-436.99-253.33-582.89-118.51 81.148-252.99 134.23-395.48 156.26h-64.61v43.8c0 53.43-37.89 93.74-88.14 93.74-49.98 0-86.27-39.42-86.27-93.74v-43.8h-62.26c-142.19-22.122-276.66-75.25-394.88-156.02-155.59 145.88-253.08 353.04-253.08 582.65zm799.03-799.02c-199.63 0-382.24 73.75-522.44 195.22 111.63 74.976 238.19 124.81 371.37 146.35v-243.09h226.82c41.05 0 74.46 33.403 74.46 74.473v168.64c133.31-21.438 260.01-71.309 371.94-146.61-140.16-121.33-322.66-194.98-522.15-194.98zm0 1753.3c-526.22 0-954.32-428.11-954.32-954.32 0-264.64 105.82-510.67 297.96-692.78l10.453-9.91 10.583 9.777c27.632 25.532 56.687 49.141 86.878 70.953 146.34-129.2 338.33-207.84 548.44-207.84 209.96 0 401.82 78.539 548.13 207.58 30.04-21.731 58.97-45.258 86.52-70.719l10.58-9.781 10.45 9.922c192.57 182.49 298.63 428.53 298.63 692.8 0 526.21-428.1 954.32-954.31 954.32" fill="#626e79"/>
    <path d="m1446.8 840.58c13.71 0 24.83 11.121 24.83 24.832s-11.12 24.828-24.83 24.828-24.83-11.117-24.83-24.828 11.12-24.832 24.83-24.832" fill="#626e79"/>
    <g fill="#e32124">
     <path d="m1208.6 1865.8c-35.21 0-62.85 24.74-62.85 56.62 0 31.9 27.64 56.88 62.85 56.88s62.82-24.98 62.82-56.88c0-31.88-27.61-56.62-62.82-56.62m0 90.66c-22.38 0-39.99-15-39.99-34.04s17.61-33.78 39.99-33.78 39.99 14.74 39.99 33.78-17.61 34.04-39.99 34.04"/>
     <path d="m1433.3 1865.8c-12.61 0-22.82 10.45-22.82 23.32v47.11c0 11.19-9.78 20.24-21.91 20.24-11.9 0-21.66-9.05-21.66-20.24v-70.43c-12.63 0-22.85 10.23-22.85 22.84v47.59c0 11.19-9.75 20.24-21.87 20.24-11.92 0-21.69-9.05-21.69-20.24v-47.37c0-12.61-10.2-23.06-22.83-23.06v70.43c0 23.79 19.99 43.07 44.52 43.07 13.29 0 25.21-5.46 33.3-14.28 8.08 8.82 19.99 14.28 33.08 14.28 24.74 0 44.73-19.28 44.73-43.07v-70.43"/>
     <path d="m1507.5 1866.1c-5.96 0-11.67 0.46-16.91 1.67-11.9 3.34-18.8 15.69-15.69 27.61 0.46 1.42 0.94 2.84 1.43 4.04l0.21 0.23c6.43-7.15 16.91-10.72 30.96-10.72 20.95 0 37.35 14.75 37.35 33.33 0 19.28-16.4 34.5-37.35 34.5-19.76 0-39.52-10.94-39.52-34.99v-74c0-12.37-10.45-22.38-22.85-22.38l0.01 96.38c0 33.33 26.19 57.84 62.36 57.84 15.95 0 30.92-5.95 42.34-16.41 11.45-10.72 17.86-25.25 17.86-40.94 0-31.43-26.41-56.16-60.2-56.16"/>
     <path d="m1670.5 2001h-48.9v-135.16h-0.95c-12.13 0-21.9 10.44-21.9 22.82v112.34h-48.91c-12.37 0-22.36 10.22-22.36 22.6h165.63c0-12.38-9.99-22.6-22.61-22.6"/>
     <path d="m1866.1 1880.2-12.14 26.08h-81.15l-11.96-26.84c-5.65-10.79-20.73-13.96-32.26-13.96l66.16 145.04c3.75 8.32 10.4 13.08 18.13 13.08 7.69 0 14.55-4.76 18.31-13.08l65.39-143.28c-12.31-1.17-25.71 2.49-30.48 12.96m-50.64 119.84-32.49-71.39h61.27l-32.72 71.63 3.94-0.24"/>
     <path d="m1120.2 1981c-12.38 13.08-30.46 21.64-50.46 21.64-35.44-0.01-64.25-25.69-64.25-57.34s28.81-57.58 64.25-57.58c16.91 0 32.85 6.42 44.98 16.65 8.34 6.91 20.7 6.42 28.81-0.48-6.2-9.51-14.52-17.84-24.75-24.26-14.53-9.29-31.43-14.05-49.04-14.05-47.82 0-86.612 35.7-86.612 79.72 0 44.03 38.792 79.72 86.612 79.72 34.04 0 64.98-18.56 78.78-47.11-8.81-5.72-20.95-5-28.32 3.09"/>
     <path d="m1905.2 1874.6c-6.63 0-12 4.84-12 10.78s5.37 10.87 12 10.87c6.62 0 12.03-4.93 12.03-10.87s-5.41-10.78-12.03-10.78m0 19.12c-5.27 0-9.49-3.75-9.49-8.34s4.22-8.33 9.49-8.33c5.28 0 9.58 3.74 9.58 8.33s-4.3 8.34-9.58 8.34m4.43-9.36c-0.31-0.2-0.69-0.34-1.1-0.45 0 0 0.73-0.91 3.01-3.62l-0.42-0.36c-0.97-0.78-2.41-0.67-3.21 0.25-2.51 3-2.77 3.36-2.77 3.36h-2.88v0.82c0.12 1.07 1.05 2.01 2.22 2.01h1.4c1 0 1.77 0.18 2.27 0.48 0.44 0.19 0.56 0.5 0.56 0.94 0 0.35 0 1.34-2.83 1.34h-3.93v-7.51c0-1.19-1.03-2.18-2.3-2.18h-0.57v10.43c0.06 1.16 1.02 2.07 2.21 2.13h4.59c5.16 0 5.71-2.94 5.71-4.21 0-1.49-0.76-2.71-1.96-3.43"/>
     <path d="m1700.3 2023.5v-135.58c0-12.14 10.48-22.14 22.85-22.14v135.6c0 12.12-10.49 22.12-22.85 22.12"/>
     <path d="m2434.7 1763.6h-2059.1v-498.9c0-46.12 37.519-83.64 83.64-83.64h2059.1v498.88c0 46.13-37.53 83.66-83.65 83.66"/>
    </g>
    <g fill="#fff">
     <path d="m798.27 1486.7c54.657-13.3 83.09-32.87 83.09-76.07 0-48.74-38.035-77.54-92.32-77.54-39.512 0-76.805 13.65-107.82 41.35l27.328 32.49c24.742-21.42 49.484-33.6 81.605-33.6 28.063 0 45.789 12.93 45.789 32.86 0 18.84-10.339 28.8-58.347 39.88-55.016 13.29-86.035 29.55-86.035 77.55 0 45.05 36.925 75.34 88.254 75.34 37.667 0 67.578-11.45 93.796-32.51l-24.375-34.33c-23.265 17.35-46.523 26.58-70.156 26.58-26.594 0-42.098-13.66-42.098-31.02 0-20.3 11.817-29.17 61.293-40.98"/>
     <path d="m1052.6 1447.9c-2.95 28.8-19.93 51.32-49.48 51.32-27.32 0-46.524-21.05-50.586-51.32zm-43.57-79.03c21.79 0 37.3 8.13 52.81 23.26l26.21-23.26c-18.46-22.16-43.94-36.56-79.76-36.56-56.498 0-100.07 40.99-100.07 101.55 0 56.13 39.512 101.92 95.269 101.92 62.04 0 93.43-48.75 93.43-105.25 0-4.06-0.37-7.75-0.74-12.19h-143.28c5.172-31.75 27.328-49.47 56.129-49.47"/>
     <path d="m1221 1332.3c-57.97 0-100.81 45.42-100.81 101.18 0 55.75 42.84 102.29 101.18 102.29 36.92 0 59.82-13.67 77.92-33.6l-27.7-29.92c-13.66 14.41-28.06 24.37-50.59 24.37-32.5 0-56.13-28.07-56.13-62.4 0-35.08 24.01-63.14 58.35-63.14 21.05 0 36.56 9.97 50.58 24.37l26.96-26.59c-19.2-21.41-41.72-36.56-79.76-36.56"/>
     <path d="m1455.8 1531.7h44.68v-194.97h-44.68v30.29c-12.56-18.48-30.65-34.35-60.93-34.35-43.95 0-69.42 29.54-69.42 74.96v124.07h44.68v-110.77c0-30.29 15.13-47.64 41.73-47.64 25.84 0 43.94 18.1 43.94 48.37v110.04"/>
     <path d="m1590.9 1336.7h-44.68v194.97h44.68v-43.94c12.19 29.17 34.71 49.11 69.05 47.63v-47.27h-2.58c-39.15 0-66.47-25.47-66.47-77.16v-74.23"/>
     <path d="m1686.5 1336.7v194.97h44.69v-194.97zm-1.84 224.89v42.47h48.01v-42.47h-48.01"/>
     <path d="m1830.2 1397.7c0-17.35 8.86-24.36 24-24.36 9.97 0 18.83 2.21 27.7 6.65v-36.55c-11.08-6.28-23.64-9.98-40.25-9.98-32.87 0-56.13 14.4-56.13 57.23v102.66h-24.74v38.4h24.74v53.55h44.68v-53.55h52.43v-38.4h-52.43v-95.65"/>
     <path d="m2024.6 1331.2c-15.51-39.88-32.86-54.64-64.25-54.64-18.84 0-32.5 4.42-46.16 11.81l15.14 33.24c8.12-4.44 16.99-7.39 26.22-7.39 12.56 0 20.31 5.54 27.69 22.52l-81.24 194.97h47.64l55.39-144.75 50.59 144.75h46.53l-77.55-200.51"/>
     <path d="m2191.3 1557.6h42.09v-70.53h70.9v-40.62h-70.9v-70.52h-42.09v70.52h-70.9v40.62h70.9v70.53"/>
    </g>
    <path d="m2091.5 773.46c-6.63 0-12.01 4.84-12.01 10.789 0 5.93 5.38 10.859 12.01 10.859 6.62 0 12.03-4.929 12.03-10.859 0-5.949-5.41-10.781-12.03-10.789m0 19.121c-5.28 0-9.5-3.742-9.5-8.332 0-4.602 4.22-8.34 9.5-8.34s9.57 3.738 9.57 8.34c0 4.59-4.29 8.332-9.57 8.332m4.42-9.352c-0.31-0.199-0.68-0.339-1.09-0.449 0 0 0.72-0.91 3-3.621l-0.42-0.359c-0.96-0.789-2.41-0.68-3.21 0.25-2.51 2.988-2.76 3.359-2.76 3.359h-2.88v0.82c0.11 1.071 1.05 2 2.22 2h1.39c1 0 1.77 0.192 2.27 0.489 0.44 0.191 0.56 0.5 0.56 0.929 0 0.364 0 1.34-2.83 1.34h-3.92v-7.5c0-1.199-1.04-2.187-2.31-2.187h-0.56v10.429c0.05 1.168 1.02 2.079 2.2 2.141h4.59c5.16 0 5.72-2.941 5.72-4.223 0-1.488-0.76-2.707-1.97-3.418" fill="#626e79"/>
   </g>
  </g>
 </g>
</svg>
