<?xml version="1.0" encoding="UTF-8" standalone="no"?>
<svg
   width="330mm"
   height="330mm"
   version="1.1"
   viewBox="0 0 330.00002 329.99999"
   id="svg70"
   sodipodi:docname="cysa+.svg"
   inkscape:version="1.1 (c4e8f9ed74, 2021-05-24)"
   xmlns:inkscape="http://www.inkscape.org/namespaces/inkscape"
   xmlns:sodipodi="http://sodipodi.sourceforge.net/DTD/sodipodi-0.dtd"
   xmlns="http://www.w3.org/2000/svg"
   xmlns:svg="http://www.w3.org/2000/svg"
   xmlns:rdf="http://www.w3.org/1999/02/22-rdf-syntax-ns#"
   xmlns:cc="http://creativecommons.org/ns#"
   xmlns:dc="http://purl.org/dc/elements/1.1/">
  <defs
     id="defs74" />
  <sodipodi:namedview
     id="namedview72"
     pagecolor="#ffffff"
     bordercolor="#666666"
     borderopacity="1.0"
     inkscape:pageshadow="2"
     inkscape:pageopacity="0.0"
     inkscape:pagecheckerboard="0"
     inkscape:document-units="mm"
     showgrid="false"
     inkscape:zoom="0.41646456"
     inkscape:cx="367.3782"
     inkscape:cy="606.29409"
     inkscape:window-width="2560"
     inkscape:window-height="1360"
     inkscape:window-x="1920"
     inkscape:window-y="0"
     inkscape:window-maximized="1"
     inkscape:current-layer="svg70" />
  <metadata
     id="metadata2">
    <rdf:RDF>
      <cc:Work
         rdf:about="">
        <dc:format>image/svg+xml</dc:format>
        <dc:type
           rdf:resource="http://purl.org/dc/dcmitype/StillImage" />
      </cc:Work>
    </rdf:RDF>
  </metadata>
  <g
     transform="matrix(4.3434658,0,0,4.3434658,-294.68726,-481.44209)"
     id="g68">
    <g
       transform="matrix(0.35278,0,0,-0.35278,54.788,198.1)"
       id="g66">
      <g
         transform="scale(0.1)"
         id="g64">
        <path
           d="m 1451.5,2379.2 c -526.21,0 -954.32,-428.11 -954.32,-954.32 0,-264.64 105.82,-510.67 297.96,-692.77 l 10.453,-9.91 10.582,9.77 c 27.625,25.531 56.641,49.191 86.829,71 146.35,-129.24 338.36,-207.9 548.49,-207.9 209.95,0 401.81,78.532 548.13,207.58 30.03,-21.726 58.97,-45.25 86.52,-70.707 l 10.58,-9.761 10.46,9.898 c 192.58,182.48 298.63,428.53 298.63,692.8 0,526.21 -428.11,954.32 -954.32,954.32"
           fill="#ffffff"
           id="path4" />
        <g
           fill="#e32124"
           id="g22">
          <path
             d="m 1212.9,1868.1 c -35.21,0 -62.85,24.74 -62.85,56.62 0,31.9 27.64,56.88 62.85,56.88 35.21,0 62.81,-24.98 62.81,-56.88 0,-31.88 -27.6,-56.62 -62.81,-56.62 m 0,90.67 c -22.38,-0.01 -39.99,-15.01 -39.99,-34.05 0,-19.04 17.61,-33.78 39.99,-33.78 22.38,0 39.98,14.74 39.98,33.78 0,19.04 -17.6,34.05 -39.98,34.05"
             id="path6" />
          <path
             d="m 1437.5,1868.1 c -12.61,0 -22.82,10.45 -22.82,23.32 v 47.1 c 0,11.2 -9.78,20.25 -21.91,20.25 -11.89,0 -21.65,-9.05 -21.65,-20.25 v -70.42 c -12.63,0 -22.85,10.23 -22.85,22.84 v 47.58 c 0,11.2 -9.75,20.25 -21.87,20.25 -11.92,0 -21.69,-9.05 -21.69,-20.25 v -47.36 c 0,-12.61 -10.21,-23.06 -22.83,-23.06 v 70.42 c 0,23.8 19.98,43.08 44.52,43.08 13.29,0 25.21,-5.46 33.29,-14.29 8.09,8.83 20,14.29 33.08,14.29 24.74,0 44.74,-19.28 44.74,-43.08 l -0.01,-70.42"
             id="path8" />
          <path
             d="m 1511.8,1868.3 c -5.96,0 -11.67,0.46 -16.91,1.67 -11.9,3.34 -18.81,15.68 -15.69,27.6 0.46,1.43 0.94,2.85 1.44,4.05 l 0.2,0.24 c 6.43,-7.16 16.9,-10.72 30.96,-10.72 20.95,0 37.35,14.75 37.35,33.32 0,19.28 -16.4,34.51 -37.35,34.51 -19.77,0 -39.52,-10.96 -39.52,-35 v -74 c 0,-12.37 -10.45,-22.38 -22.85,-22.38 v 96.38 c 0,33.33 26.2,57.84 62.37,57.84 15.94,0 30.92,-5.96 42.33,-16.41 11.46,-10.72 17.87,-25.25 17.87,-40.94 0,-31.43 -26.41,-56.16 -60.2,-56.16"
             id="path10" />
          <path
             d="m 1674.7,2003.2 h -48.91 v -135.15 h -0.95 c -12.13,0 -21.89,10.44 -21.89,22.82 v 112.33 h -48.91 c -12.37,0 -22.36,10.23 -22.36,22.61 h 165.62 c 0,-12.38 -9.99,-22.6 -22.6,-22.61"
             id="path12" />
          <path
             d="m 1870.3,1882.4 -12.13,26.08 h -81.15 l -11.96,-26.84 c -5.66,-10.8 -20.73,-13.96 -32.26,-13.96 l 66.15,145.04 c 3.75,8.32 10.41,13.08 18.14,13.08 7.69,0 14.54,-4.76 18.3,-13.08 l 65.39,-143.28 c -12.3,-1.16 -25.7,2.49 -30.48,12.96 m -50.63,119.84 -32.49,-71.4 h 61.27 l -32.72,71.64 3.94,-0.24"
             id="path14" />
          <path
             d="m 1124.4,1983.2 c -12.38,13.08 -30.46,21.63 -50.46,21.63 -35.44,0 -64.25,-25.68 -64.25,-57.34 0,-31.64 28.81,-57.57 64.25,-57.57 16.9,0 32.85,6.42 44.98,16.65 8.34,6.91 20.7,6.41 28.81,-0.48 -6.2,-9.51 -14.52,-17.84 -24.75,-24.26 -14.53,-9.3 -31.43,-14.05 -49.04,-14.05 -47.82,0 -86.611,35.7 -86.611,79.71 0,44.04 38.791,79.72 86.611,79.72 34.04,0 64.97,-18.55 78.77,-47.11 -8.8,-5.72 -20.94,-4.99 -28.31,3.1"
             id="path16" />
          <path
             d="m 1909.4,1876.8 c -6.63,0 -12.01,4.84 -12.01,10.78 0,5.94 5.38,10.87 12.01,10.87 6.62,0 12.02,-4.93 12.02,-10.87 0,-5.94 -5.4,-10.78 -12.02,-10.78 m 0,19.12 c -5.27,0 -9.5,-3.75 -9.5,-8.34 0,-4.59 4.23,-8.34 9.5,-8.34 5.29,0 9.57,3.75 9.57,8.34 0,4.59 -4.28,8.34 -9.57,8.34 m 4.43,-9.36 c -0.32,-0.2 -0.69,-0.34 -1.1,-0.45 0,0 0.73,-0.91 3.01,-3.62 l -0.43,-0.36 c -0.96,-0.78 -2.4,-0.67 -3.2,0.25 -2.51,2.99 -2.77,3.36 -2.77,3.36 h -2.88 v 0.82 c 0.11,1.07 1.05,2.01 2.22,2.01 h 1.4 c 0.99,0 1.76,0.18 2.27,0.48 0.43,0.19 0.56,0.5 0.56,0.93 0,0.36 0,1.35 -2.83,1.35 h -3.93 v -7.51 c 0,-1.19 -1.03,-2.18 -2.3,-2.18 h -0.57 v 10.43 c 0.05,1.16 1.03,2.07 2.21,2.13 h 4.59 c 5.15,0 5.71,-2.94 5.71,-4.22 0,-1.48 -0.76,-2.7 -1.96,-3.42"
             id="path18" />
          <path
             d="m 1704.6,2025.8 v -135.58 c 0,-12.14 10.47,-22.14 22.84,-22.14 v 135.6 c 0,12.12 -10.49,22.12 -22.84,22.12"
             id="path20" />
        </g>
        <path
           d="m 2095.6,776.21 c -6.64,0 -12.02,4.84 -12.02,10.789 0,5.93 5.38,10.859 12.02,10.859 6.62,0 12.03,-4.929 12.03,-10.859 0,-5.949 -5.41,-10.789 -12.03,-10.789 m 0,19.121 c -5.28,0 -9.51,-3.742 -9.51,-8.332 0,-4.602 4.23,-8.34 9.51,-8.34 5.28,0 9.57,3.738 9.57,8.34 0,4.59 -4.29,8.332 -9.57,8.332 m 4.42,-9.352 c -0.3,-0.199 -0.68,-0.351 -1.09,-0.449 0,0 0.72,-0.91 3,-3.633 l -0.43,-0.359 c -0.95,-0.777 -2.4,-0.668 -3.2,0.262 -2.51,2.988 -2.76,3.359 -2.76,3.359 h -2.88 v 0.82 c 0.11,1.071 1.04,2 2.21,2 h 1.4 c 0.99,0 1.77,0.18 2.27,0.489 0.43,0.179 0.56,0.492 0.56,0.929 0,0.364 0,1.34 -2.83,1.34 h -3.93 v -7.5 c 0,-1.199 -1.03,-2.187 -2.3,-2.187 h -0.57 v 10.429 c 0.06,1.168 1.03,2.071 2.21,2.129 h 4.59 c 5.16,0 5.71,-2.937 5.71,-4.211 0,-1.488 -0.76,-2.707 -1.96,-3.418"
           fill="#626e79"
           id="path24" />
        <path
           d="m 2096.3,764.33 c -23.62,21.18 -48.25,40.918 -73.59,59.508 159.1,151.28 258.58,364.7 258.58,601.04 0,457.55 -372.25,829.8 -829.8,829.8 -457.55,0 -829.8,-372.25 -829.8,-829.8 0,-236.21 99.367,-449.51 258.3,-600.78 -25.496,-18.661 -50.25,-38.481 -73.977,-59.75 -179.43,175.2 -278.06,409.19 -278.06,660.53 0,509.24 414.3,923.54 923.54,923.54 509.24,0 923.54,-414.3 923.54,-923.54 0,-250.98 -98.86,-485 -278.73,-660.55 z m -99.09,77.688 c -99.57,68.191 -210.65,116.66 -327.93,143.52 l -33,7.27 v 93.781 h -72.32 c -31.85,0 -63.57,7.93 -91.59,23.11 l -23.1,12.44 -15.18,-8.89 c -29.67,-17.5 -63.57,-26.66 -98.02,-26.66 h -73.41 v -94.731 l -38.07,-8.16 c -114.01,-27.328 -222.07,-75.187 -319.04,-141.47 -155.59,145.89 -253.08,353.04 -253.08,582.65 0,440.58 358.44,799.02 799.02,799.02 440.58,0 799.02,-358.44 799.02,-799.02 0,-229.72 -97.58,-436.97 -253.3,-582.86 z m -607.96,78.601 c 0,40.879 33.22,74.109 73.96,74.109 40.87,0 74.09,-33.23 74.09,-74.109 0,-40.859 -33.22,-74.09 -74.09,-74.09 -40.74,0 -73.96,33.231 -73.96,74.09 z m 26.38,-92.41 c 14.22,-7.52 30.49,-11.75 47.58,-11.75 57.41,0 104.17,46.75 104.17,104.16 0,57.43 -46.76,104.18 -104.17,104.18 -57.42,0 -104.04,-46.749 -104.04,-104.18 0,-29.383 12.31,-55.902 32,-74.91 l -47.17,-65.891 -13.26,9.16 c -22.28,15.579 -35.55,41.008 -35.55,68.079 v 196.99 h 43.34 c 39.78,0 78.88,10.67 113.2,30.76 l 0.54,0.28 8.34,-4.38 c 32.4,-17.5 69.04,-26.66 105.82,-26.66 h 42.38 v -197.26 c 0,-26.937 -13.26,-52.367 -35.41,-67.809 l -120.85,-84.761 -83.94,58.383 z m 35.86,-202.36 c -199.61,0 -382.19,73.738 -522.39,195.19 90.229,60.59 190.18,104.82 295.5,130.93 l 38.06,8.582 v -101.03 c 0,-36.911 18.18,-71.629 48.39,-92.68 l 139.17,-96.942 138.08,96.942 c 30.08,21.051 47.98,55.629 47.98,92.41 v 102.39 l 33,-7.782 c 108.49,-25.769 211.43,-70.699 304.25,-133.12 -140.14,-121.27 -322.59,-194.89 -522.04,-194.89 z m 0,1753.3 c -526.21,0 -954.32,-428.11 -954.32,-954.32 0,-264.64 105.82,-510.67 297.96,-692.77 l 10.453,-9.91 10.582,9.77 c 27.625,25.531 56.641,49.191 86.829,71 146.35,-129.24 338.36,-207.9 548.49,-207.9 209.95,0 401.81,78.532 548.13,207.58 30.03,-21.726 58.97,-45.25 86.52,-70.707 l 10.58,-9.761 10.46,9.898 c 192.58,182.48 298.63,428.53 298.63,692.8 0,526.21 -428.11,954.32 -954.32,954.32"
           fill="#626e79"
           id="path26" />
        <path
           d="M 2434.7,1765.9 H 375.6 V 1267 c 0,-46.12 37.519,-83.64 83.64,-83.64 h 2059.1 v 498.88 c 0,46.13 -37.53,83.66 -83.65,83.66"
           fill="#e32124"
           id="path28" />
        <g
           fill="#ffffff"
           id="g40">
          <path
             d="m 835.19,1485.8 v 0.82 c 0,81.44 60.977,148.14 147.74,148.14 52.794,0 84.714,-18.41 112.13,-44.6 l -32.33,-37.24 c -22.92,21.28 -47.48,35.6 -80.214,35.6 -54.43,0 -94.532,-45.02 -94.532,-101.08 v -0.82 c 0,-56.06 39.696,-101.49 94.532,-101.49 35.194,0 57.704,13.91 82.264,36.83 l 32.32,-32.74 c -29.87,-31.1 -62.61,-50.74 -116.22,-50.74 -83.484,0 -145.69,65.06 -145.69,147.32"
             id="path30" />
          <path
             d="m 1283.7,1559.5 h 51.56 l -85.94,-222.22 c -17.19,-44.19 -36.42,-60.57 -71.2,-60.57 -20.47,0 -36.02,4.91 -51.16,13.09 l 16.78,36.84 c 9,-4.91 18.82,-8.18 29.05,-8.18 13.92,0 22.51,6.13 30.7,24.55 l -90.04,216.49 h 53.21 l 60.97,-160.43 56.07,160.43"
             id="path32" />
          <path
             d="m 1354.1,1385.2 30.29,36.01 c 27.42,-23.73 55.24,-37.23 90.43,-37.23 31.11,0 50.76,14.72 50.76,36 v 0.82 c 0,20.47 -11.47,31.52 -64.67,43.79 -60.98,14.74 -95.35,32.74 -95.35,85.53 v 0.82 c 0,49.11 40.93,83.08 97.81,83.08 41.74,0 74.89,-12.69 103.95,-36.02 l -27.02,-38.05 c -25.78,19.23 -51.56,29.46 -77.75,29.46 -29.46,0 -46.65,-15.14 -46.65,-33.96 v -0.83 c 0,-22.09 13.09,-31.91 68.34,-45.01 60.57,-14.73 91.67,-36.42 91.67,-83.9 v -0.82 c 0,-53.6 -42.15,-85.52 -102.31,-85.52 -43.78,0 -85.12,15.13 -119.5,45.83"
             id="path34" />
          <path
             d="m 1782.1,1457.2 -49.52,114.58 -49.11,-114.58 z m -72.03,174.74 h 46.66 l 126.04,-288.51 h -53.2 l -29.05,69.16 h -135.46 l -29.47,-69.16 h -51.57 l 126.05,288.51"
             id="path36" />
          <path
             d="m 1956.4,1465 h -78.58 v 45.43 h 78.58 v 77.75 h 46.65 v -77.75 h 78.57 V 1465 h -78.57 v -78.16 H 1956.4 V 1465"
             id="path38" />
        </g>
        <g
           fill="#e32124"
           id="g60">
          <path
             d="m 964.02,535.62 c -30.136,16.559 -39.703,52.391 -23.296,82.231 16.226,29.57 51.476,41.558 82.793,24.347 19.06,-10.469 26.93,-23.449 31.65,-38.347 l -19.07,-7.032 c -4.05,12.219 -10.07,22.27 -21.9,28.77 -19.79,10.871 -43.063,2.492 -54.259,-17.899 -11.195,-20.402 -5.949,-44.82 13.844,-55.691 12.703,-6.988 23.68,-6.281 37.085,-2.879 l 5.18,-18.223 c -16.952,-5.296 -32.671,-5.91 -52.027,4.723"
             id="path42" />
          <path
             d="m 1168.9,557.02 -62.5,23.582 -10.84,-28.731 55.4,-20.902 -6.55,-17.36 -55.39,20.891 -11.19,-29.66 63.29,-23.871 -6.55,-17.367 -82.7,31.187 41.67,110.48 81.91,-30.891 -6.55,-17.359"
             id="path44" />
          <path
             d="m 1255.2,534.58 -29.45,6.594 -8.66,-38.641 29.61,-6.64 c 14.47,-3.243 25.38,2.257 28.04,14.109 2.82,12.66 -4.58,21.219 -19.54,24.578 z m 2.52,-102.13 -19.32,46.481 -25.32,5.672 -8.98,-40.133 -20.23,4.519 25.78,115.13 51.31,-11.48 c 26.48,-5.942 39.64,-23.571 34.58,-46.102 -4.26,-19.078 -18.2,-28.051 -35.3,-28.867 l 21.32,-50.551 -23.84,5.328"
             id="path46" />
          <path
             d="m 1379,416.77 -20.85,1.73 8.16,98.512 -37.31,3.09 1.58,19.16 95.48,-7.91 -1.59,-19.161 -37.32,3.09 -8.15,-98.511"
             id="path48" />
          <path
             d="m 1482.2,532.33 2.1,-117.97 -20.73,-0.371 -2.1,117.97 20.73,0.371"
             id="path50" />
          <path
             d="m 1615.3,525.44 -66.65,-7.921 3.8,-31.989 59.13,7.028 2.22,-18.75 -59.11,-7.02 5.67,-47.73 -20.59,-2.45 -13.95,117.22 87.26,10.367 2.22,-18.758"
             id="path52" />
          <path
             d="m 1668.3,556.75 25.93,-115.13 -20.23,-4.57 -25.92,115.13 20.22,4.57"
             id="path54" />
          <path
             d="m 1799.3,577.38 -63.27,-21.359 9.83,-29.09 56.07,18.949 5.93,-17.578 -56.06,-18.93 10.13,-30.031 64.07,21.64 5.94,-17.57 -83.71,-28.289 -37.77,111.83 82.9,28 5.94,-17.57"
             id="path56" />
          <path
             d="m 1874.1,611.7 -20.72,-10.578 36.5,-71.461 20.71,10.578 c 22.07,11.262 28.89,33.5 18.31,54.203 -10.58,20.731 -32.73,28.528 -54.8,17.258 z m 45.08,-88.269 -39.18,-20.008 -53.67,105.09 39.18,20.008 c 33.04,16.859 67.42,5.851 82.61,-23.872 15.18,-29.726 4.08,-64.359 -28.94,-81.218"
             id="path58" />
        </g>
        <path
           d="m 2095.6,773.21 c -6.64,0 -12.02,4.848 -12.02,10.777 0,5.942 5.38,10.871 12.02,10.871 6.62,0 12.03,-4.929 12.03,-10.871 0,-5.929 -5.41,-10.777 -12.03,-10.777 m 0,19.121 c -5.28,0 -9.51,-3.75 -9.51,-8.344 0,-4.59 4.23,-8.328 9.51,-8.328 5.28,0 9.57,3.738 9.57,8.328 0,4.594 -4.29,8.344 -9.57,8.344 m 4.42,-9.352 c -0.3,-0.199 -0.68,-0.339 -1.09,-0.449 0,0 0.72,-0.91 3,-3.621 l -0.43,-0.371 c -0.95,-0.777 -2.4,-0.668 -3.2,0.262 -2.51,2.988 -2.76,3.359 -2.76,3.359 h -2.88 v 0.82 c 0.11,1.071 1.04,2 2.21,2 h 1.4 c 0.99,0 1.77,0.192 2.27,0.489 0.43,0.179 0.56,0.5 0.56,0.941 0,0.352 0,1.328 -2.83,1.328 h -3.93 v -7.5 c 0,-1.199 -1.03,-2.179 -2.3,-2.179 h -0.57 v 10.421 c 0.06,1.168 1.03,2.079 2.21,2.141 h 4.59 c 5.16,0 5.71,-2.941 5.71,-4.211 0,-1.5 -0.76,-2.719 -1.96,-3.43"
           fill="#626e79"
           id="path62" />
      </g>
    </g>
  </g>
</svg>
