<?xml version="1.0" encoding="UTF-8" standalone="no"?>
<!-- Created with Inkscape (http://www.inkscape.org/) -->

<svg
   version="1.1"
   id="svg2"
   width="285.6944"
   height="260.09732"
   viewBox="0 0 285.6944 260.09732"
   sodipodi:docname="CASP+ ce Certified.eps"
   xmlns:inkscape="http://www.inkscape.org/namespaces/inkscape"
   xmlns:sodipodi="http://sodipodi.sourceforge.net/DTD/sodipodi-0.dtd"
   xmlns="http://www.w3.org/2000/svg"
   xmlns:svg="http://www.w3.org/2000/svg">
  <defs
     id="defs6" />
  <sodipodi:namedview
     id="namedview4"
     pagecolor="#ffffff"
     bordercolor="#666666"
     borderopacity="1.0"
     inkscape:showpageshadow="2"
     inkscape:pageopacity="0.0"
     inkscape:pagecheckerboard="0"
     inkscape:deskcolor="#d1d1d1"
     showgrid="false" />
  <g
     id="g10"
     inkscape:groupmode="layer"
     inkscape:label="Page 1"
     transform="matrix(1.3333333,0,0,-1.3333333,0,384)">
    <g
       id="g344"
       transform="translate(-37.5602,48.370007)">
      <g
         id="g12"
         transform="scale(0.1)">
        <path
           d="m 1447.26,2396.3 c -526.213,0 -954.326,-428.11 -954.326,-954.33 0,-264.62 105.828,-510.65 297.972,-692.771 l 10.446,-9.91 10.582,9.781 c 27.64,25.532 56.718,49.121 86.918,70.918 C 1045.2,690.801 1237.17,612.18 1447.26,612.18 c 209.96,0 401.82,78.531 548.13,207.57 30.03,-21.73 58.98,-45.262 86.51,-70.711 l 10.59,-9.769 10.45,9.91 c 192.57,182.492 298.63,428.53 298.63,692.79 0,526.22 -428.1,954.33 -954.31,954.33"
           style="fill:#ffffff;fill-opacity:1;fill-rule:nonzero;stroke:none"
           id="path14" />
        <path
           d="m 2092.06,781.422 c -23.62,21.18 -48.2,40.976 -73.53,59.566 159.07,151.274 258.53,364.662 258.53,600.982 0,457.56 -372.25,829.81 -829.8,829.81 -457.565,0 -829.815,-372.25 -829.815,-829.81 0,-236.17 99.348,-449.45 258.254,-600.708 -25.496,-18.66 -50.195,-38.551 -73.918,-59.821 -179.433,175.219 -278.066,409.209 -278.066,660.529 0,509.24 414.308,923.55 923.545,923.55 509.24,0 923.53,-414.31 923.53,-923.55 0,-250.98 -98.86,-484.99 -278.73,-660.548 z m -633.42,331.798 c 12.89,-8.42 28.21,-15.98 42.26,-16.81 48.19,-2.84 80.12,-8.43 95.69,-11.73 l -0.01,-12.8 0.03,-159.04 c 0,-35.481 -18.88,-68.879 -49.26,-87.192 l -88.71,-53.418 z m -30.77,-340.97 -88.69,53.422 c -30.38,18.297 -49.25,51.707 -49.27,87.187 v 170.461 c 16.86,3.49 51.11,9.62 95.91,12.8 13.2,0.94 28.74,8.68 42.05,17.35 z m -779.643,669.72 c 0,440.59 358.453,799.03 799.033,799.03 440.58,0 799.02,-358.44 799.02,-799.03 0,-229.73 -97.59,-436.99 -253.33,-582.88 -110.18,75.422 -234.41,126.719 -365.58,151.35 l -0.01,61.43 0.04,36.49 -11.08,3.23 c -1.57,0.46 -38.9,11.14 -113.61,15.54 -12.07,0.71 -35.61,15.75 -48.57,28.72 l -10.89,10.89 -10.88,-10.9 c -11.07,-11.07 -36.41,-28.13 -48.74,-29.01 -67.45,-4.79 -111.1,-15.79 -112.91,-16.26 l -11.59,-2.96 v -98.65 C 1130.85,983.75 1009.2,933.02 901.305,859.34 745.715,1005.22 648.227,1212.37 648.227,1441.97 Z M 1447.26,642.949 c -199.59,0 -382.18,73.742 -522.377,195.18 101.227,67.922 214.687,115.211 334.247,139.5 v -64.77 c 0.02,-46.211 24.6,-89.73 64.17,-113.558 l 119.97,-72.281 119.95,72.269 c 39.58,23.84 64.17,67.34 64.17,113.551 l -0.02,66.422 c 122.33,-23.774 238.49,-71.684 342.02,-141.34 -140.15,-121.32 -322.64,-194.973 -522.13,-194.973 z m 0,1753.351 c -526.213,0 -954.326,-428.11 -954.326,-954.33 0,-264.62 105.828,-510.65 297.972,-692.771 l 10.446,-9.91 10.582,9.781 c 27.64,25.532 56.718,49.121 86.918,70.918 C 1045.2,690.801 1237.17,612.18 1447.26,612.18 c 209.96,0 401.82,78.531 548.13,207.57 30.03,-21.73 58.98,-45.262 86.51,-70.711 l 10.59,-9.769 10.45,9.91 c 192.57,182.492 298.63,428.53 298.63,692.79 0,526.22 -428.1,954.33 -954.31,954.33"
           style="fill:#626e79;fill-opacity:1;fill-rule:nonzero;stroke:none"
           id="path16" />
        <path
           d="m 1208.66,1885.16 c -35.22,0 -62.85,24.74 -62.85,56.62 0,31.9 27.63,56.88 62.85,56.88 35.2,0 62.81,-24.98 62.81,-56.88 0,-31.88 -27.61,-56.62 -62.81,-56.62 m 0,90.66 c -22.39,0 -39.99,-15 -39.99,-34.04 0,-19.04 17.6,-33.78 39.99,-33.78 22.38,0 39.98,14.74 39.98,33.78 0,19.04 -17.6,34.04 -39.98,34.04"
           style="fill:#e22224;fill-opacity:1;fill-rule:nonzero;stroke:none"
           id="path18" />
        <path
           d="m 1433.27,1885.16 c -12.61,0 -22.82,10.45 -22.82,23.32 v 47.11 c 0,11.19 -9.78,20.23 -21.91,20.23 -11.89,0 -21.65,-9.04 -21.65,-20.23 v -70.43 c -12.64,0 -22.85,10.23 -22.85,22.84 v 47.59 c 0,11.19 -9.76,20.23 -21.88,20.23 -11.91,0 -21.69,-9.04 -21.69,-20.23 v -47.37 c 0,-12.61 -10.2,-23.06 -22.82,-23.06 v 70.43 c 0,23.79 19.98,43.07 44.51,43.07 13.29,0 25.21,-5.46 33.3,-14.28 8.08,8.82 20,14.28 33.08,14.28 24.74,0 44.73,-19.28 44.73,-43.07 v -70.43"
           style="fill:#e22224;fill-opacity:1;fill-rule:nonzero;stroke:none"
           id="path20" />
        <path
           d="m 1507.52,1885.39 c -5.96,0 -11.67,0.46 -16.9,1.67 -11.91,3.34 -18.81,15.68 -15.7,27.6 0.46,1.43 0.94,2.84 1.44,4.05 l 0.2,0.24 c 6.44,-7.16 16.91,-10.73 30.96,-10.73 20.96,0 37.35,14.75 37.35,33.33 0,19.27 -16.39,34.5 -37.35,34.5 -19.76,0 -39.51,-10.95 -39.51,-34.99 v -74 c 0,-12.37 -10.46,-22.38 -22.85,-22.38 v 96.38 c 0,33.33 26.2,57.84 62.36,57.84 15.96,0 30.93,-5.95 42.34,-16.42 11.46,-10.71 17.86,-25.24 17.86,-40.93 0,-31.43 -26.41,-56.16 -60.2,-56.16"
           style="fill:#e22224;fill-opacity:1;fill-rule:nonzero;stroke:none"
           id="path22" />
        <path
           d="m 1670.46,2020.32 h -48.9 v -135.15 h -0.94 c -12.13,0 -21.9,10.44 -21.9,22.82 v 112.33 h -48.92 c -12.37,0 -22.35,10.23 -22.35,22.61 h 165.63 c 0,-12.38 -9.99,-22.61 -22.62,-22.61"
           style="fill:#e22224;fill-opacity:1;fill-rule:nonzero;stroke:none"
           id="path24" />
        <path
           d="m 1866.08,1899.52 -12.13,26.08 h -81.16 l -11.95,-26.84 c -5.66,-10.8 -20.73,-13.96 -32.27,-13.96 l 66.17,145.04 c 3.74,8.32 10.4,13.07 18.12,13.07 7.7,0 14.55,-4.75 18.31,-13.07 l 65.39,-143.28 c -12.3,-1.17 -25.7,2.49 -30.48,12.96 m -50.64,119.84 -32.49,-71.4 h 61.27 l -32.72,71.64 3.94,-0.24"
           style="fill:#e22224;fill-opacity:1;fill-rule:nonzero;stroke:none"
           id="path26" />
        <path
           d="m 1120.17,2000.33 c -12.37,13.08 -30.45,21.63 -50.45,21.63 -35.45,0 -64.26,-25.68 -64.26,-57.33 0,-31.65 28.81,-57.58 64.26,-57.58 16.9,0 32.84,6.42 44.98,16.65 8.34,6.91 20.7,6.41 28.81,-0.48 -6.21,-9.51 -14.53,-17.84 -24.76,-24.26 -14.53,-9.3 -31.43,-14.06 -49.03,-14.06 -47.83,0 -86.615,35.71 -86.615,79.73 0,44.03 38.785,79.71 86.615,79.71 34.03,0 64.97,-18.55 78.77,-47.11 -8.8,-5.71 -20.95,-5 -28.32,3.1"
           style="fill:#e22224;fill-opacity:1;fill-rule:nonzero;stroke:none"
           id="path28" />
        <path
           d="m 1905.2,1893.88 c -6.64,0 -12.01,4.83 -12.01,10.78 0,5.94 5.37,10.86 12.01,10.86 6.62,0 12.03,-4.92 12.03,-10.86 0,-5.95 -5.41,-10.78 -12.03,-10.78 m 0,19.11 c -5.28,0 -9.5,-3.74 -9.5,-8.33 0,-4.59 4.22,-8.34 9.5,-8.34 5.28,0 9.57,3.75 9.57,8.34 0,4.59 -4.29,8.33 -9.57,8.33 m 4.42,-9.35 c -0.3,-0.2 -0.68,-0.34 -1.09,-0.45 0,0 0.73,-0.91 3,-3.62 l -0.42,-0.36 c -0.96,-0.78 -2.41,-0.67 -3.21,0.25 -2.51,2.99 -2.76,3.36 -2.76,3.36 h -2.88 v 0.82 c 0.11,1.07 1.05,2 2.22,2 h 1.39 c 1,0 1.77,0.19 2.27,0.49 0.44,0.19 0.56,0.5 0.56,0.94 0,0.35 0,1.34 -2.83,1.34 h -3.92 v -7.51 c 0,-1.19 -1.04,-2.19 -2.31,-2.19 h -0.57 v 10.43 c 0.06,1.17 1.03,2.08 2.21,2.14 h 4.59 c 5.16,0 5.72,-2.94 5.72,-4.21 0,-1.5 -0.76,-2.71 -1.97,-3.43"
           style="fill:#e22224;fill-opacity:1;fill-rule:nonzero;stroke:none"
           id="path30" />
        <path
           d="m 1700.33,2042.86 v -135.58 c 0,-12.14 10.48,-22.14 22.85,-22.14 v 135.6 c 0,12.12 -10.48,22.12 -22.85,22.12"
           style="fill:#e22224;fill-opacity:1;fill-rule:nonzero;stroke:none"
           id="path32" />
        <path
           d="M 2434.67,1782.98 H 375.602 v -498.9 c 0,-46.12 37.523,-83.65 83.64,-83.65 H 2518.31 v 498.89 c 0,46.13 -37.53,83.66 -83.64,83.66"
           style="fill:#e22224;fill-opacity:1;fill-rule:nonzero;stroke:none"
           id="path34" />
        <path
           d="m 976.188,1350.94 c -79.336,0 -138.434,61.82 -138.434,140.37 0,77.77 57.93,141.17 140.371,141.17 50.175,0 80.505,-17.51 106.555,-42.39 l -30.72,-35.39 c -21.78,20.22 -45.11,33.83 -76.218,33.83 -52.105,0 -89.82,-42.77 -89.82,-96.43 0,-53.67 37.715,-97.23 89.82,-97.23 33.448,0 54.828,13.62 78.158,35.4 l 30.72,-31.11 c -28.39,-29.55 -59.5,-48.22 -110.432,-48.22"
           style="fill:#ffffff;fill-opacity:1;fill-rule:nonzero;stroke:none"
           id="path36" />
        <path
           d="m 1230.8,1572.58 -46.67,-108.87 h 93.71 z m 142.71,-216.97 h -50.57 l -27.6,65.71 h -128.71 l -28,-65.71 h -49 l 119.77,274.14 h 44.33 l 119.78,-274.14"
           style="fill:#ffffff;fill-opacity:1;fill-rule:nonzero;stroke:none"
           id="path38" />
        <path
           d="m 1505.08,1513.48 c 57.55,-13.99 87.5,-34.6 87.5,-80.1 0,-51.32 -40.05,-81.65 -97.23,-81.65 -41.6,0 -80.88,14.37 -113.54,43.53 l 28.78,34.22 c 26.06,-22.55 52.11,-35.38 85.93,-35.38 29.55,0 48.23,13.61 48.23,34.61 0,19.83 -10.89,30.33 -61.46,41.99 -57.93,14 -90.59,31.12 -90.59,81.67 0,47.44 38.88,79.33 92.93,79.33 39.67,0 71.18,-12.06 98.77,-34.23 l -25.66,-36.15 c -24.5,18.27 -48.99,27.99 -73.89,27.99 -27.98,0 -44.32,-14.39 -44.32,-32.66 0,-21.39 12.45,-30.73 64.55,-43.17"
           style="fill:#ffffff;fill-opacity:1;fill-rule:nonzero;stroke:none"
           id="path40" />
        <path
           d="m 1726.3,1584.25 h -55.6 v -97.99 h 55.6 c 36.17,0 58.72,19.84 58.72,49 0,32.27 -22.94,48.99 -58.72,48.99 z m -1.54,-141.15 h -54.06 v -87.49 h -47.83 v 272.19 h 107.33 c 63.37,0 103.43,-35.77 103.43,-91.37 0,-61.45 -49,-93.33 -108.87,-93.33"
           style="fill:#ffffff;fill-opacity:1;fill-rule:nonzero;stroke:none"
           id="path42" />
        <path
           d="m 1936.05,1470.12 h -75.35 v 43.57 h 75.35 v 74.57 h 44.75 v -74.57 h 75.36 v -43.57 h -75.36 v -74.96 h -44.75 v 74.96"
           style="fill:#ffffff;fill-opacity:1;fill-rule:nonzero;stroke:none"
           id="path44" />
        <path
           d="m 2091.08,795.762 c -6.63,0 -12.01,4.84 -12.01,10.777 0,5.93 5.38,10.859 12.01,10.859 6.62,0 12.03,-4.929 12.03,-10.859 0,-5.937 -5.41,-10.777 -12.03,-10.777 m 0,19.109 c -5.27,0 -9.5,-3.742 -9.5,-8.332 0,-4.598 4.23,-8.34 9.5,-8.34 5.29,0 9.57,3.742 9.57,8.34 0,4.59 -4.28,8.332 -9.57,8.332 m 4.43,-9.351 c -0.31,-0.2 -0.69,-0.329 -1.1,-0.45 0,0 0.73,-0.91 3.01,-3.621 l -0.43,-0.367 c -0.95,-0.781 -2.4,-0.66 -3.2,0.258 -2.51,2.992 -2.76,3.359 -2.76,3.359 h -2.89 v 0.821 c 0.12,1.07 1.05,2 2.22,2 h 1.4 c 0.99,0 1.77,0.191 2.27,0.5 0.43,0.179 0.56,0.5 0.56,0.929 0,0.352 0,1.332 -2.83,1.332 h -3.93 v -7.5 c 0,-1.199 -1.03,-2.179 -2.3,-2.179 h -0.57 v 10.429 c 0.06,1.16 1.03,2.071 2.21,2.129 h 4.59 c 5.15,0 5.71,-2.941 5.71,-4.211 0,-1.5 -0.76,-2.719 -1.96,-3.429"
           style="fill:#626e79;fill-opacity:1;fill-rule:nonzero;stroke:none"
           id="path46" />
        <path
           d="m 897.184,613.582 c -26.934,18.387 -32.664,53.09 -14.454,79.746 18.032,26.41 52.403,34.492 80.383,15.383 17.032,-11.633 23.274,-24.609 26.352,-39.09 l -18.641,-4.891 c -2.699,11.911 -7.465,21.942 -18.027,29.149 -17.692,12.082 -40.414,6.312 -52.856,-11.91 -12.441,-18.219 -9.738,-41.758 7.957,-53.84 11.356,-7.75 21.77,-8.078 34.739,-6.098 l 3.218,-17.679 c -16.492,-3.454 -31.378,-2.582 -48.671,9.23"
           style="fill:#e22224;fill-opacity:1;fill-rule:nonzero;stroke:none"
           id="path48" />
        <path
           d="m 1078.16,620.84 -56.18,29.148 -13.4,-25.828 49.8,-25.832 -8.09,-15.609 -49.81,25.832 -13.835,-26.672 56.895,-29.508 -8.09,-15.609 -74.352,38.57 51.522,99.316 73.64,-38.187 -8.1,-15.621"
           style="fill:#e22224;fill-opacity:1;fill-rule:nonzero;stroke:none"
           id="path50" />
        <path
           d="m 1142.66,595.07 -26.81,10.032 -13.17,-35.192 26.96,-10.09 c 13.18,-4.929 24.14,-1.179 28.18,9.602 4.31,11.527 -1.54,20.547 -15.16,25.648 z m -10.94,-96.289 -12.09,46.168 -23.06,8.633 -13.67,-36.531 -18.42,6.898 39.23,104.821 46.72,-17.489 c 24.11,-9.019 34.17,-27.301 26.5,-47.812 -6.51,-17.379 -20.76,-24 -36.95,-22.539 l 13.45,-50.289 -21.71,8.14"
           style="fill:#e22224;fill-opacity:1;fill-rule:nonzero;stroke:none"
           id="path52" />
        <path
           d="m 1226.68,471.898 -19.25,4.711 22.24,91.012 -34.48,8.43 4.32,17.699 88.22,-21.559 -4.33,-17.711 -34.47,8.43 -22.25,-91.012"
           style="fill:#e22224;fill-opacity:1;fill-rule:nonzero;stroke:none"
           id="path54" />
        <path
           d="m 1325.41,566.941 -17.47,-110.531 -19.42,3.059 17.47,110.543 19.42,-3.071"
           style="fill:#e22224;fill-opacity:1;fill-rule:nonzero;stroke:none"
           id="path56" />
        <path
           d="m 1433.16,538.82 -63.46,4.66 -2.24,-30.449 56.29,-4.133 -1.31,-17.859 -56.29,4.133 -3.34,-45.442 -19.61,1.43 8.2,111.61 83.07,-6.09 -1.31,-17.86"
           style="fill:#e22224;fill-opacity:1;fill-rule:nonzero;stroke:none"
           id="path58" />
        <path
           d="m 1472.97,557.781 1.82,-111.902 -19.66,-0.309 -1.83,111.899 19.67,0.312"
           style="fill:#e22224;fill-opacity:1;fill-rule:nonzero;stroke:none"
           id="path60" />
        <path
           d="m 1583.91,548 -63.03,-5.879 2.69,-28.973 55.87,5.211 1.63,-17.5 -55.86,-5.218 2.79,-29.922 63.83,5.961 1.63,-17.508 -83.4,-7.774 -10.39,111.403 82.61,7.699 1.63,-17.5"
           style="fill:#e22224;fill-opacity:1;fill-rule:nonzero;stroke:none"
           id="path62" />
        <path
           d="m 1645.49,559.648 -21.53,-4.769 16.43,-74.277 21.53,4.75 c 22.94,5.078 34.52,23.847 29.75,45.378 -4.77,21.551 -23.23,34 -46.18,28.918 z m 20.3,-91.777 -40.73,-9.012 -24.17,109.262 40.73,9.008 c 34.34,7.601 63.28,-10.719 70.12,-41.629 6.83,-30.898 -11.61,-60.031 -45.95,-67.629"
           style="fill:#e22224;fill-opacity:1;fill-rule:nonzero;stroke:none"
           id="path64" />
        <path
           d="m 1776.44,536.32 c -7.75,-2.75 -16.42,1.321 -19.18,9.16 -2.78,7.829 1.41,16.442 9.16,19.18 7.84,2.77 16.51,-1.289 19.27,-9.129 2.78,-7.832 -1.41,-16.441 -9.25,-19.211"
           style="fill:#e22224;fill-opacity:1;fill-rule:nonzero;stroke:none"
           id="path66" />
        <path
           d="m 1903.78,549.559 c -29.26,-14.399 -62.3,-2.34 -76.56,26.632 -14.13,28.68 -4.28,62.59 26.13,77.571 18.5,9.109 32.86,8.168 46.99,3.718 l -4.9,-18.628 c -11.7,3.5 -22.78,4.277 -34.26,-1.372 -19.22,-9.468 -25.35,-32.101 -15.6,-51.89 9.74,-19.789 31.57,-29 50.79,-19.539 12.33,6.078 17.75,14.988 22.4,27.258 l 16.98,-5.899 c -5.1,-16.051 -13.18,-28.59 -31.97,-37.851"
           style="fill:#e22224;fill-opacity:1;fill-rule:nonzero;stroke:none"
           id="path68" />
        <path
           d="m 1986.35,710.801 -52.98,-34.629 15.91,-24.34 46.96,30.68 9.62,-14.711 -46.96,-30.692 16.44,-25.16 53.65,35.071 9.61,-14.719 -70.1,-45.821 -61.21,93.661 69.44,45.379 9.62,-14.719"
           style="fill:#e22224;fill-opacity:1;fill-rule:nonzero;stroke:none"
           id="path70" />
      </g>
    </g>
  </g>
</svg>
