<svg width="26" height="22" viewBox="0 0 26 22" fill="none" xmlns="http://www.w3.org/2000/svg">
<path d="M21.6941 10.2323C21.4898 10.7237 21.4898 11.2763 21.6941 11.7677L24.7245 19.0577C25.272 20.3749 24.3042 21.8254 22.8777 21.8254L3.40436 21.8254C1.9695 21.8254 1.00145 20.3592 1.56519 19.0397L4.66429 11.7859C4.87872 11.284 4.87872 10.7163 4.66429 10.2144L1.56519 2.96058C1.00146 1.64109 1.9695 0.174805 3.40437 0.174805L22.8777 0.174805C24.3041 0.174805 25.272 1.62534 24.7245 2.94251L21.6941 10.2323Z" fill="#0BAA70"/>
<path d="M12.0264 11.0605C12.0264 12.0436 11.8229 12.7956 11.416 13.3164C11.0091 13.8372 10.4134 14.0977 9.62891 14.0977C8.85417 14.0977 8.26172 13.8421 7.85156 13.3311C7.44141 12.82 7.23145 12.0876 7.22168 11.1338V9.8252C7.22168 8.83236 7.42676 8.07878 7.83691 7.56445C8.25033 7.05013 8.8444 6.79297 9.61914 6.79297C10.3939 6.79297 10.9863 7.0485 11.3965 7.55957C11.8066 8.06738 12.0166 8.79818 12.0264 9.75195V11.0605ZM10.6152 9.625C10.6152 9.03581 10.5339 8.60775 10.3711 8.34082C10.2116 8.07064 9.96094 7.93555 9.61914 7.93555C9.28711 7.93555 9.04134 8.06413 8.88184 8.32129C8.72559 8.5752 8.64258 8.97396 8.63281 9.51758V11.2461C8.63281 11.8255 8.71094 12.2568 8.86719 12.54C9.02669 12.82 9.2806 12.96 9.62891 12.96C9.97396 12.96 10.223 12.8249 10.376 12.5547C10.529 12.2845 10.6087 11.8711 10.6152 11.3145V9.625ZM19.2686 11.0605C19.2686 12.0436 19.0651 12.7956 18.6582 13.3164C18.2513 13.8372 17.6556 14.0977 16.8711 14.0977C16.0964 14.0977 15.5039 13.8421 15.0938 13.3311C14.6836 12.82 14.4736 12.0876 14.4639 11.1338V9.8252C14.4639 8.83236 14.6689 8.07878 15.0791 7.56445C15.4925 7.05013 16.0866 6.79297 16.8613 6.79297C17.6361 6.79297 18.2285 7.0485 18.6387 7.55957C19.0488 8.06738 19.2588 8.79818 19.2686 9.75195V11.0605ZM17.8574 9.625C17.8574 9.03581 17.776 8.60775 17.6133 8.34082C17.4538 8.07064 17.2031 7.93555 16.8613 7.93555C16.5293 7.93555 16.2835 8.06413 16.124 8.32129C15.9678 8.5752 15.8848 8.97396 15.875 9.51758V11.2461C15.875 11.8255 15.9531 12.2568 16.1094 12.54C16.2689 12.82 16.5228 12.96 16.8711 12.96C17.2161 12.96 17.4652 12.8249 17.6182 12.5547C17.7712 12.2845 17.8509 11.8711 17.8574 11.3145V9.625Z" fill="white"/>
</svg>
