{
  "metadata": {
    "toolPackage": "@microsoft/api-extractor",
    "toolVersion": "7.24.1",
    "schemaVersion": 1005,
    "oldestForwardsCompatibleVersion": 1001,
    "tsdocConfig": {
      "$schema": "https://developer.microsoft.com/json-schemas/tsdoc/v0/tsdoc.schema.json",
      "noStandardTags": true,
      "tagDefinitions": [
        {
          "tagName": "@alpha",
          "syntaxKind": "modifier"
        },
        {
          "tagName": "@beta",
          "syntaxKind": "modifier"
        },
        {
          "tagName": "@defaultValue",
          "syntaxKind": "block"
        },
        {
          "tagName": "@decorator",
          "syntaxKind": "block",
          "allowMultiple": true
        },
        {
          "tagName": "@deprecated",
          "syntaxKind": "block"
        },
        {
          "tagName": "@eventProperty",
          "syntaxKind": "modifier"
        },
        {
          "tagName": "@example",
          "syntaxKind": "block",
          "allowMultiple": true
        },
        {
          "tagName": "@experimental",
          "syntaxKind": "modifier"
        },
        {
          "tagName": "@inheritDoc",
          "syntaxKind": "inline"
        },
        {
          "tagName": "@internal",
          "syntaxKind": "modifier"
        },
        {
          "tagName": "@label",
          "syntaxKind": "inline"
        },
        {
          "tagName": "@link",
          "syntaxKind": "inline",
          "allowMultiple": true
        },
        {
          "tagName": "@override",
          "syntaxKind": "modifier"
        },
        {
          "tagName": "@packageDocumentation",
          "syntaxKind": "modifier"
        },
        {
          "tagName": "@param",
          "syntaxKind": "block",
          "allowMultiple": true
        },
        {
          "tagName": "@privateRemarks",
          "syntaxKind": "block"
        },
        {
          "tagName": "@public",
          "syntaxKind": "modifier"
        },
        {
          "tagName": "@readonly",
          "syntaxKind": "modifier"
        },
        {
          "tagName": "@remarks",
          "syntaxKind": "block"
        },
        {
          "tagName": "@returns",
          "syntaxKind": "block"
        },
        {
          "tagName": "@sealed",
          "syntaxKind": "modifier"
        },
        {
          "tagName": "@see",
          "syntaxKind": "block"
        },
        {
          "tagName": "@throws",
          "syntaxKind": "block",
          "allowMultiple": true
        },
        {
          "tagName": "@typeParam",
          "syntaxKind": "block",
          "allowMultiple": true
        },
        {
          "tagName": "@virtual",
          "syntaxKind": "modifier"
        },
        {
          "tagName": "@betaDocumentation",
          "syntaxKind": "modifier"
        },
        {
          "tagName": "@internalRemarks",
          "syntaxKind": "block"
        },
        {
          "tagName": "@preapproved",
          "syntaxKind": "modifier"
        }
      ],
      "supportForTags": {
        "@alpha": true,
        "@beta": true,
        "@defaultValue": true,
        "@decorator": true,
        "@deprecated": true,
        "@eventProperty": true,
        "@example": true,
        "@experimental": true,
        "@inheritDoc": true,
        "@internal": true,
        "@label": true,
        "@link": true,
        "@override": true,
        "@packageDocumentation": true,
        "@param": true,
        "@privateRemarks": true,
        "@public": true,
        "@readonly": true,
        "@remarks": true,
        "@returns": true,
        "@sealed": true,
        "@see": true,
        "@throws": true,
        "@typeParam": true,
        "@virtual": true,
        "@betaDocumentation": true,
        "@internalRemarks": true,
        "@preapproved": true
      },
      "reportUnsupportedHtmlElements": false
    }
  },
  "kind": "Package",
  "canonicalReference": "@x82-softworks/aws-api!",
  "docComment": "",
  "name": "@x82-softworks/aws-api",
  "members": [
    {
      "kind": "EntryPoint",
      "canonicalReference": "@x82-softworks/aws-api!",
      "name": "",
      "members": [
        {
          "kind": "Class",
          "canonicalReference": "@x82-softworks/aws-api!API:class",
          "docComment": "",
          "excerptTokens": [
            {
              "kind": "Content",
              "text": "declare class API "
            }
          ],
          "releaseTag": "Public",
          "name": "API",
          "members": [
            {
              "kind": "Property",
              "canonicalReference": "@x82-softworks/aws-api!API#_suppressValidationErrors:member",
              "docComment": "",
              "excerptTokens": [
                {
                  "kind": "Content",
                  "text": "_suppressValidationErrors: "
                },
                {
                  "kind": "Content",
                  "text": "boolean"
                },
                {
                  "kind": "Content",
                  "text": ";"
                }
              ],
              "isOptional": false,
              "releaseTag": "Public",
              "name": "_suppressValidationErrors",
              "propertyTypeTokenRange": {
                "startIndex": 1,
                "endIndex": 2
              },
              "isStatic": false
            },
            {
              "kind": "Constructor",
              "canonicalReference": "@x82-softworks/aws-api!API:constructor(1)",
              "docComment": "/**\n * Constructs a new instance of the `API` class\n */\n",
              "excerptTokens": [
                {
                  "kind": "Content",
                  "text": "constructor(opts: "
                },
                {
                  "kind": "Reference",
                  "text": "RootDefinitionOverride",
                  "canonicalReference": "@x82-softworks/aws-api!RootDefinitionOverride:interface"
                },
                {
                  "kind": "Content",
                  "text": ", devMode: "
                },
                {
                  "kind": "Content",
                  "text": "boolean"
                },
                {
                  "kind": "Content",
                  "text": ");"
                }
              ],
              "releaseTag": "Public",
              "overloadIndex": 1,
              "parameters": [
                {
                  "parameterName": "opts",
                  "parameterTypeTokenRange": {
                    "startIndex": 1,
                    "endIndex": 2
                  },
                  "isOptional": false
                },
                {
                  "parameterName": "devMode",
                  "parameterTypeTokenRange": {
                    "startIndex": 3,
                    "endIndex": 4
                  },
                  "isOptional": false
                }
              ]
            },
            {
              "kind": "Method",
              "canonicalReference": "@x82-softworks/aws-api!API#cors:member(1)",
              "docComment": "/**\n * Define the Cors function\n */\n",
              "excerptTokens": [
                {
                  "kind": "Content",
                  "text": "cors(configFunc: "
                },
                {
                  "kind": "Reference",
                  "text": "Function",
                  "canonicalReference": "!Function:interface"
                },
                {
                  "kind": "Content",
                  "text": "): "
                },
                {
                  "kind": "Content",
                  "text": "void"
                },
                {
                  "kind": "Content",
                  "text": ";"
                }
              ],
              "isOptional": false,
              "isStatic": false,
              "returnTypeTokenRange": {
                "startIndex": 3,
                "endIndex": 4
              },
              "releaseTag": "Public",
              "overloadIndex": 1,
              "parameters": [
                {
                  "parameterName": "configFunc",
                  "parameterTypeTokenRange": {
                    "startIndex": 1,
                    "endIndex": 2
                  },
                  "isOptional": false
                }
              ],
              "name": "cors"
            },
            {
              "kind": "Property",
              "canonicalReference": "@x82-softworks/aws-api!API#corsConfig:member",
              "docComment": "",
              "excerptTokens": [
                {
                  "kind": "Content",
                  "text": "corsConfig: "
                },
                {
                  "kind": "Reference",
                  "text": "Function",
                  "canonicalReference": "!Function:interface"
                },
                {
                  "kind": "Content",
                  "text": ";"
                }
              ],
              "isOptional": false,
              "releaseTag": "Public",
              "name": "corsConfig",
              "propertyTypeTokenRange": {
                "startIndex": 1,
                "endIndex": 2
              },
              "isStatic": false
            },
            {
              "kind": "Method",
              "canonicalReference": "@x82-softworks/aws-api!API#defCallback:member(1)",
              "docComment": "",
              "excerptTokens": [
                {
                  "kind": "Content",
                  "text": "defCallback(name: "
                },
                {
                  "kind": "Content",
                  "text": "any"
                },
                {
                  "kind": "Content",
                  "text": ", props: "
                },
                {
                  "kind": "Content",
                  "text": "any"
                },
                {
                  "kind": "Content",
                  "text": "): "
                },
                {
                  "kind": "Reference",
                  "text": "API",
                  "canonicalReference": "@x82-softworks/aws-api!~API:class"
                },
                {
                  "kind": "Content",
                  "text": ";"
                }
              ],
              "isOptional": false,
              "isStatic": false,
              "returnTypeTokenRange": {
                "startIndex": 5,
                "endIndex": 6
              },
              "releaseTag": "Public",
              "overloadIndex": 1,
              "parameters": [
                {
                  "parameterName": "name",
                  "parameterTypeTokenRange": {
                    "startIndex": 1,
                    "endIndex": 2
                  },
                  "isOptional": false
                },
                {
                  "parameterName": "props",
                  "parameterTypeTokenRange": {
                    "startIndex": 3,
                    "endIndex": 4
                  },
                  "isOptional": false
                }
              ],
              "name": "defCallback"
            },
            {
              "kind": "Method",
              "canonicalReference": "@x82-softworks/aws-api!API#defComponent:member(1)",
              "docComment": "",
              "excerptTokens": [
                {
                  "kind": "Content",
                  "text": "defComponent(type: "
                },
                {
                  "kind": "Content",
                  "text": "any"
                },
                {
                  "kind": "Content",
                  "text": ", name: "
                },
                {
                  "kind": "Content",
                  "text": "any"
                },
                {
                  "kind": "Content",
                  "text": ", val: "
                },
                {
                  "kind": "Content",
                  "text": "any"
                },
                {
                  "kind": "Content",
                  "text": "): "
                },
                {
                  "kind": "Reference",
                  "text": "API",
                  "canonicalReference": "@x82-softworks/aws-api!~API:class"
                },
                {
                  "kind": "Content",
                  "text": ";"
                }
              ],
              "isOptional": false,
              "isStatic": false,
              "returnTypeTokenRange": {
                "startIndex": 7,
                "endIndex": 8
              },
              "releaseTag": "Public",
              "overloadIndex": 1,
              "parameters": [
                {
                  "parameterName": "type",
                  "parameterTypeTokenRange": {
                    "startIndex": 1,
                    "endIndex": 2
                  },
                  "isOptional": false
                },
                {
                  "parameterName": "name",
                  "parameterTypeTokenRange": {
                    "startIndex": 3,
                    "endIndex": 4
                  },
                  "isOptional": false
                },
                {
                  "parameterName": "val",
                  "parameterTypeTokenRange": {
                    "startIndex": 5,
                    "endIndex": 6
                  },
                  "isOptional": false
                }
              ],
              "name": "defComponent"
            },
            {
              "kind": "Method",
              "canonicalReference": "@x82-softworks/aws-api!API#defExample:member(1)",
              "docComment": "",
              "excerptTokens": [
                {
                  "kind": "Content",
                  "text": "defExample(name: "
                },
                {
                  "kind": "Content",
                  "text": "any"
                },
                {
                  "kind": "Content",
                  "text": ", props: "
                },
                {
                  "kind": "Content",
                  "text": "any"
                },
                {
                  "kind": "Content",
                  "text": "): "
                },
                {
                  "kind": "Reference",
                  "text": "API",
                  "canonicalReference": "@x82-softworks/aws-api!~API:class"
                },
                {
                  "kind": "Content",
                  "text": ";"
                }
              ],
              "isOptional": false,
              "isStatic": false,
              "returnTypeTokenRange": {
                "startIndex": 5,
                "endIndex": 6
              },
              "releaseTag": "Public",
              "overloadIndex": 1,
              "parameters": [
                {
                  "parameterName": "name",
                  "parameterTypeTokenRange": {
                    "startIndex": 1,
                    "endIndex": 2
                  },
                  "isOptional": false
                },
                {
                  "parameterName": "props",
                  "parameterTypeTokenRange": {
                    "startIndex": 3,
                    "endIndex": 4
                  },
                  "isOptional": false
                }
              ],
              "name": "defExample"
            },
            {
              "kind": "Method",
              "canonicalReference": "@x82-softworks/aws-api!API#defHeader:member(1)",
              "docComment": "",
              "excerptTokens": [
                {
                  "kind": "Content",
                  "text": "defHeader(name: "
                },
                {
                  "kind": "Content",
                  "text": "any"
                },
                {
                  "kind": "Content",
                  "text": ", props: "
                },
                {
                  "kind": "Content",
                  "text": "any"
                },
                {
                  "kind": "Content",
                  "text": "): "
                },
                {
                  "kind": "Reference",
                  "text": "API",
                  "canonicalReference": "@x82-softworks/aws-api!~API:class"
                },
                {
                  "kind": "Content",
                  "text": ";"
                }
              ],
              "isOptional": false,
              "isStatic": false,
              "returnTypeTokenRange": {
                "startIndex": 5,
                "endIndex": 6
              },
              "releaseTag": "Public",
              "overloadIndex": 1,
              "parameters": [
                {
                  "parameterName": "name",
                  "parameterTypeTokenRange": {
                    "startIndex": 1,
                    "endIndex": 2
                  },
                  "isOptional": false
                },
                {
                  "parameterName": "props",
                  "parameterTypeTokenRange": {
                    "startIndex": 3,
                    "endIndex": 4
                  },
                  "isOptional": false
                }
              ],
              "name": "defHeader"
            },
            {
              "kind": "Method",
              "canonicalReference": "@x82-softworks/aws-api!API#defLink:member(1)",
              "docComment": "",
              "excerptTokens": [
                {
                  "kind": "Content",
                  "text": "defLink(name: "
                },
                {
                  "kind": "Content",
                  "text": "any"
                },
                {
                  "kind": "Content",
                  "text": ", props: "
                },
                {
                  "kind": "Content",
                  "text": "any"
                },
                {
                  "kind": "Content",
                  "text": "): "
                },
                {
                  "kind": "Reference",
                  "text": "API",
                  "canonicalReference": "@x82-softworks/aws-api!~API:class"
                },
                {
                  "kind": "Content",
                  "text": ";"
                }
              ],
              "isOptional": false,
              "isStatic": false,
              "returnTypeTokenRange": {
                "startIndex": 5,
                "endIndex": 6
              },
              "releaseTag": "Public",
              "overloadIndex": 1,
              "parameters": [
                {
                  "parameterName": "name",
                  "parameterTypeTokenRange": {
                    "startIndex": 1,
                    "endIndex": 2
                  },
                  "isOptional": false
                },
                {
                  "parameterName": "props",
                  "parameterTypeTokenRange": {
                    "startIndex": 3,
                    "endIndex": 4
                  },
                  "isOptional": false
                }
              ],
              "name": "defLink"
            },
            {
              "kind": "Method",
              "canonicalReference": "@x82-softworks/aws-api!API#defParameter:member(1)",
              "docComment": "",
              "excerptTokens": [
                {
                  "kind": "Content",
                  "text": "defParameter(name: "
                },
                {
                  "kind": "Content",
                  "text": "any"
                },
                {
                  "kind": "Content",
                  "text": ", props: "
                },
                {
                  "kind": "Content",
                  "text": "any"
                },
                {
                  "kind": "Content",
                  "text": "): "
                },
                {
                  "kind": "Reference",
                  "text": "API",
                  "canonicalReference": "@x82-softworks/aws-api!~API:class"
                },
                {
                  "kind": "Content",
                  "text": ";"
                }
              ],
              "isOptional": false,
              "isStatic": false,
              "returnTypeTokenRange": {
                "startIndex": 5,
                "endIndex": 6
              },
              "releaseTag": "Public",
              "overloadIndex": 1,
              "parameters": [
                {
                  "parameterName": "name",
                  "parameterTypeTokenRange": {
                    "startIndex": 1,
                    "endIndex": 2
                  },
                  "isOptional": false
                },
                {
                  "parameterName": "props",
                  "parameterTypeTokenRange": {
                    "startIndex": 3,
                    "endIndex": 4
                  },
                  "isOptional": false
                }
              ],
              "name": "defParameter"
            },
            {
              "kind": "Method",
              "canonicalReference": "@x82-softworks/aws-api!API#defRequestBody:member(1)",
              "docComment": "",
              "excerptTokens": [
                {
                  "kind": "Content",
                  "text": "defRequestBody(name: "
                },
                {
                  "kind": "Content",
                  "text": "any"
                },
                {
                  "kind": "Content",
                  "text": ", props: "
                },
                {
                  "kind": "Content",
                  "text": "any"
                },
                {
                  "kind": "Content",
                  "text": "): "
                },
                {
                  "kind": "Reference",
                  "text": "API",
                  "canonicalReference": "@x82-softworks/aws-api!~API:class"
                },
                {
                  "kind": "Content",
                  "text": ";"
                }
              ],
              "isOptional": false,
              "isStatic": false,
              "returnTypeTokenRange": {
                "startIndex": 5,
                "endIndex": 6
              },
              "releaseTag": "Public",
              "overloadIndex": 1,
              "parameters": [
                {
                  "parameterName": "name",
                  "parameterTypeTokenRange": {
                    "startIndex": 1,
                    "endIndex": 2
                  },
                  "isOptional": false
                },
                {
                  "parameterName": "props",
                  "parameterTypeTokenRange": {
                    "startIndex": 3,
                    "endIndex": 4
                  },
                  "isOptional": false
                }
              ],
              "name": "defRequestBody"
            },
            {
              "kind": "Method",
              "canonicalReference": "@x82-softworks/aws-api!API#defResponse:member(1)",
              "docComment": "",
              "excerptTokens": [
                {
                  "kind": "Content",
                  "text": "defResponse(name: "
                },
                {
                  "kind": "Content",
                  "text": "any"
                },
                {
                  "kind": "Content",
                  "text": ", props: "
                },
                {
                  "kind": "Content",
                  "text": "any"
                },
                {
                  "kind": "Content",
                  "text": "): "
                },
                {
                  "kind": "Reference",
                  "text": "API",
                  "canonicalReference": "@x82-softworks/aws-api!~API:class"
                },
                {
                  "kind": "Content",
                  "text": ";"
                }
              ],
              "isOptional": false,
              "isStatic": false,
              "returnTypeTokenRange": {
                "startIndex": 5,
                "endIndex": 6
              },
              "releaseTag": "Public",
              "overloadIndex": 1,
              "parameters": [
                {
                  "parameterName": "name",
                  "parameterTypeTokenRange": {
                    "startIndex": 1,
                    "endIndex": 2
                  },
                  "isOptional": false
                },
                {
                  "parameterName": "props",
                  "parameterTypeTokenRange": {
                    "startIndex": 3,
                    "endIndex": 4
                  },
                  "isOptional": false
                }
              ],
              "name": "defResponse"
            },
            {
              "kind": "Method",
              "canonicalReference": "@x82-softworks/aws-api!API#defRoot:member(1)",
              "docComment": "",
              "excerptTokens": [
                {
                  "kind": "Content",
                  "text": "defRoot(def: "
                },
                {
                  "kind": "Content",
                  "text": "object"
                },
                {
                  "kind": "Content",
                  "text": "): "
                },
                {
                  "kind": "Content",
                  "text": "void"
                },
                {
                  "kind": "Content",
                  "text": ";"
                }
              ],
              "isOptional": false,
              "isStatic": false,
              "returnTypeTokenRange": {
                "startIndex": 3,
                "endIndex": 4
              },
              "releaseTag": "Public",
              "overloadIndex": 1,
              "parameters": [
                {
                  "parameterName": "def",
                  "parameterTypeTokenRange": {
                    "startIndex": 1,
                    "endIndex": 2
                  },
                  "isOptional": false
                }
              ],
              "name": "defRoot"
            },
            {
              "kind": "Method",
              "canonicalReference": "@x82-softworks/aws-api!API#defSchema:member(1)",
              "docComment": "",
              "excerptTokens": [
                {
                  "kind": "Content",
                  "text": "defSchema(name: "
                },
                {
                  "kind": "Content",
                  "text": "any"
                },
                {
                  "kind": "Content",
                  "text": ", props: "
                },
                {
                  "kind": "Content",
                  "text": "any"
                },
                {
                  "kind": "Content",
                  "text": "): "
                },
                {
                  "kind": "Reference",
                  "text": "API",
                  "canonicalReference": "@x82-softworks/aws-api!~API:class"
                },
                {
                  "kind": "Content",
                  "text": ";"
                }
              ],
              "isOptional": false,
              "isStatic": false,
              "returnTypeTokenRange": {
                "startIndex": 5,
                "endIndex": 6
              },
              "releaseTag": "Public",
              "overloadIndex": 1,
              "parameters": [
                {
                  "parameterName": "name",
                  "parameterTypeTokenRange": {
                    "startIndex": 1,
                    "endIndex": 2
                  },
                  "isOptional": false
                },
                {
                  "parameterName": "props",
                  "parameterTypeTokenRange": {
                    "startIndex": 3,
                    "endIndex": 4
                  },
                  "isOptional": false
                }
              ],
              "name": "defSchema"
            },
            {
              "kind": "Method",
              "canonicalReference": "@x82-softworks/aws-api!API#defSecurity:member(1)",
              "docComment": "",
              "excerptTokens": [
                {
                  "kind": "Content",
                  "text": "defSecurity(name: "
                },
                {
                  "kind": "Content",
                  "text": "any"
                },
                {
                  "kind": "Content",
                  "text": ", props: "
                },
                {
                  "kind": "Content",
                  "text": "any"
                },
                {
                  "kind": "Content",
                  "text": "): "
                },
                {
                  "kind": "Reference",
                  "text": "API",
                  "canonicalReference": "@x82-softworks/aws-api!~API:class"
                },
                {
                  "kind": "Content",
                  "text": ";"
                }
              ],
              "isOptional": false,
              "isStatic": false,
              "returnTypeTokenRange": {
                "startIndex": 5,
                "endIndex": 6
              },
              "releaseTag": "Public",
              "overloadIndex": 1,
              "parameters": [
                {
                  "parameterName": "name",
                  "parameterTypeTokenRange": {
                    "startIndex": 1,
                    "endIndex": 2
                  },
                  "isOptional": false
                },
                {
                  "parameterName": "props",
                  "parameterTypeTokenRange": {
                    "startIndex": 3,
                    "endIndex": 4
                  },
                  "isOptional": false
                }
              ],
              "name": "defSecurity"
            },
            {
              "kind": "Method",
              "canonicalReference": "@x82-softworks/aws-api!API#delete:member(1)",
              "docComment": "/**\n * Adds a DELETE route\n *\n * @param path - \n *\n * @param def - \n *\n * @param handler - \n *\n * @public\n */\n",
              "excerptTokens": [
                {
                  "kind": "Content",
                  "text": "delete(path: "
                },
                {
                  "kind": "Content",
                  "text": "string"
                },
                {
                  "kind": "Content",
                  "text": ", def: "
                },
                {
                  "kind": "Content",
                  "text": "any"
                },
                {
                  "kind": "Content",
                  "text": ", handler: "
                },
                {
                  "kind": "Reference",
                  "text": "Handler",
                  "canonicalReference": "@x82-softworks/aws-api!Handler:type"
                },
                {
                  "kind": "Content",
                  "text": "): "
                },
                {
                  "kind": "Reference",
                  "text": "API",
                  "canonicalReference": "@x82-softworks/aws-api!~API:class"
                },
                {
                  "kind": "Content",
                  "text": ";"
                }
              ],
              "isOptional": false,
              "isStatic": false,
              "returnTypeTokenRange": {
                "startIndex": 7,
                "endIndex": 8
              },
              "releaseTag": "Public",
              "overloadIndex": 1,
              "parameters": [
                {
                  "parameterName": "path",
                  "parameterTypeTokenRange": {
                    "startIndex": 1,
                    "endIndex": 2
                  },
                  "isOptional": false
                },
                {
                  "parameterName": "def",
                  "parameterTypeTokenRange": {
                    "startIndex": 3,
                    "endIndex": 4
                  },
                  "isOptional": false
                },
                {
                  "parameterName": "handler",
                  "parameterTypeTokenRange": {
                    "startIndex": 5,
                    "endIndex": 6
                  },
                  "isOptional": false
                }
              ],
              "name": "delete"
            },
            {
              "kind": "Property",
              "canonicalReference": "@x82-softworks/aws-api!API#devMode:member",
              "docComment": "",
              "excerptTokens": [
                {
                  "kind": "Content",
                  "text": "devMode: "
                },
                {
                  "kind": "Content",
                  "text": "boolean"
                },
                {
                  "kind": "Content",
                  "text": ";"
                }
              ],
              "isOptional": false,
              "releaseTag": "Public",
              "name": "devMode",
              "propertyTypeTokenRange": {
                "startIndex": 1,
                "endIndex": 2
              },
              "isStatic": false
            },
            {
              "kind": "Method",
              "canonicalReference": "@x82-softworks/aws-api!API#dispatch:member(1)",
              "docComment": "/**\n * @param event - ]\n *\n * @public\n */\n",
              "excerptTokens": [
                {
                  "kind": "Content",
                  "text": "dispatch(event: "
                },
                {
                  "kind": "Content",
                  "text": "object"
                },
                {
                  "kind": "Content",
                  "text": "): "
                },
                {
                  "kind": "Reference",
                  "text": "Promise",
                  "canonicalReference": "!Promise:interface"
                },
                {
                  "kind": "Content",
                  "text": "<"
                },
                {
                  "kind": "Reference",
                  "text": "Response",
                  "canonicalReference": "@x82-softworks/aws-api!Response:interface"
                },
                {
                  "kind": "Content",
                  "text": ">"
                },
                {
                  "kind": "Content",
                  "text": ";"
                }
              ],
              "isOptional": false,
              "isStatic": false,
              "returnTypeTokenRange": {
                "startIndex": 3,
                "endIndex": 7
              },
              "releaseTag": "Public",
              "overloadIndex": 1,
              "parameters": [
                {
                  "parameterName": "event",
                  "parameterTypeTokenRange": {
                    "startIndex": 1,
                    "endIndex": 2
                  },
                  "isOptional": false
                }
              ],
              "name": "dispatch"
            },
            {
              "kind": "Method",
              "canonicalReference": "@x82-softworks/aws-api!API#get:member(1)",
              "docComment": "/**\n * Adds a GET route\n *\n * @param path - \n *\n * @param def - \n *\n * @param handler - \n *\n * @public\n */\n",
              "excerptTokens": [
                {
                  "kind": "Content",
                  "text": "get(path: "
                },
                {
                  "kind": "Content",
                  "text": "string"
                },
                {
                  "kind": "Content",
                  "text": ", def: "
                },
                {
                  "kind": "Content",
                  "text": "any"
                },
                {
                  "kind": "Content",
                  "text": ", handler: "
                },
                {
                  "kind": "Reference",
                  "text": "Handler",
                  "canonicalReference": "@x82-softworks/aws-api!Handler:type"
                },
                {
                  "kind": "Content",
                  "text": "): "
                },
                {
                  "kind": "Reference",
                  "text": "API",
                  "canonicalReference": "@x82-softworks/aws-api!~API:class"
                },
                {
                  "kind": "Content",
                  "text": ";"
                }
              ],
              "isOptional": false,
              "isStatic": false,
              "returnTypeTokenRange": {
                "startIndex": 7,
                "endIndex": 8
              },
              "releaseTag": "Public",
              "overloadIndex": 1,
              "parameters": [
                {
                  "parameterName": "path",
                  "parameterTypeTokenRange": {
                    "startIndex": 1,
                    "endIndex": 2
                  },
                  "isOptional": false
                },
                {
                  "parameterName": "def",
                  "parameterTypeTokenRange": {
                    "startIndex": 3,
                    "endIndex": 4
                  },
                  "isOptional": false
                },
                {
                  "parameterName": "handler",
                  "parameterTypeTokenRange": {
                    "startIndex": 5,
                    "endIndex": 6
                  },
                  "isOptional": false
                }
              ],
              "name": "get"
            },
            {
              "kind": "Method",
              "canonicalReference": "@x82-softworks/aws-api!API#getHost:member(1)",
              "docComment": "",
              "excerptTokens": [
                {
                  "kind": "Content",
                  "text": "getHost(): "
                },
                {
                  "kind": "Content",
                  "text": "string"
                },
                {
                  "kind": "Content",
                  "text": ";"
                }
              ],
              "isOptional": false,
              "isStatic": false,
              "returnTypeTokenRange": {
                "startIndex": 1,
                "endIndex": 2
              },
              "releaseTag": "Public",
              "overloadIndex": 1,
              "parameters": [],
              "name": "getHost"
            },
            {
              "kind": "Method",
              "canonicalReference": "@x82-softworks/aws-api!API#getRef:member(1)",
              "docComment": "/**\n * Gets the value from the reference object\n *\n * @param refObj - \n *\n * @returns The referenced object\n *\n * @public\n */\n",
              "excerptTokens": [
                {
                  "kind": "Content",
                  "text": "getRef(refObj: "
                },
                {
                  "kind": "Reference",
                  "text": "Reference",
                  "canonicalReference": "@x82-softworks/aws-api!Reference:type"
                },
                {
                  "kind": "Content",
                  "text": "): "
                },
                {
                  "kind": "Content",
                  "text": "object"
                },
                {
                  "kind": "Content",
                  "text": ";"
                }
              ],
              "isOptional": false,
              "isStatic": false,
              "returnTypeTokenRange": {
                "startIndex": 3,
                "endIndex": 4
              },
              "releaseTag": "Public",
              "overloadIndex": 1,
              "parameters": [
                {
                  "parameterName": "refObj",
                  "parameterTypeTokenRange": {
                    "startIndex": 1,
                    "endIndex": 2
                  },
                  "isOptional": false
                }
              ],
              "name": "getRef"
            },
            {
              "kind": "Method",
              "canonicalReference": "@x82-softworks/aws-api!API#getRoot:member(1)",
              "docComment": "/**\n * @returns The Root API defintion\n *\n * @public\n */\n",
              "excerptTokens": [
                {
                  "kind": "Content",
                  "text": "getRoot(): "
                },
                {
                  "kind": "Content",
                  "text": "object"
                },
                {
                  "kind": "Content",
                  "text": ";"
                }
              ],
              "isOptional": false,
              "isStatic": false,
              "returnTypeTokenRange": {
                "startIndex": 1,
                "endIndex": 2
              },
              "releaseTag": "Public",
              "overloadIndex": 1,
              "parameters": [],
              "name": "getRoot"
            },
            {
              "kind": "Method",
              "canonicalReference": "@x82-softworks/aws-api!API#lambda:member(1)",
              "docComment": "",
              "excerptTokens": [
                {
                  "kind": "Content",
                  "text": "lambda(): "
                },
                {
                  "kind": "Content",
                  "text": "(event: any) => "
                },
                {
                  "kind": "Reference",
                  "text": "Promise",
                  "canonicalReference": "!Promise:interface"
                },
                {
                  "kind": "Content",
                  "text": "<"
                },
                {
                  "kind": "Reference",
                  "text": "Response",
                  "canonicalReference": "@x82-softworks/aws-api!Response:interface"
                },
                {
                  "kind": "Content",
                  "text": ">"
                },
                {
                  "kind": "Content",
                  "text": ";"
                }
              ],
              "isOptional": false,
              "isStatic": false,
              "returnTypeTokenRange": {
                "startIndex": 1,
                "endIndex": 6
              },
              "releaseTag": "Public",
              "overloadIndex": 1,
              "parameters": [],
              "name": "lambda"
            },
            {
              "kind": "Method",
              "canonicalReference": "@x82-softworks/aws-api!API#patch:member(1)",
              "docComment": "/**\n * Adds a PATCH route\n *\n * @param path - \n *\n * @param def - \n *\n * @param handler - \n *\n * @public\n */\n",
              "excerptTokens": [
                {
                  "kind": "Content",
                  "text": "patch(path: "
                },
                {
                  "kind": "Content",
                  "text": "string"
                },
                {
                  "kind": "Content",
                  "text": ", def: "
                },
                {
                  "kind": "Content",
                  "text": "any"
                },
                {
                  "kind": "Content",
                  "text": ", handler: "
                },
                {
                  "kind": "Reference",
                  "text": "Handler",
                  "canonicalReference": "@x82-softworks/aws-api!Handler:type"
                },
                {
                  "kind": "Content",
                  "text": "): "
                },
                {
                  "kind": "Reference",
                  "text": "API",
                  "canonicalReference": "@x82-softworks/aws-api!~API:class"
                },
                {
                  "kind": "Content",
                  "text": ";"
                }
              ],
              "isOptional": false,
              "isStatic": false,
              "returnTypeTokenRange": {
                "startIndex": 7,
                "endIndex": 8
              },
              "releaseTag": "Public",
              "overloadIndex": 1,
              "parameters": [
                {
                  "parameterName": "path",
                  "parameterTypeTokenRange": {
                    "startIndex": 1,
                    "endIndex": 2
                  },
                  "isOptional": false
                },
                {
                  "parameterName": "def",
                  "parameterTypeTokenRange": {
                    "startIndex": 3,
                    "endIndex": 4
                  },
                  "isOptional": false
                },
                {
                  "parameterName": "handler",
                  "parameterTypeTokenRange": {
                    "startIndex": 5,
                    "endIndex": 6
                  },
                  "isOptional": false
                }
              ],
              "name": "patch"
            },
            {
              "kind": "Method",
              "canonicalReference": "@x82-softworks/aws-api!API#path:member(1)",
              "docComment": "/**\n * Adds a route to the router\n *\n * @param path - \n *\n * @param method - \n *\n * @param def - \n *\n * @param handler - \n *\n * @public\n */\n",
              "excerptTokens": [
                {
                  "kind": "Content",
                  "text": "path(path: "
                },
                {
                  "kind": "Content",
                  "text": "string"
                },
                {
                  "kind": "Content",
                  "text": ", method: "
                },
                {
                  "kind": "Reference",
                  "text": "Method",
                  "canonicalReference": "@x82-softworks/aws-api!Method:enum"
                },
                {
                  "kind": "Content",
                  "text": ", def: "
                },
                {
                  "kind": "Content",
                  "text": "any"
                },
                {
                  "kind": "Content",
                  "text": ", handler: "
                },
                {
                  "kind": "Reference",
                  "text": "Handler",
                  "canonicalReference": "@x82-softworks/aws-api!Handler:type"
                },
                {
                  "kind": "Content",
                  "text": "): "
                },
                {
                  "kind": "Reference",
                  "text": "API",
                  "canonicalReference": "@x82-softworks/aws-api!~API:class"
                },
                {
                  "kind": "Content",
                  "text": ";"
                }
              ],
              "isOptional": false,
              "isStatic": false,
              "returnTypeTokenRange": {
                "startIndex": 9,
                "endIndex": 10
              },
              "releaseTag": "Public",
              "overloadIndex": 1,
              "parameters": [
                {
                  "parameterName": "path",
                  "parameterTypeTokenRange": {
                    "startIndex": 1,
                    "endIndex": 2
                  },
                  "isOptional": false
                },
                {
                  "parameterName": "method",
                  "parameterTypeTokenRange": {
                    "startIndex": 3,
                    "endIndex": 4
                  },
                  "isOptional": false
                },
                {
                  "parameterName": "def",
                  "parameterTypeTokenRange": {
                    "startIndex": 5,
                    "endIndex": 6
                  },
                  "isOptional": false
                },
                {
                  "parameterName": "handler",
                  "parameterTypeTokenRange": {
                    "startIndex": 7,
                    "endIndex": 8
                  },
                  "isOptional": false
                }
              ],
              "name": "path"
            },
            {
              "kind": "Method",
              "canonicalReference": "@x82-softworks/aws-api!API#post:member(1)",
              "docComment": "/**\n * Adds a POST route\n *\n * @param path - \n *\n * @param def - \n *\n * @param handler - \n *\n * @public\n */\n",
              "excerptTokens": [
                {
                  "kind": "Content",
                  "text": "post(path: "
                },
                {
                  "kind": "Content",
                  "text": "string"
                },
                {
                  "kind": "Content",
                  "text": ", def: "
                },
                {
                  "kind": "Content",
                  "text": "any"
                },
                {
                  "kind": "Content",
                  "text": ", handler: "
                },
                {
                  "kind": "Reference",
                  "text": "Handler",
                  "canonicalReference": "@x82-softworks/aws-api!Handler:type"
                },
                {
                  "kind": "Content",
                  "text": "): "
                },
                {
                  "kind": "Reference",
                  "text": "API",
                  "canonicalReference": "@x82-softworks/aws-api!~API:class"
                },
                {
                  "kind": "Content",
                  "text": ";"
                }
              ],
              "isOptional": false,
              "isStatic": false,
              "returnTypeTokenRange": {
                "startIndex": 7,
                "endIndex": 8
              },
              "releaseTag": "Public",
              "overloadIndex": 1,
              "parameters": [
                {
                  "parameterName": "path",
                  "parameterTypeTokenRange": {
                    "startIndex": 1,
                    "endIndex": 2
                  },
                  "isOptional": false
                },
                {
                  "parameterName": "def",
                  "parameterTypeTokenRange": {
                    "startIndex": 3,
                    "endIndex": 4
                  },
                  "isOptional": false
                },
                {
                  "parameterName": "handler",
                  "parameterTypeTokenRange": {
                    "startIndex": 5,
                    "endIndex": 6
                  },
                  "isOptional": false
                }
              ],
              "name": "post"
            },
            {
              "kind": "Method",
              "canonicalReference": "@x82-softworks/aws-api!API#put:member(1)",
              "docComment": "/**\n * Adds a PUT route\n *\n * @param path - \n *\n * @param def - \n *\n * @param handler - \n *\n * @public\n */\n",
              "excerptTokens": [
                {
                  "kind": "Content",
                  "text": "put(path: "
                },
                {
                  "kind": "Content",
                  "text": "string"
                },
                {
                  "kind": "Content",
                  "text": ", def: "
                },
                {
                  "kind": "Content",
                  "text": "any"
                },
                {
                  "kind": "Content",
                  "text": ", handler: "
                },
                {
                  "kind": "Reference",
                  "text": "Handler",
                  "canonicalReference": "@x82-softworks/aws-api!Handler:type"
                },
                {
                  "kind": "Content",
                  "text": "): "
                },
                {
                  "kind": "Reference",
                  "text": "API",
                  "canonicalReference": "@x82-softworks/aws-api!~API:class"
                },
                {
                  "kind": "Content",
                  "text": ";"
                }
              ],
              "isOptional": false,
              "isStatic": false,
              "returnTypeTokenRange": {
                "startIndex": 7,
                "endIndex": 8
              },
              "releaseTag": "Public",
              "overloadIndex": 1,
              "parameters": [
                {
                  "parameterName": "path",
                  "parameterTypeTokenRange": {
                    "startIndex": 1,
                    "endIndex": 2
                  },
                  "isOptional": false
                },
                {
                  "parameterName": "def",
                  "parameterTypeTokenRange": {
                    "startIndex": 3,
                    "endIndex": 4
                  },
                  "isOptional": false
                },
                {
                  "parameterName": "handler",
                  "parameterTypeTokenRange": {
                    "startIndex": 5,
                    "endIndex": 6
                  },
                  "isOptional": false
                }
              ],
              "name": "put"
            },
            {
              "kind": "Method",
              "canonicalReference": "@x82-softworks/aws-api!API#ref:member(1)",
              "docComment": "",
              "excerptTokens": [
                {
                  "kind": "Content",
                  "text": "ref(type: "
                },
                {
                  "kind": "Content",
                  "text": "string"
                },
                {
                  "kind": "Content",
                  "text": ", name: "
                },
                {
                  "kind": "Content",
                  "text": "string"
                },
                {
                  "kind": "Content",
                  "text": "): "
                },
                {
                  "kind": "Reference",
                  "text": "Reference",
                  "canonicalReference": "@x82-softworks/aws-api!Reference:type"
                },
                {
                  "kind": "Content",
                  "text": ";"
                }
              ],
              "isOptional": false,
              "isStatic": false,
              "returnTypeTokenRange": {
                "startIndex": 5,
                "endIndex": 6
              },
              "releaseTag": "Public",
              "overloadIndex": 1,
              "parameters": [
                {
                  "parameterName": "type",
                  "parameterTypeTokenRange": {
                    "startIndex": 1,
                    "endIndex": 2
                  },
                  "isOptional": false
                },
                {
                  "parameterName": "name",
                  "parameterTypeTokenRange": {
                    "startIndex": 3,
                    "endIndex": 4
                  },
                  "isOptional": false
                }
              ],
              "name": "ref"
            },
            {
              "kind": "Method",
              "canonicalReference": "@x82-softworks/aws-api!API#refCallback:member(1)",
              "docComment": "",
              "excerptTokens": [
                {
                  "kind": "Content",
                  "text": "refCallback(name: "
                },
                {
                  "kind": "Content",
                  "text": "string"
                },
                {
                  "kind": "Content",
                  "text": "): "
                },
                {
                  "kind": "Reference",
                  "text": "Reference",
                  "canonicalReference": "@x82-softworks/aws-api!Reference:type"
                },
                {
                  "kind": "Content",
                  "text": ";"
                }
              ],
              "isOptional": false,
              "isStatic": false,
              "returnTypeTokenRange": {
                "startIndex": 3,
                "endIndex": 4
              },
              "releaseTag": "Public",
              "overloadIndex": 1,
              "parameters": [
                {
                  "parameterName": "name",
                  "parameterTypeTokenRange": {
                    "startIndex": 1,
                    "endIndex": 2
                  },
                  "isOptional": false
                }
              ],
              "name": "refCallback"
            },
            {
              "kind": "Method",
              "canonicalReference": "@x82-softworks/aws-api!API#refExample:member(1)",
              "docComment": "",
              "excerptTokens": [
                {
                  "kind": "Content",
                  "text": "refExample(name: "
                },
                {
                  "kind": "Content",
                  "text": "string"
                },
                {
                  "kind": "Content",
                  "text": "): "
                },
                {
                  "kind": "Reference",
                  "text": "Reference",
                  "canonicalReference": "@x82-softworks/aws-api!Reference:type"
                },
                {
                  "kind": "Content",
                  "text": ";"
                }
              ],
              "isOptional": false,
              "isStatic": false,
              "returnTypeTokenRange": {
                "startIndex": 3,
                "endIndex": 4
              },
              "releaseTag": "Public",
              "overloadIndex": 1,
              "parameters": [
                {
                  "parameterName": "name",
                  "parameterTypeTokenRange": {
                    "startIndex": 1,
                    "endIndex": 2
                  },
                  "isOptional": false
                }
              ],
              "name": "refExample"
            },
            {
              "kind": "Method",
              "canonicalReference": "@x82-softworks/aws-api!API#refHeader:member(1)",
              "docComment": "",
              "excerptTokens": [
                {
                  "kind": "Content",
                  "text": "refHeader(name: "
                },
                {
                  "kind": "Content",
                  "text": "string"
                },
                {
                  "kind": "Content",
                  "text": "): "
                },
                {
                  "kind": "Reference",
                  "text": "Reference",
                  "canonicalReference": "@x82-softworks/aws-api!Reference:type"
                },
                {
                  "kind": "Content",
                  "text": ";"
                }
              ],
              "isOptional": false,
              "isStatic": false,
              "returnTypeTokenRange": {
                "startIndex": 3,
                "endIndex": 4
              },
              "releaseTag": "Public",
              "overloadIndex": 1,
              "parameters": [
                {
                  "parameterName": "name",
                  "parameterTypeTokenRange": {
                    "startIndex": 1,
                    "endIndex": 2
                  },
                  "isOptional": false
                }
              ],
              "name": "refHeader"
            },
            {
              "kind": "Method",
              "canonicalReference": "@x82-softworks/aws-api!API#refLink:member(1)",
              "docComment": "",
              "excerptTokens": [
                {
                  "kind": "Content",
                  "text": "refLink(name: "
                },
                {
                  "kind": "Content",
                  "text": "string"
                },
                {
                  "kind": "Content",
                  "text": "): "
                },
                {
                  "kind": "Reference",
                  "text": "Reference",
                  "canonicalReference": "@x82-softworks/aws-api!Reference:type"
                },
                {
                  "kind": "Content",
                  "text": ";"
                }
              ],
              "isOptional": false,
              "isStatic": false,
              "returnTypeTokenRange": {
                "startIndex": 3,
                "endIndex": 4
              },
              "releaseTag": "Public",
              "overloadIndex": 1,
              "parameters": [
                {
                  "parameterName": "name",
                  "parameterTypeTokenRange": {
                    "startIndex": 1,
                    "endIndex": 2
                  },
                  "isOptional": false
                }
              ],
              "name": "refLink"
            },
            {
              "kind": "Method",
              "canonicalReference": "@x82-softworks/aws-api!API#refParameter:member(1)",
              "docComment": "",
              "excerptTokens": [
                {
                  "kind": "Content",
                  "text": "refParameter(name: "
                },
                {
                  "kind": "Content",
                  "text": "string"
                },
                {
                  "kind": "Content",
                  "text": "): "
                },
                {
                  "kind": "Reference",
                  "text": "Reference",
                  "canonicalReference": "@x82-softworks/aws-api!Reference:type"
                },
                {
                  "kind": "Content",
                  "text": ";"
                }
              ],
              "isOptional": false,
              "isStatic": false,
              "returnTypeTokenRange": {
                "startIndex": 3,
                "endIndex": 4
              },
              "releaseTag": "Public",
              "overloadIndex": 1,
              "parameters": [
                {
                  "parameterName": "name",
                  "parameterTypeTokenRange": {
                    "startIndex": 1,
                    "endIndex": 2
                  },
                  "isOptional": false
                }
              ],
              "name": "refParameter"
            },
            {
              "kind": "Method",
              "canonicalReference": "@x82-softworks/aws-api!API#refRequestBody:member(1)",
              "docComment": "",
              "excerptTokens": [
                {
                  "kind": "Content",
                  "text": "refRequestBody(name: "
                },
                {
                  "kind": "Content",
                  "text": "string"
                },
                {
                  "kind": "Content",
                  "text": "): "
                },
                {
                  "kind": "Reference",
                  "text": "Reference",
                  "canonicalReference": "@x82-softworks/aws-api!Reference:type"
                },
                {
                  "kind": "Content",
                  "text": ";"
                }
              ],
              "isOptional": false,
              "isStatic": false,
              "returnTypeTokenRange": {
                "startIndex": 3,
                "endIndex": 4
              },
              "releaseTag": "Public",
              "overloadIndex": 1,
              "parameters": [
                {
                  "parameterName": "name",
                  "parameterTypeTokenRange": {
                    "startIndex": 1,
                    "endIndex": 2
                  },
                  "isOptional": false
                }
              ],
              "name": "refRequestBody"
            },
            {
              "kind": "Method",
              "canonicalReference": "@x82-softworks/aws-api!API#refResponse:member(1)",
              "docComment": "/**\n * Ref requests\n */\n",
              "excerptTokens": [
                {
                  "kind": "Content",
                  "text": "refResponse(name: "
                },
                {
                  "kind": "Content",
                  "text": "string"
                },
                {
                  "kind": "Content",
                  "text": "): "
                },
                {
                  "kind": "Reference",
                  "text": "Reference",
                  "canonicalReference": "@x82-softworks/aws-api!Reference:type"
                },
                {
                  "kind": "Content",
                  "text": ";"
                }
              ],
              "isOptional": false,
              "isStatic": false,
              "returnTypeTokenRange": {
                "startIndex": 3,
                "endIndex": 4
              },
              "releaseTag": "Public",
              "overloadIndex": 1,
              "parameters": [
                {
                  "parameterName": "name",
                  "parameterTypeTokenRange": {
                    "startIndex": 1,
                    "endIndex": 2
                  },
                  "isOptional": false
                }
              ],
              "name": "refResponse"
            },
            {
              "kind": "Method",
              "canonicalReference": "@x82-softworks/aws-api!API#refSchema:member(1)",
              "docComment": "",
              "excerptTokens": [
                {
                  "kind": "Content",
                  "text": "refSchema(name: "
                },
                {
                  "kind": "Content",
                  "text": "string"
                },
                {
                  "kind": "Content",
                  "text": "): "
                },
                {
                  "kind": "Reference",
                  "text": "Reference",
                  "canonicalReference": "@x82-softworks/aws-api!Reference:type"
                },
                {
                  "kind": "Content",
                  "text": ";"
                }
              ],
              "isOptional": false,
              "isStatic": false,
              "returnTypeTokenRange": {
                "startIndex": 3,
                "endIndex": 4
              },
              "releaseTag": "Public",
              "overloadIndex": 1,
              "parameters": [
                {
                  "parameterName": "name",
                  "parameterTypeTokenRange": {
                    "startIndex": 1,
                    "endIndex": 2
                  },
                  "isOptional": false
                }
              ],
              "name": "refSchema"
            },
            {
              "kind": "Method",
              "canonicalReference": "@x82-softworks/aws-api!API#refSecurity:member(1)",
              "docComment": "",
              "excerptTokens": [
                {
                  "kind": "Content",
                  "text": "refSecurity(name: "
                },
                {
                  "kind": "Content",
                  "text": "string"
                },
                {
                  "kind": "Content",
                  "text": "): "
                },
                {
                  "kind": "Reference",
                  "text": "Reference",
                  "canonicalReference": "@x82-softworks/aws-api!Reference:type"
                },
                {
                  "kind": "Content",
                  "text": ";"
                }
              ],
              "isOptional": false,
              "isStatic": false,
              "returnTypeTokenRange": {
                "startIndex": 3,
                "endIndex": 4
              },
              "releaseTag": "Public",
              "overloadIndex": 1,
              "parameters": [
                {
                  "parameterName": "name",
                  "parameterTypeTokenRange": {
                    "startIndex": 1,
                    "endIndex": 2
                  },
                  "isOptional": false
                }
              ],
              "name": "refSecurity"
            },
            {
              "kind": "Property",
              "canonicalReference": "@x82-softworks/aws-api!API#rootDef:member",
              "docComment": "",
              "excerptTokens": [
                {
                  "kind": "Content",
                  "text": "rootDef: "
                },
                {
                  "kind": "Reference",
                  "text": "RootDefinition",
                  "canonicalReference": "@x82-softworks/aws-api!RootDefinition:interface"
                },
                {
                  "kind": "Content",
                  "text": ";"
                }
              ],
              "isOptional": false,
              "releaseTag": "Public",
              "name": "rootDef",
              "propertyTypeTokenRange": {
                "startIndex": 1,
                "endIndex": 2
              },
              "isStatic": false
            },
            {
              "kind": "Method",
              "canonicalReference": "@x82-softworks/aws-api!API#suppressValidationErrors:member(1)",
              "docComment": "/**\n * Sets the validation error suppression\n *\n * @param val - \n */\n",
              "excerptTokens": [
                {
                  "kind": "Content",
                  "text": "suppressValidationErrors(val: "
                },
                {
                  "kind": "Content",
                  "text": "boolean"
                },
                {
                  "kind": "Content",
                  "text": "): "
                },
                {
                  "kind": "Content",
                  "text": "void"
                },
                {
                  "kind": "Content",
                  "text": ";"
                }
              ],
              "isOptional": false,
              "isStatic": false,
              "returnTypeTokenRange": {
                "startIndex": 3,
                "endIndex": 4
              },
              "releaseTag": "Public",
              "overloadIndex": 1,
              "parameters": [
                {
                  "parameterName": "val",
                  "parameterTypeTokenRange": {
                    "startIndex": 1,
                    "endIndex": 2
                  },
                  "isOptional": false
                }
              ],
              "name": "suppressValidationErrors"
            }
          ],
          "implementsTokenRanges": []
        },
        {
          "kind": "Variable",
          "canonicalReference": "@x82-softworks/aws-api!APIKEY:var",
          "docComment": "",
          "excerptTokens": [
            {
              "kind": "Content",
              "text": "APIKEY = \"apikey\""
            }
          ],
          "releaseTag": "Public",
          "name": "APIKEY",
          "variableTypeTokenRange": {
            "startIndex": 0,
            "endIndex": 0
          }
        },
        {
          "kind": "Variable",
          "canonicalReference": "@x82-softworks/aws-api!ARRAY:var",
          "docComment": "",
          "excerptTokens": [
            {
              "kind": "Content",
              "text": "ARRAY = \"array\""
            }
          ],
          "releaseTag": "Public",
          "name": "ARRAY",
          "variableTypeTokenRange": {
            "startIndex": 0,
            "endIndex": 0
          }
        },
        {
          "kind": "Variable",
          "canonicalReference": "@x82-softworks/aws-api!BINARY:var",
          "docComment": "",
          "excerptTokens": [
            {
              "kind": "Content",
              "text": "BINARY = \"binary\""
            }
          ],
          "releaseTag": "Public",
          "name": "BINARY",
          "variableTypeTokenRange": {
            "startIndex": 0,
            "endIndex": 0
          }
        },
        {
          "kind": "Variable",
          "canonicalReference": "@x82-softworks/aws-api!BOOLEAN:var",
          "docComment": "",
          "excerptTokens": [
            {
              "kind": "Content",
              "text": "BOOLEAN = \"boolean\""
            }
          ],
          "releaseTag": "Public",
          "name": "BOOLEAN",
          "variableTypeTokenRange": {
            "startIndex": 0,
            "endIndex": 0
          }
        },
        {
          "kind": "Variable",
          "canonicalReference": "@x82-softworks/aws-api!BYTE:var",
          "docComment": "",
          "excerptTokens": [
            {
              "kind": "Content",
              "text": "BYTE = \"byte\""
            }
          ],
          "releaseTag": "Public",
          "name": "BYTE",
          "variableTypeTokenRange": {
            "startIndex": 0,
            "endIndex": 0
          }
        },
        {
          "kind": "Variable",
          "canonicalReference": "@x82-softworks/aws-api!create:var",
          "docComment": "/**\n * Factory function to create an API\n *\n * @param init - \n *\n * @param debug - \n *\n * @returns The created api\n *\n * @public\n */\n",
          "excerptTokens": [
            {
              "kind": "Content",
              "text": "create: "
            },
            {
              "kind": "Content",
              "text": "(init: "
            },
            {
              "kind": "Reference",
              "text": "RootDefinitionOverride",
              "canonicalReference": "@x82-softworks/aws-api!RootDefinitionOverride:interface"
            },
            {
              "kind": "Content",
              "text": ", debug: boolean) => "
            },
            {
              "kind": "Reference",
              "text": "API",
              "canonicalReference": "@x82-softworks/aws-api!~API:class"
            }
          ],
          "releaseTag": "Public",
          "name": "create",
          "variableTypeTokenRange": {
            "startIndex": 1,
            "endIndex": 5
          }
        },
        {
          "kind": "Variable",
          "canonicalReference": "@x82-softworks/aws-api!DATE:var",
          "docComment": "",
          "excerptTokens": [
            {
              "kind": "Content",
              "text": "DATE = \"date\""
            }
          ],
          "releaseTag": "Public",
          "name": "DATE",
          "variableTypeTokenRange": {
            "startIndex": 0,
            "endIndex": 0
          }
        },
        {
          "kind": "Variable",
          "canonicalReference": "@x82-softworks/aws-api!DATETIME:var",
          "docComment": "",
          "excerptTokens": [
            {
              "kind": "Content",
              "text": "DATETIME = \"dateTime\""
            }
          ],
          "releaseTag": "Public",
          "name": "DATETIME",
          "variableTypeTokenRange": {
            "startIndex": 0,
            "endIndex": 0
          }
        },
        {
          "kind": "Variable",
          "canonicalReference": "@x82-softworks/aws-api!DEFAULT_CORS:var",
          "docComment": "",
          "excerptTokens": [
            {
              "kind": "Content",
              "text": "DEFAULT_CORS: "
            },
            {
              "kind": "Content",
              "text": "{\n    \"Access-Control-Allow-Methods\": string;\n    \"Access-Control-Allow-headers\": string;\n}"
            }
          ],
          "releaseTag": "Public",
          "name": "DEFAULT_CORS",
          "variableTypeTokenRange": {
            "startIndex": 1,
            "endIndex": 2
          }
        },
        {
          "kind": "Variable",
          "canonicalReference": "@x82-softworks/aws-api!DOUBLE:var",
          "docComment": "",
          "excerptTokens": [
            {
              "kind": "Content",
              "text": "DOUBLE = \"double\""
            }
          ],
          "releaseTag": "Public",
          "name": "DOUBLE",
          "variableTypeTokenRange": {
            "startIndex": 0,
            "endIndex": 0
          }
        },
        {
          "kind": "Variable",
          "canonicalReference": "@x82-softworks/aws-api!EMAIL:var",
          "docComment": "",
          "excerptTokens": [
            {
              "kind": "Content",
              "text": "EMAIL = \"email\""
            }
          ],
          "releaseTag": "Public",
          "name": "EMAIL",
          "variableTypeTokenRange": {
            "startIndex": 0,
            "endIndex": 0
          }
        },
        {
          "kind": "Variable",
          "canonicalReference": "@x82-softworks/aws-api!FLOAT:var",
          "docComment": "",
          "excerptTokens": [
            {
              "kind": "Content",
              "text": "FLOAT = \"float\""
            }
          ],
          "releaseTag": "Public",
          "name": "FLOAT",
          "variableTypeTokenRange": {
            "startIndex": 0,
            "endIndex": 0
          }
        },
        {
          "kind": "Variable",
          "canonicalReference": "@x82-softworks/aws-api!FORM_ENCODED:var",
          "docComment": "",
          "excerptTokens": [
            {
              "kind": "Content",
              "text": "FORM_ENCODED = \"application/x-www-form-urlencoded\""
            }
          ],
          "releaseTag": "Public",
          "name": "FORM_ENCODED",
          "variableTypeTokenRange": {
            "startIndex": 0,
            "endIndex": 0
          }
        },
        {
          "kind": "Variable",
          "canonicalReference": "@x82-softworks/aws-api!GENERIC_ERROR:var",
          "docComment": "",
          "excerptTokens": [
            {
              "kind": "Content",
              "text": "GENERIC_ERROR = \"GenericError\""
            }
          ],
          "releaseTag": "Public",
          "name": "GENERIC_ERROR",
          "variableTypeTokenRange": {
            "startIndex": 0,
            "endIndex": 0
          }
        },
        {
          "kind": "TypeAlias",
          "canonicalReference": "@x82-softworks/aws-api!Handler:type",
          "docComment": "",
          "excerptTokens": [
            {
              "kind": "Content",
              "text": "export declare type Handler = "
            },
            {
              "kind": "Content",
              "text": "(Request: any, Response: any, API: any) => void"
            },
            {
              "kind": "Content",
              "text": ";"
            }
          ],
          "releaseTag": "Public",
          "name": "Handler",
          "typeTokenRange": {
            "startIndex": 1,
            "endIndex": 2
          }
        },
        {
          "kind": "Variable",
          "canonicalReference": "@x82-softworks/aws-api!HEADER:var",
          "docComment": "",
          "excerptTokens": [
            {
              "kind": "Content",
              "text": "HEADER = \"header\""
            }
          ],
          "releaseTag": "Public",
          "name": "HEADER",
          "variableTypeTokenRange": {
            "startIndex": 0,
            "endIndex": 0
          }
        },
        {
          "kind": "Variable",
          "canonicalReference": "@x82-softworks/aws-api!INT32:var",
          "docComment": "",
          "excerptTokens": [
            {
              "kind": "Content",
              "text": "INT32 = \"int32\""
            }
          ],
          "releaseTag": "Public",
          "name": "INT32",
          "variableTypeTokenRange": {
            "startIndex": 0,
            "endIndex": 0
          }
        },
        {
          "kind": "Variable",
          "canonicalReference": "@x82-softworks/aws-api!INT64:var",
          "docComment": "",
          "excerptTokens": [
            {
              "kind": "Content",
              "text": "INT64 = \"int64\""
            }
          ],
          "releaseTag": "Public",
          "name": "INT64",
          "variableTypeTokenRange": {
            "startIndex": 0,
            "endIndex": 0
          }
        },
        {
          "kind": "Variable",
          "canonicalReference": "@x82-softworks/aws-api!INTEGER:var",
          "docComment": "",
          "excerptTokens": [
            {
              "kind": "Content",
              "text": "INTEGER = \"integer\""
            }
          ],
          "releaseTag": "Public",
          "name": "INTEGER",
          "variableTypeTokenRange": {
            "startIndex": 0,
            "endIndex": 0
          }
        },
        {
          "kind": "Variable",
          "canonicalReference": "@x82-softworks/aws-api!jsonResponseContent:var",
          "docComment": "/**\n * An easy shorhand to create a json response with the provided schema\n *\n * @param schema - \n *\n * @returns \n *\n * @public\n */\n",
          "excerptTokens": [
            {
              "kind": "Content",
              "text": "jsonResponseContent: "
            },
            {
              "kind": "Content",
              "text": "(schema: object) => object"
            }
          ],
          "releaseTag": "Public",
          "name": "jsonResponseContent",
          "variableTypeTokenRange": {
            "startIndex": 1,
            "endIndex": 2
          }
        },
        {
          "kind": "Variable",
          "canonicalReference": "@x82-softworks/aws-api!NUMBER:var",
          "docComment": "",
          "excerptTokens": [
            {
              "kind": "Content",
              "text": "NUMBER = \"number\""
            }
          ],
          "releaseTag": "Public",
          "name": "NUMBER",
          "variableTypeTokenRange": {
            "startIndex": 0,
            "endIndex": 0
          }
        },
        {
          "kind": "Variable",
          "canonicalReference": "@x82-softworks/aws-api!OBJECT:var",
          "docComment": "",
          "excerptTokens": [
            {
              "kind": "Content",
              "text": "OBJECT = \"object\""
            }
          ],
          "releaseTag": "Public",
          "name": "OBJECT",
          "variableTypeTokenRange": {
            "startIndex": 0,
            "endIndex": 0
          }
        },
        {
          "kind": "Variable",
          "canonicalReference": "@x82-softworks/aws-api!PASSWORD:var",
          "docComment": "",
          "excerptTokens": [
            {
              "kind": "Content",
              "text": "PASSWORD = \"password\""
            }
          ],
          "releaseTag": "Public",
          "name": "PASSWORD",
          "variableTypeTokenRange": {
            "startIndex": 0,
            "endIndex": 0
          }
        },
        {
          "kind": "Variable",
          "canonicalReference": "@x82-softworks/aws-api!requiredJsonRequest:var",
          "docComment": "/**\n * An easy shorthand to create a required JSON requestBody with provided inner schema\n *\n * @param schema - \n *\n * @public\n */\n",
          "excerptTokens": [
            {
              "kind": "Content",
              "text": "requiredJsonRequest: "
            },
            {
              "kind": "Content",
              "text": "(schema: object) => object"
            }
          ],
          "releaseTag": "Public",
          "name": "requiredJsonRequest",
          "variableTypeTokenRange": {
            "startIndex": 1,
            "endIndex": 2
          }
        },
        {
          "kind": "Variable",
          "canonicalReference": "@x82-softworks/aws-api!STRING:var",
          "docComment": "",
          "excerptTokens": [
            {
              "kind": "Content",
              "text": "STRING = \"string\""
            }
          ],
          "releaseTag": "Public",
          "name": "STRING",
          "variableTypeTokenRange": {
            "startIndex": 0,
            "endIndex": 0
          }
        }
      ]
    }
  ]
}
