{
    "extends":      [
        "config:base",
        ":semanticCommits"
    ],
    "baseBranches": [
        "dev"
    ],
    "assignees":    [
        "x.laylatichy.x"
    ],
    "packageRules": [
        {
            "matchDepNames": [
                "node",
                "npm",
                "pnpm"
            ],
            "groupName":         "node"
        },
        {
            "matchPackagePatterns": [
                "^laylatichy"
            ],
            "groupName":            "nano"
        },
        {
            "matchPackagePatterns": [
                "^@commitlint"
            ],
            "groupName":            "commitlint"
        }
    ]
}
