<svg width="96" height="96" viewBox="0 0 96 96" fill="none" xmlns="http://www.w3.org/2000/svg">
<rect width="96" height="96" rx="2" fill="#C9D9D6"/>
<mask id="mask0" mask-type="alpha" maskUnits="userSpaceOnUse" x="0" y="0" width="96" height="96">
<rect width="96" height="96" rx="2" fill="#C9D9D6"/>
</mask>
<g mask="url(#mask0)">
<g filter="url(#filter0_f)">
<path d="M-3.98171 42.4001C-15.0036 77.2645 15.2187 80.8003 15.2187 80.8003C36.8187 69.6003 30.6242 62.5346 36.8187 69.6003C71.7672 109.464 100.818 64.0003 100.818 64.0003C100.818 64.0003 103.941 56.6262 100.818 45.1368C85.1471 15.5928 70.1601 16.4904 65.6178 28.8004C41.4652 -6.17376 5.79685 19.6641 -3.98171 42.4001Z" fill="#1A00BA" fill-opacity="0.5"/>
</g>
<g filter="url(#filter1_f)">
<path d="M8.53649 46.2562C-3.41153 68.7002 14.8674 64.3709 14.8674 64.3709C21.4389 54.3303 30.5931 52.3537 34.867 57.1717C56.537 81.6006 76.9742 68.4051 76.9742 68.4051C87.6668 63.9754 90.4049 53.1469 87.6668 46.2562C73.9266 28.5373 66.1196 36.6177 62.137 44.0006C55.5656 38.0943 45.6218 32.3688 42.137 30.4C29.5915 23.3124 12.0895 31.5707 8.53649 46.2562Z" fill="#85F4C2" fill-opacity="0.8"/>
</g>
<g filter="url(#filter2_d)">
<path d="M80.7703 47.1545C79.0682 42.2657 74.9131 40.4741 71.1084 41.8562C67.479 43.1872 65.7268 46.8729 66.9784 50.4563C68.1548 53.8093 71.5089 55.4475 74.7629 54.2701C77.7165 53.195 79.0181 50.5843 78.9681 48.3575C79.9192 51.7617 78.5425 55.857 74.1872 57.4439C68.5553 59.5171 64.0498 55.5754 56.9661 48.9462C55.0137 47.1033 53.0613 45.2092 51.0588 43.4943L46.7786 40.1413C43.8 38.0937 40.6711 36.5067 37.342 35.7389H37.3671C36.9666 35.6621 36.5911 35.5853 36.1906 35.5341C36.0655 35.4829 35.9153 35.4829 35.7651 35.4573C35.665 35.4317 35.5649 35.4317 35.4898 35.4061C35.2895 35.3805 35.0642 35.3549 34.864 35.3294C34.7138 35.3038 34.5386 35.3038 34.3884 35.2782C34.3133 35.2782 34.2633 35.2782 34.1882 35.2526C16.8169 34.024 12.5366 54.4236 12.5366 54.4236L12.7619 55.0379C12.7118 55.1403 12.812 54.9355 12.7619 55.0379C12.7619 55.0379 17.8181 38.1961 29.1069 44.1342C31.4348 45.542 35.0893 47.82 37.292 49.5861L39.5197 51.3778C51.0589 60.413 61.8721 64.8922 72.6103 60.9761C80.3197 58.135 82.5224 52.1712 80.7703 47.1545Z" fill="black"/>
</g>
</g>
<defs>
<filter id="filter0_f" x="-26.4004" y="-8.31543" width="148.606" height="114.289" filterUnits="userSpaceOnUse" color-interpolation-filters="sRGB">
<feFlood flood-opacity="0" result="BackgroundImageFix"/>
<feBlend mode="normal" in="SourceGraphic" in2="BackgroundImageFix" result="shape"/>
<feGaussianBlur stdDeviation="10" result="effect1_foregroundBlur"/>
</filter>
<filter id="filter1_f" x="-5.51562" y="17.8223" width="104.173" height="64.1414" filterUnits="userSpaceOnUse" color-interpolation-filters="sRGB">
<feFlood flood-opacity="0" result="BackgroundImageFix"/>
<feBlend mode="normal" in="SourceGraphic" in2="BackgroundImageFix" result="shape"/>
<feGaussianBlur stdDeviation="5" result="effect1_foregroundBlur"/>
</filter>
<filter id="filter2_d" x="7.53662" y="30.1992" width="78.8" height="37.2" filterUnits="userSpaceOnUse" color-interpolation-filters="sRGB">
<feFlood flood-opacity="0" result="BackgroundImageFix"/>
<feColorMatrix in="SourceAlpha" type="matrix" values="0 0 0 0 0 0 0 0 0 0 0 0 0 0 0 0 0 0 127 0"/>
<feOffset/>
<feGaussianBlur stdDeviation="2.5"/>
<feColorMatrix type="matrix" values="0 0 0 0 0.521569 0 0 0 0 0.956863 0 0 0 0 0.760784 0 0 0 1 0"/>
<feBlend mode="normal" in2="BackgroundImageFix" result="effect1_dropShadow"/>
<feBlend mode="normal" in="SourceGraphic" in2="effect1_dropShadow" result="shape"/>
</filter>
</defs>
</svg>
