Name,Comments,X-Key Unit Number,Shift Flag,Key,Logic Dataref,Float Scale Factor,Bank 1 On,Bank 1 Blink,Bank 2 On,Bank 2 Blink,Command Logic Test,False (Default) Command,True Command,False (Default) Speech,True Speech,Numeric Dataref,Multiply By,Min,Max,Increment,Numeric Speech,Virtual Font Index,Virtual Key Color,Virtual Key Label,Virtual Font Color,Unit Name
FD PITCH\nCOMMAND,FD Pitch Command Knob,0,Both,0,FJS/727/Autopilot/PitchComKnob,,,,,,,,,,,FJS/727/Autopilot/PitchComKnob,,-10,15,TOP_CLICK_UP,,,#FF0000[<0];#0000FF[>0],PITCH\n{NUMERIC_FLOAT 1 .0},,FD/Autopilot
FD PITCH\nTAKEOFF,FD Pitch set to +5 deg,0,Both,1,FJS/727/Autopilot/PitchComKnob,,,,,,,,,,,FJS/727/Autopilot/PitchComKnob,,-10,15,Set_5,,,#00FF00[=5],,,FD/Autopilot
GA,FD GO Around,0,Both,7,SRS/X-KeyPad/SharedInt[2],,,,,,,,,,,SRS/X-KeyPad/SharedInt[2],,-2,-1,Set_-1,Flight Director Go Around[=-1],,#FF0000[=-1];FFFF00[!=-1],,,FD/Autopilot
OFF,FD Off,0,Both,13,SRS/X-KeyPad/SharedInt[2],,,,,,,,,,,SRS/X-KeyPad/SharedInt[2],,-1,0,Set_0,Flight Director off[=0],,#FF0000[=0];#00FF00[!=0],{1},#0000FF[!=0],FD/Autopilot
FD HDG SEL,FD Heading Select,0,Both,19,SRS/X-KeyPad/SharedInt[2],,,,,,,,,,,SRS/X-KeyPad/SharedInt[2],,0,1,Set_1,Flight Director Heading Hold On [=1],,#FF0000[!=1];#00FF00[=1],,#0000FF[=1],FD/Autopilot
FD MODE SELECTR\nLEFT,FD Mode Selector Left,0,Both,6,FJS/727/autopilot/FDModeSelector,,,,,,,FJS/727/Autopilot/FD_SelectLeft,,,,FJS/727/autopilot/FDModeSelector,,-1,4,down-up,Flight Director Go Around[=-1];Flight Director Off[=0];Flight Director Heading Hold On[=1];Flight Director Nav LOC Selected[=2];Flight Director Auto Approach Selected[=3];Flight Director Manual Approach Selected[=4],,#00FF00[!=0],,,FD/Autopilot
FD NAV/LOC,FD NAV/LOC Select,0,Both,25,SRS/X-KeyPad/SharedInt[2],,,,,,,,,,,SRS/X-KeyPad/SharedInt[2],,1,2,Set_2,Flight Director NavLoc Selected[=2],,#FF0000[!=2];#00FF00[=2],,#0000FF[=2],FD/Autopilot
FD MODE SELECTR\nRIGHT,FD Mode Selector Right,0,Both,12,FJS/727/autopilot/FDModeSelector,,,,,,,FJS/727/Autopilot/FD_SelectRight,,,,FJS/727/autopilot/FDModeSelector,,-1,4,up-down,Flight Director Go Around[=-1];Flight Director Off[=0];Flight Director Heading Hold On[=1];Flight Director Nav LOC Selected[=2];Flight Director Auto Approach Selected[=3];Flight Director Manual Approach Selected[=4],,#00FF00[!=0],,,FD/Autopilot
FD APPR\nAUTO,FD Approach Auto,0,Both,31,SRS/X-KeyPad/SharedInt[2],,,,,,,,,,,SRS/X-KeyPad/SharedInt[2],,2,3,Set_3,Flight Director Approach Auto Selected[=3],,#FF0000[!=3];#00FF00[=3],,#0000FF[=3],FD/Autopilot
FD APPR\nMAN,FD Approach Manual,0,Both,37,SRS/X-KeyPad/SharedInt[2],,,,,,,,,,,SRS/X-KeyPad/SharedInt[2],,3,4,Set_4,Flight Director Approach Manual Selected[=4],,#FF0000[!=4];#00FF00[=4],,#0000FF[=4],FD/Autopilot
FD ALT\nHOLD,FD Altitude Hold,0,Both,24,FJS/727/Autopilot/FDAltHoldSwitch,,,,,,,,,,,FJS/727/Autopilot/FDAltHoldSwitch,,0,1,up-down,Flight Director Altitude Hold On,,#FF0000[=0];#00FF00[=1],,,FD/Autopilot
,,,Both,,,,,,,,,,,,,,,,,,,,,,,FD/Autopilot
,,,Both,,,,,,,,,,,,,,,,,,,,,,,FD/Autopilot
PITCH \nSELECT\nLEFT,Pitch Select Knob Left,0,Both,3,FJS/727/autopilot/PitchSelectKnob,,,,,,,FJS/727/autopilot/PitchSelectLeft,,,,,,,,,,,#FFCCFF,,,FD/Autopilot
MACH\nHOLD,Mach Hold,0,Both,4,SRS/X-KeyPad/SharedInt[0],,,,,,,,,,,SRS/X-KeyPad/SharedInt[0],,-3,-2,Set_-2,MACH hold on[=-2],,#FF0000[>-2];#00FF00[=-2],,,FD/Autopilot
VERT\nSPEED,Vertical Speed Hold,0,Both,5,SRS/X-KeyPad/SharedInt[0],,,,,,,,,,,SRS/X-KeyPad/SharedInt[0],,-1,0,Set_0,Vertical Speed hold on[=0],,#FF0000[!=0];#00FF00[=0],,,FD/Autopilot
PITCH \nSELECT\nRIGHT,Pitch Select Knob Right,0,Both,9,FJS/727/autopilot/PitchSelectKnob,,,,,,,FJS/727/autopilot/PitchSelectRight,,,,FJS/727/autopilot/PitchSelectKnob,,-2,1,up-down,,,#FFCCFF,,,FD/Autopilot
IAS\nHOLD,IAS Hold,0,Both,10,SRS/X-KeyPad/SharedInt[0],,,,,,,,,,,SRS/X-KeyPad/SharedInt[0],,-2,-1,Set_-1,IAS Hold ON[=-1],,#FF0000[!=-1];#00FF00[=-1],,,FD/Autopilot
PITCH \nHOLD,Pitch Hold,0,Both,11,SRS/X-KeyPad/SharedInt[0],,,,,,,,,,,SRS/X-KeyPad/SharedInt[0],,0,1,Set_1,Pitch hold on[=1],,#FF0000[!=1];#00FF00[=1],,,FD/Autopilot
VS\nDECREASE,Vertical Speed Decrease,0,Both,15,sim/cockpit/autopilot/vertical_velocity,,,,,,,*sim/autopilot/vertical_speed_down,,,,sim/cockpit/autopilot/vertical_velocity,,,,,,,#660066,VS DEC\n{NUMERIC_INT 1 .0},,FD/Autopilot
VS\nINCREASE,Vertical Speed Increase,0,Both,16,sim/cockpit/autopilot/vertical_velocity,,,,,,,*sim/autopilot/vertical_speed_up,,,,sim/cockpit/autopilot/vertical_velocity,,,,,,,#660066,VS INC\n{NUMERIC_INT 1 .0},,FD/Autopilot
TURN KNOB\nLEFT,Turn Knob Left,0,Both,21,FJS/727/autopilot/TurnKnob,,,,,,,*FJS/727/autopilot/TurnKnobLeft,,,,,,,,,,,#99CCFF,,,FD/Autopilot
TURN KNOB\nRIGHT,Turn Knob Right,0,Both,27,FJS/727/autopilot/TurnKnob,,,,,,,*FJS/727/autopilot/TurnKnobRight,,,,,,,,,,,#99CCFF,,,FD/Autopilot
HDG SEL,Heading Select,0,Both,33,FJS/727/autopilot/AnunHDG,,,,,,[>0],FJS/727/autopilot/HeadingModeEngage,FJS/727/autopilot/HeadingModeEngage,,,,,,,,,,#FF0000[=0];#00FF00[>0],,,FD/Autopilot
ALT\nSEL,Altitude Select 2 (same as 1),0,Both,34,FJS/727/autopilot/AP_alt_hold_status,,,,[<1],,,FJS/727/autopilot/altitude_arm,FJS/727/autopilot/altitude_arm,,,sim/cockpit2/autopilot/altitude_dial_ft,,,,,{NUMERIC_INT 1 .0},,#0000FF[>0],ALT SEL\n{NUMERIC_INT 1 .0},,FD/Autopilot
ARM,Altitude Armed,0,Both,35,FJS/727/autopilot/AP_alt_hold_status,,,,,,,,,,,,,,,,,,#000000[=0];#FFFA50[=1],,,FD/Autopilot
ENG,Altitude Hold Engaged,0,Both,41,FJS/727/autopilot/AP_alt_hold_status,,,,,,,,,,,,,,,,,,#00FF00[=0];#FFFF00[!=0],,,FD/Autopilot
NAV\nGPS,NAV/GPS Switch,0,Both,49,FJS/727/NAVGPSSwitch,,,,,,,,,,,FJS/727/NAVGPSSwitch,,0,1,up-down,NAV selected[=1];GPS Selected[=0],,#00FF00[=1];#0000FF[=0],{2},#FF00FF[=1],FD/Autopilot
AP\nENGAGE,Autopilot Engage,0,Both,45,FJS/727/autopilot/AP_Lever,,1,,!1,,[=0],FJS/727/Autopilot/AP_Select,FJS/727/Autopilot/AP_Select,Auto Pilot Disengaged,Auto Pilot Engaged,,,,,,,,#FF0000[=0];#00FF00[=1],,,FD/Autopilot
AUX\nNAV,Aux Nav selected,0,Both,46,SRS/X-KeyPad/SharedInt[1],,,,,,,,,,,SRS/X-KeyPad/SharedInt[1],,-3,-2,Set_-2,Aux nav selected,,#FF0000[>-2];#00FF00[=-2],,,FD/Autopilot
NAV\nSELECTR\nLEFT,Nav Selector Left,0,Both,51,FJS/727/autopilot/NavSelectKnob,,,,,,,FJS/727/autopilot/NavSelectLeft,,,,,,,,,,,#9966FF,,,FD/Autopilot
NAV\nLOC,NAV/LOC Selected,0,Both,52,SRS/X-KeyPad/SharedInt[1],,,,,,,,,,,SRS/X-KeyPad/SharedInt[1],,-2,-1,Set_-1,Nav Loc selected,,#FF0000[!=-1];#00FF00[=-1],,,FD/Autopilot
AUTO\nG/S,Auto G/S,0,Both,53,SRS/X-KeyPad/SharedInt[1],,,,,,,,,,,SRS/X-KeyPad/SharedInt[1],,0,1,Set_1,Auto glideslope selected,,#FF0000[!=1];#00FF00[=1],,,FD/Autopilot
NAV\nSELECTR\nRIGHT,Nav Selector Right,0,Both,57,FJS/727/autopilot/NavSelectKnob,,,,,,,FJS/727/autopilot/NavSelectRight,,,,FJS/727/autopilot/NavSelectKnob,,-2,2,up-down,AUX NAV[=-2];NAV LOC[=-1];Turn Knob[=0];AUTO Glide Slope[=1];MAN Glide Slope[=2],,#9966FF,,,FD/Autopilot
TURN KNOB,Turn Knob,0,Both,58,SRS/X-KeyPad/SharedInt[1],,,,,,,,,,,SRS/X-KeyPad/SharedInt[1],,-1,0,Set_0,Turn knob selected[=0],,#FF0000[!=0];#00FF00[=0],,,FD/Autopilot
MAN\nG/S,Manual G/S,0,Both,59,SRS/X-KeyPad/SharedInt[1],,,,,,,,,,,SRS/X-KeyPad/SharedInt[1],,1,2,Set_2,Manual glideslope selected,,#FF0000[!=2];#00FF00[=2],,,FD/Autopilot
PARKING\nBRAKE,Temporary,0,Both,54,sim/flightmodel/controls/parkbrake,,,,,,,,,,,sim/flightmodel/controls/parkbrake,,0,1,wrap,Parking Brake off[=0];Parking brake on[=1],,#0000FF[=0];#FF0000[=1],,,
,,,,,,,,,,,,,,,,,,,,,,,,,,
LIGHTS,Lighting section of overhead,5,,0,,,,,,,,SRS/X-Camera/Select_View_ID_6,,,,,,,,,,,#E6E600,,#000000,Views
PILOT,Pilot View,5,,1,,,,,,,,SRS/X-Camera/Select_View_ID_1,,,,,,,,,,,#0000FF,,#FFFFFF,Views
FMS,FMC View,5,,2,,,,,,,,SRS/X-Camera/Select_View_ID_5,,,,,,,,,,,#99CCFF,,#000000,Views
AVITAB,Avitab Tablet,5,,3,,,,,,,,SRS/X-Camera/Select_View_ID_16,,,,,,,,,,,,,,Views
RADIO\nMASTERS,Radio Master Switches,5,,4,,,,,,,,SRS/X-Camera/Select_View_ID_10,,,,,,,,,,,#FFFF00,,#0000FF,Views
FUEL\nDUMP,Fuel Dump Panel,5,,5,,,,,,,,SRS/X-Camera/Select_View_ID_17,,,,,,,,,,,#FF0000,,#0000FF,Views
ZOOM\nIN,Zoom in,5,,7,,,,,,,,*sim/general/zoom_in,,,,,,,,,,,#FF00FF,\18C\nZOOM\nIN,,Views
OVRHEAD,Overhead Panel,5,,8,,,,,,,,SRS/X-Camera/Select_View_ID_4,,,,,,,,,,,#33CC33,,,Views
ENG\nCLUSTER,Engine Cluster,5,,9,,,,,,,,SRS/X-Camera/Select_View_ID_8,,,,,,,,,,,#FF9966,,,Views
AUTOPLT,Autopilot Engage,5,,10,,,,,,,,SRS/X-Camera/Select_View_ID_18,,,,,,,,,,,#33CC33,,,Views
PEDESTL,Throttle Pedestal,5,,11,,,,,,,,SRS/X-Camera/Select_View_ID_7,,,,,,,,,,,#FFFFF0,,#000000,Views
RADIOS,Radios,5,,12,,,,,,,,SRS/X-Camera/Select_View_ID_3,,,,,,,,,,,#FFFFCC,,#000000,Views
ZOOM\nOUT,Zoom out,5,,15,,,,,,,,*sim/general/zoom_out,,,,,,,,,,,#FF00FF,ZOOM\nOUT\n\18D,,Views
RADAR,Radar ,5,,13,,,,,,,,SRS/X-Camera/Select_View_ID_9,,,,,,,,,,,#FF6666,,,Views
FIRST\nOFFICER,First Officer,5,,17,,,,,,,,SRS/X-Camera/Select_View_ID_2,,,,,,,,,,,#0000FF,,,Views
ENGINES\nAPU,Startup Page,5,Both,23,SRS/X-KeyPad/ShiftState,,,,,,,SRS/X-KeyPad/Toggle_Shift,,,,SRS/X-KeyPad/ShiftState,,,,,,,#FF00FF[=0];#0000FF[=1],ENGINES\nAPU[=0];VIEWS[=1],,Views
FE\nUPPER,FE Upper panel,5,,18,,,,,,,,SRS/X-Camera/Select_View_ID_12,,,,,,,,,,,#FF9900,,,Views
FE\nLOWER,FE Lower panel,5,,19,,,,,,,,SRS/X-Camera/Select_View_ID_11,,,,,,,,,,,#E68A00,,,Views
APU,APU Panel,5,,20,,,,,,,,SRS/X-Camera/Select_View_ID_14,,,,,,,,,,,#FFFF00,,#0000FF,Views
CHASE,Chase View,5,,24,,,,,,,,SRS/X-Camera/Select_View_ID_30,,,,,,,,,,,#0000FF,,,Views
IAS,Indicated Airspeed,5,,22,sim/flightmodel/position/indicated_airspeed,,,,,,,,,,,sim/flightmodel/position/indicated_airspeed,,,,,,,#0000FF,IAS\n{NUMERIC_INT 1 .0} KTS,,Views
TAS,True Airspeed,5,,30,sim/cockpit2/gauges/indicators/true_airspeed_kts_pilot,,,,,,,,,,,sim/cockpit2/gauges/indicators/true_airspeed_kts_pilot,,,,,,,#0000FF,TAS\n{NUMERIC_INT 1 .0} KTS,,Views
GS,Ground Speed,5,,38,sim/flightmodel2/position/groundspeed,,,,,,,,,,,sim/flightmodel2/position/groundspeed,,,,,,,#0000FF,GS\n{NUMERIC_INT 1.94384 3} KTS,,Views
MACH,Mach Speed,5,,46,sim/cockpit2/gauges/indicators/mach_pilot,,,,,,,,,,,sim/cockpit2/gauges/indicators/mach_pilot,,,,,,,#0000FF,MACH\n{NUMERIC_FLOAT 1 0.2} M,,Views
PAUSE,Pause,5,Both,39,sim/time/paused,,!1,,,1,,sim/operation/pause_toggle,,,,,,,,,,,,,,Views
GEAR CYCLE,Cycle Landing Gear,5,,40,SRS/X-KeyPad/SharedInt[15],,,,,,,FJS/727/Hyd/Com/GearHandleTuggle,,,,SRS/X-KeyPad/SharedInt[15],,,,,,,#00FF00[=0];#FF00FF[=1];#FF0000[=2],GEAR\nDOWN[=0];GEAR\nOFF[=1];GEAR\nUP[=2],,Views
RELOAD,Reload Configuration,5,Both,47,,,,,,,,SRS/X-KeyPad/Reload_Configuration,,,,,,,,,,,,,,Views
,,,,,,,,,,,,,,,,,,,,,,,,,,
ENG 1\nN2,Engine 1 N2,5,1,0,FJS/727/Eng/N21Needle,,,,,,,,,,,FJS/727/Eng/N21Needle,,,,,,,,ENG 1 N2\n{NUMERIC_INT 1 0},,Views
LOW OIL\nPRESSURE,Low Oil Pressue,5,1,1,FJS/732/Annun/SysAnnunLIT_46,,,,,,,,,,,FJS/732/Annun/SysAnnunLIT_46,,0,1,wrap,,,#000000[=0];#FFFF00[=1],,,Views
STARTER,Engine 1 start,5,1,2,FJS/727/Eng/Engine1StartSwitch,,,,,,[=0],*sim/starters/engage_starter_1,*sim/starters/engage_starter_1,,Starting 1,FJS/727/Eng/Engine1StartSwitch,,0,1,wrap,,,#000000[=0];#00FF00[=1],,,Views
FUEL CUTOUT,Engine 1 Fuel Cutout Switch,5,1,3,FJS/727/fuel/FuelMixtureLever1,,,,,,,,,,,FJS/727/fuel/FuelMixtureLever1,,0,1,wrap,,,#FF0000[=0];#00FF00[=1],,,Views
CHASE,Chase View,5,1,7,,,,,,,,SRS/X-Camera/Select_View_ID_30,,,,,,,,,,,#0000FF,,,Views
ENG 2\nN2,Engine 2 N2,5,1,8,FJS/727/Eng/N22Needle,,,,,,,,,,,FJS/727/Eng/N22Needle,,,,,,,,ENG 1 N2\n{NUMERIC_INT 1 0},,Views
LOW OIL\nPRESSURE,Low Oil Pressue,5,1,9,FJS/732/Annun/SysAnnunLIT_47,,,,,,,,,,,FJS/732/Annun/SysAnnunLIT_47,,0,1,wrap,,,#000000[=0];#FFFF00[=1],,,Views
STARTER,Engine 1 start,5,1,10,FJS/727/Eng/Engine2StartSwitch,,,,,,[=0],*sim/starters/engage_starter_2,*sim/starters/engage_starter_2,,Starting 2,FJS/727/Eng/Engine2StartSwitch,,0,1,wrap,,,#000000[=0];#00FF00[=1],,,Views
FUEL CUTOUT,Engine 1 Fuel Cutout Switch,5,1,11,FJS/727/fuel/FuelMixtureLever2,,,,,,,,,,,FJS/727/fuel/FuelMixtureLever2,,0,1,wrap,,,#FF0000[=0];#00FF00[=1],,,Views
APU\nSTART,APU Start Switch,5,1,14,FJS/727/Elec/APU_StarSwitch,,,,,,,,,,,FJS/727/Elec/APU_StarSwitch,,0,2,up-down,,,#0000FF[=0];#FFFF00[=1];FF0000[=2],APU\nOFF[=0];APU\nON[=1];APU\nSTART[=2],,Views
ENG 3\nN2,Engine 3 N2,5,1,16,FJS/727/Eng/N23Needle,,,,,,,,,,,FJS/727/Eng/N23Needle,,,,,,,,ENG 1 N2\n{NUMERIC_INT 1 0},,Views
LOW OIL\nPRESSURE,Low Oil Pressure,5,1,17,FJS/732/Annun/SysAnnunLIT_48,,,,,,,,,,,FJS/732/Annun/SysAnnunLIT_48,,0,1,wrap,,,#000000[=0];#FFFF00[=1],,,Views
STARTER,Engine 3 start,5,1,18,FJS/727/Eng/Engine3StartSwitch,,,,,,[=0],*sim/starters/engage_starter_3,*sim/starters/engage_starter_3,,Starting 3,FJS/727/Eng/Engine3StartSwitch,,0,1,wrap,,,#000000[=0];#00FF00[=1],,,Views
FUEL CUTOUT,Engine 3 Fuel Cutout Switch,5,1,19,FJS/727/fuel/FuelMixtureLever3,,,,,,,,,,,FJS/727/fuel/FuelMixtureLever3,,0,1,wrap,,,#FF0000[=0];#00FF00[=1],,,Views
APU\nFIELD,APU Field Switch,5,1,22,FJS/727/Elec/APU_FieldSwitch,,,,,,,,,,,FJS/727/Elec/APU_FieldSwitch,,0,2,up-down,,,#0000FF[=0];#FFFF00[!=0],,,Views
APU\nGEN,APU Generator Switch,5,1,30,FJS/727/Elec/APU_GenSwitch,,,,,,,,,,,FJS/727/Elec/APU_GenSwitch,,-1,1,up-down,,,#0000FF[=0];#FFFF00[!=0],,,Views
APU\EGT,APU EGT Gauge,5,1,38,FJS/727/Elec/APU_EGTNeelde,,,,,,,,,,,FJS/727/Elec/APU_EGTNeelde,,,,,,,,APU\nEGT\n{NUMERIC_INT 1 3}C,,Views
APU\AC AMP,APU AC Amp Gauge,5,1,46,FJS/727/Elec/APU_ampresNeedle,,,,,,,,,,,FJS/727/Elec/APU_ampresNeedle,,,,,,,,APU\nAC AMPS\n{NUMERIC_INT 1 3}A,,
,,,,,,,,,,,,,,,,,,,,,,,,,,
L MAP\nLIGHT,Map Light Dimmer,6,Both,0,SRS/X-KeyPad/SharedInt[4],,,,,,,,,,,SRS/X-KeyPad/SharedInt[4],,0,100,RIGHT_CLICK_UP,,,,L MAP\nLIGHT\n{NUMERIC_INT 1 3}%,,Lights
L FWD\nSIDE PANEL,Left Fwd & Side Panel dimmer,6,Both,3,SRS/X-KeyPad/SharedInt[5],,,,,,,,,,,SRS/X-KeyPad/SharedInt[5],,0,100,RIGHT_CLICK_UP,,,,L FWD\nSIDE PANEL\n{NUMERIC_INT 1 3}%,,Lights
CENTER\nFWD PANEL,Center FWD Panel,6,Both,6,SRS/X-KeyPad/SharedInt[6],,,,,,,,,,,SRS/X-KeyPad/SharedInt[6],,0,100,RIGHT_CLICK_UP,,,,CENTER\nFWD PANEL\n{NUMERIC_INT 1 3}%,,Lights
FWD PANEL\nBKGND,Forward Panel Background,6,Both,9,SRS/X-KeyPad/SharedInt[7],,,,,,,,,,,SRS/X-KeyPad/SharedInt[7],,0,100,RIGHT_CLICK_UP,,,,FWD PANEL\nBKGND\n{NUMERIC_INT 1 3}%,,Lights
FWD PANEL\nFLOUR,Forward Panel Flourescent,6,Both,12,FJS/727/lights/FwdPanelFlourSwitch,,,,,,,,,,,FJS/727/lights/FwdPanelFlourSwitch,,0,1,wrap,,,#0000FF[=0];#00FF00[=1],,,Lights
OVERHEAD\nPANEL,Overhead Panel,6,Both,15,SRS/X-KeyPad/SharedInt[8],,,,,,,,,,,SRS/X-KeyPad/SharedInt[8],,0,100,RIGHT_CLICK_UP,,,,OVERHEAD\nPANEL\n{NUMERIC_INT 1 3}%,,Lights
CTL STND\nRED,Control Stand Red,6,Both,18,SRS/X-KeyPad/SharedInt[9],,,,,,,,,,,SRS/X-KeyPad/SharedInt[9],,0,100,RIGHT_CLICK_UP,,,,CTL STND\nRED\n{NUMERIC_INT 1 3}%,,Lights
CTL STND\nWHITE,Control Stand White,6,Both,21,SRS/X-KeyPad/SharedInt[10],,,,,,,,,,,SRS/X-KeyPad/SharedInt[10],,0,100,RIGHT_CLICK_UP,,,,CTL STND\nWHITE\n{NUMERIC_INT 1 3}%,,Lights
LIGHT\nOVERRIDE,Light Overide,6,Both,24,FJS/727/lights/LightOverride,,,,,,,,,,,FJS/727/lights/LightOverride,,-1,1,up-down,,,#FF00FF[=-1];#00FF00[=0];#FFFFFF[=1],FLT ONLY[=-1];NORMAL[=0];ALL WHITE[=1],#000000[=0];#000000[=1],Lights
RT FWD &\nSIDE PANEL,Right Forward and Side Panel,6,Both,27,SRS/X-KeyPad/SharedInt[11],,,,,,,,,,,SRS/X-KeyPad/SharedInt[11],,0,100,RIGHT_CLICK_UP,,,,RT FWD\nSIDE PANEL\n{NUMERIC_INT 1 3}%,,Lights
R MAP,Right Map Light,6,Both,30,SRS/X-KeyPad/SharedInt[12],,,,,,,,,,,SRS/X-KeyPad/SharedInt[12],,0,100,RIGHT_CLICK_UP,,,,R MAP\nLIGHT\n{NUMERIC_INT 1 3}%,,Lights
NO\nSMOKING,No Smoking Sign,6,Both,42,FJS/727/lights/NoSmokingSwitch,,,,,,,,,,,FJS/727/lights/NoSmokingSwitch,,0,1,up-down,,,#0000FF[=0];#00FF00[=1],,,Lights
FASTEN\nSEATBLT,Fasten Seatbelts Sign,6,Both,45,FJS/727/lights/FastenBeltsSwitch,,,,,,,,,,,FJS/727/lights/FastenBeltsSwitch,,0,1,up-down,,,#0000FF[=0];#00FF00[=1],,,Lights
COMPASS,Compass Light,6,Both,2,SRS/X-KeyPad/SharedInt[13],,,,,,,,,,,SRS/X-KeyPad/SharedInt[13],,0,100,RIGHT_CLICK_UP,,,,COMPASS\n{NUMERIC_INT 1 3}%,,Lights
DOME\nRED,Dome Red Light,6,Both,44,SRS/X-KeyPad/SharedInt[14],,,,,,,,,,,SRS/X-KeyPad/SharedInt[14],,0,100,RIGHT_CLICK_UP,,,,DOME\nRED\n{NUMERIC_INT 1 3}%,,Lights
DOME\nWHITE,Dome White Light,6,Both,47,FJS/727/lights/DomeLightSwitch,,,,,,,,,,,FJS/727/lights/DomeLightSwitch,,0,1,up-down,,,#FFFFFF[=1];#FF0000[=0],DOME\nWHITE[=1];DOME\nRED[=0],#000000[=1],Lights
ALL\nLDG LIGHTS,All Landing Lights,6,Both,5,SRS/X-KeyPad/SharedInt[3],,,,,,,,,,,SRS/X-KeyPad/SharedInt[3];FJS/727/lights/OutboundLLSwitch_L;FJS/727/lights/OutboundLLSwitch_R;FJS/727/lights/InboundLLSwitch_L;FJS/727/lights/InboundLLSwitch_R,,0,1,wrap,,,#0000FF[=0];#00FF00[=1],,,Lights
LEFT\nOUTBRD\nLDG LIGHT,Left Outboard Landing Light,6,Both,8,FJS/727/lights/OutboundLLSwitch_L,,,,,,,,,,,FJS/727/lights/OutboundLLSwitch_L,,0,1,wrap,,,#0000FF[=0];#00FF00[=1],,,Lights
RIGHT\nOUTBRD\nLDG LIGHT,Right Outboard Landing Light,6,Both,11,FJS/727/lights/OutboundLLSwitch_R,,,,,,,,,,,FJS/727/lights/OutboundLLSwitch_R,,0,1,wrap,,,#0000FF[=0];#00FF00[=1],,,Lights
Left\nINBRD\nLDG LIGHT,Left Inboard Landing Light,6,Both,14,FJS/727/lights/InboundLLSwitch_L,,,,,,,,,,,FJS/727/lights/InboundLLSwitch_L,,0,1,wrap,,,#0000FF[=0];#00FF00[=1],,,Lights
RIGHT\nINBRD\nLDG LIGHT,Right Inboard Landing Light,6,Both,17,FJS/727/lights/InboundLLSwitch_R,,,,,,,,,,,FJS/727/lights/InboundLLSwitch_R,,0,1,wrap,,,#0000FF[=0];#00FF00[=1],,,Lights
TAXI\nLIGHT,Taxi light,6,Both,20,FJS/727/lights/TaxiLightSwitch,,,,,,,,,,,FJS/727/lights/TaxiLightSwitch,,0,1,wrap,,,#0000FF[=0];#00FF00[=1],,,Lights
LEFT\nTURNOFF LIGHT,Left Runway turnoff light,6,Both,23,FJS/727/lights/RunwayTurnoffLightSwitch_L,,,,,,,,,,,FJS/727/lights/RunwayTurnoffLightSwitch_L,,0,1,wrap,,,#0000FF[=0];#00FF00[=1],,,Lights
RIGHT\nTURNOFF LIGHT,Right Runway turnoff light,6,Both,26,FJS/727/lights/RunwayTurnoffLightSwitch_R,,,,,,,,,,,FJS/727/lights/RunwayTurnoffLightSwitch_R,,0,1,wrap,,,#0000FF[=0];#00FF00[=1],,,Lights
STROBE,Strobe,6,Both,29,FJS/727/lights/StrobeLightSwitch,,,,,,,,,,,FJS/727/lights/StrobeLightSwitch,,0,1,wrap,,,#0000FF[=0];#00FF00[=1],,,Lights
NAV\nLIGHTS,Navigation Lights,6,Both,32,FJS/727/lights/NavLightSwitch,,,,,,,,,,,FJS/727/lights/NavLightSwitch,,0,1,wrap,,,#0000FF[=0];#00FF00[=1],,,Lights
BEACON,Beacon Light,6,Both,35,FJS/727/lights/BeaconLightSwitch,,,,,,,,,,,FJS/727/lights/BeaconLightSwitch,,0,1,wrap,,,#0000FF[=0];#00FF00[=1],,,Lights
WING,Wing Lights,6,Both,38,FJS/727/lights/WingLightSwitch,,,,,,,,,,,FJS/727/lights/WingLightSwitch,,0,1,wrap,,,#0000FF[=0];#00FF00[=1],,,Lights
LOGO,Logo Light,6,Both,41,FJS/727/lights/LogoLightSwitch,,,,,,,,,,,FJS/727/lights/LogoLightSwitch,,0,1,wrap,,,#0000FF[=0];#00FF00[=1],,,Lights
MAP\n0 or 100,Map Light 0 or 100,6,Both,1,FJS/727/lights/MapLiteL_Knob,,,,,,,,,,,FJS/727/lights/MapLiteL_Knob,,0,1,wrap,,,#0000FF[=0];#00FF00[=1],,,Lights
L FWD\nSIDE\n0 or 100,Left Fwd & Side Panel 0 or 100,6,Both,4,FJS/727/lights/Panel_LeftFwd_Knob,,,,,,,,,,,FJS/727/lights/Panel_LeftFwd_Knob,,0,1,wrap,,,#0000FF[=0];#00FF00[=1],,,Lights
CENTER\nFWD PANEL\n0 or 100,Center FWD Panel 0 or 100,6,Both,7,FJS/727/lights/Panel_CtrFwd_Knob,,,,,,,,,,,FJS/727/lights/Panel_CtrFwd_Knob,,0,1,wrap,,,#0000FF[=0];#00FF00[=1],,,Lights
FWD PANEL\nBKGND\n0 or 100,Forward Panel Background 0 or 100,6,Both,10,FJS/727/lights/Fwd_Panel_storm_Knob,,,,,,,,,,,FJS/727/lights/Fwd_Panel_storm_Knob,,0,1,wrap,,,#0000FF[=0];#00FF00[=1],,,Lights
COMPASS\n0 or 100,Compass light 0 or 100%,6,Both,13,FJS/727/lights/Panel_Compass_Knob,,,,,,,,,,,FJS/727/lights/Panel_Compass_Knob,,0,1,wrap,,,#0000FF[=0];#00FF00[=1],,,Lights
OVERHEAD\nPANEL\n0 or 100,Overhead Panel Lights 0 or 100,6,Both,16,FJS/727/lights/Panel_Overhead_Knob,,,,,,,,,,,FJS/727/lights/Panel_Overhead_Knob,,0,1,wrap,,,#0000FF[=0];#00FF00[=1],,,Lights
CTL STND\nRED\n0 or 100,Control Stand Red 0 or 100,6,Both,19,FJS/727/lights/CtrStnd_Red_Knob,,,,,,,,,,,FJS/727/lights/CtrStnd_Red_Knob,,0,1,wrap,,,#0000FF[=0];#00FF00[=1],,,Lights
CTL STND\nWHITE\n 0 or 100,Control Stand White 0 or 100,6,Both,22,FJS/727/lights/WhiteCtrlStndKnob,,,,,,,,,,,FJS/727/lights/WhiteCtrlStndKnob,,0,1,wrap,,,#0000FF[=0];#00FF00[=1],,,Lights
RT FWD &\nSIDE PANEL\n0 or 100,Right Forward and Side Panel 0 or 100,6,Both,28,FJS/727/lights/Panel_RightFwd_Knob,,,,,,,,,,,FJS/727/lights/Panel_RightFwd_Knob,,0,1,wrap,,,#0000FF[=0];#00FF00[=1],,,Lights
R MAP\n0 or 100,Right Map Light 0 or 100,6,Both,31,FJS/727/lights/MapLiteR_Knob,,,,,,,,,,,FJS/727/lights/MapLiteR_Knob,,0,1,wrap,,,#0000FF[=0];#00FF00[=1],,,Lights
DOME\n0 or 100,Dome Light 0 or 100%,6,Both,43,FJS/727/lights/DomeRed_Knob,,,,,,,,,,,FJS/727/lights/DomeRed_Knob,,0,1,up-down,,,#0000FF[=0];#00FF00[=1],,,Lights
