{
    "name": "jcibot_question",
    "roles": [
        "jcibot_question"
    ],
    "lookups": [
        "free-text",
        "keywords"
    ],
    "keywords": [
        {
            "keyword": "dodne esta",
            "synonyms": [
                "dodne esta"
            ]
        },
        {
            "keyword": "donde esta",
            "synonyms": [
                "donde esta"
            ]
        },
        {
            "keyword": "donde estan",
            "synonyms": [
                "donde esta",
                "donde estan"
            ]
        },
        {
            "keyword": "hay algun",
            "synonyms": [
                "hay algun"
            ]
        }
    ]
}
