<svg width="28" height="30" viewBox="0 0 28 30" fill="none" xmlns="http://www.w3.org/2000/svg">
<path d="M20.9231 0C18.3742 0 16.3077 2.06885 16.3077 4.61538C16.3077 7.69038 20.3461 11.8915 20.3461 16.1181H21.5C21.5011 11.8915 25.5385 7.81154 25.5385 4.61538C25.5385 2.06885 23.4719 0 20.9231 0ZM20.9231 2.23615C21.2357 2.23631 21.5452 2.29803 21.8339 2.41779C22.1227 2.53756 22.385 2.71302 22.6059 2.93417C22.8268 3.15531 23.0021 3.41781 23.1215 3.70667C23.241 3.99553 23.3025 4.3051 23.3023 4.61769C23.3021 4.93029 23.2404 5.23979 23.1207 5.52854C23.0009 5.81728 22.8254 6.07961 22.6043 6.30054C22.3831 6.52147 22.1206 6.69668 21.8318 6.81617C21.5429 6.93565 21.2334 6.99707 20.9208 6.99692C20.2893 6.99662 19.6838 6.74547 19.2375 6.29874C18.7912 5.85201 18.5406 5.24628 18.541 4.61481C18.5413 3.98334 18.7924 3.37785 19.2391 2.93155C19.6859 2.48525 20.2916 2.23469 20.9231 2.235V2.23615ZM14 2.30769C6.36499 2.30769 0.153839 8.51885 0.153839 16.1538C0.153839 23.7888 6.36499 30 14 30C21.635 30 27.8461 23.7888 27.8461 16.1538C27.8461 13.8346 27.2715 11.6585 26.2596 9.735C26.1061 10.0396 25.9515 10.3292 25.7911 10.6373C25.4877 11.2235 25.1681 11.8154 24.8888 12.4038C25.1773 13.2288 25.3758 14.1012 25.4658 15H23.9519C23.8688 15.3865 23.8077 15.75 23.8077 16.1181V17.3077H25.4669C25.3104 18.9344 24.8059 20.5084 23.9877 21.9231H20.6C20.8538 20.8408 21.0004 19.6442 21.1042 18.4258H18.8311C18.7236 19.6063 18.5191 20.7761 18.2196 21.9231H9.78038C9.39042 20.413 9.16069 18.866 9.09499 17.3077H18.0373V16.1181C18.0284 15.7414 17.98 15.3666 17.8931 15H9.09615C9.16185 13.4417 9.39158 11.8947 9.78153 10.3846H15.9477C15.5475 9.62885 15.1742 8.85913 14.8285 8.07692H10.5742C11.5285 5.89962 12.7896 4.61538 14 4.61538C14 3.81346 14.1442 3.06 14.3969 2.34346C14.2642 2.33885 14.1338 2.30769 14 2.30769ZM9.24038 5.66077C8.78087 6.4282 8.39455 7.23715 8.08653 8.07692H5.77884C6.77413 7.06534 7.94765 6.24623 9.24038 5.66077ZM4.0123 10.3846H7.39999C7.05101 11.9004 6.84587 13.4457 6.7873 15H2.53307C2.6891 13.3732 3.19361 11.799 4.0123 10.3846V10.3846ZM2.53307 17.3077H6.78845C6.85653 18.9519 7.06884 20.5038 7.40115 21.9231H4.0123C3.1946 20.5082 2.69016 18.9343 2.53307 17.3077ZM5.77884 24.2308H8.08653C8.41884 25.1262 8.80769 25.9304 9.24038 26.6469C7.94765 26.0615 6.77413 25.2423 5.77884 24.2308V24.2308ZM10.5742 24.2308H17.4258C16.4715 26.4081 15.2104 27.6923 14 27.6923C12.7896 27.6923 11.5273 26.4081 10.5742 24.2308ZM19.9135 24.2308H22.2211C21.2259 25.2423 20.0523 26.0615 18.7596 26.6469C19.1923 25.9315 19.5811 25.1273 19.9135 24.2308Z" fill="#60CDE6"/>
</svg>
