<?xml version="1.0" encoding="utf-8"?>
<!-- Generator: Adobe Illustrator 22.0.1, SVG Export Plug-In . SVG Version: 6.00 Build 0)  -->
<svg version="1.1" id="Layer_1" xmlns="http://www.w3.org/2000/svg" xmlns:xlink="http://www.w3.org/1999/xlink" x="0px" y="0px"
	 viewBox="0 0 141.7 141.7" style="enable-background:new 0 0 141.7 141.7;" xml:space="preserve">
<path d="M55.7,51.2c0.4-2.2,0.7-4.2,1-6.3c0.3-1.9,0.5-2.1,2.5-2.1c7.9,0,15.7,0,23.6,0c1.6,0,1.9,0.2,2.1,1.8
	c0.3,1.9,0.7,3.8,0.9,5.7c0.1,0.8,0.4,1,1.2,1c2.7,0,5.3,0,8,0c2.4,0,3.8,1,4.5,3.3c1.5,5,2.9,10.1,4.3,15.2c0.3,1,0.7,1.1,1.6,1.1
	c2.4,0,4,1.1,4.5,3.1c0.7,2.6-1.1,5-3.8,5.2c-2.1,0.1-2,0.1-2.6,2.1c-1.4,4.8-2.7,9.5-4.1,14.3c-0.7,2.3-2.1,3.3-4.5,3.3
	c-8,0-16.1,0-24.1,0c-8,0-15.9,0-23.9,0c-2.8,0-4.1-0.9-4.8-3.6c-1.4-4.9-2.8-9.8-4.2-14.7c-0.3-1.1-0.7-1.5-1.9-1.5
	c-2.4,0.1-4.2-1.4-4.4-3.6c-0.3-2.6,1.5-4.6,4.2-4.7c2.2-0.1,1.7,0.1,2.2-1.7c1.4-4.8,2.8-9.6,4.2-14.5c0.7-2.4,2.1-3.5,4.6-3.5
	c2.6,0,5.1,0,7.7,0C54.8,51.2,55.2,51.2,55.7,51.2z M61,96.1c2.9,0,5.6,0,8.5,0c0-0.4,0-0.8,0-1.2c0-2.8,0-5.5,0-8.3
	c0-1,0.5-1.7,1.3-1.7c0.8,0,1.4,0.7,1.4,1.7c0,2.4,0,4.7,0,7.1c0,0.8,0,1.6,0,2.4c2.9,0,5.6,0,8.5,0c0-0.4,0-0.8,0-1.2
	c0-2.8,0-5.5,0-8.3c0-1.2,0.8-1.9,1.8-1.6c0.8,0.3,0.9,0.9,0.9,1.6c0,2.8,0,5.7,0,8.5c0,0.7,0.2,1.1,1,1c3.5,0,7,0,10.5,0
	c1.1,0,1.7-0.4,2-1.5c0.9-3.4,1.9-6.7,2.9-10c0.5-1.7,1-3.5,1.5-5.3c-20.4,0-40.6,0-60.9,0c0.1,0.4,0.1,0.6,0.2,0.9
	c1.4,4.8,2.7,9.6,4.1,14.4c0.4,1.3,0.7,1.6,2.1,1.6c3.4,0,6.9,0,10.3,0c0.3,0,0.7,0,1.1-0.1c0-0.5,0-1,0-1.4c0-2.6,0-5.1,0-7.7
	c0-1.4,0.4-2.1,1.3-2.1c0.9,0,1.4,0.7,1.4,2.1c0,1.8,0,3.5,0,5.3C61,93.5,61,94.8,61,96.1z M86.5,53.9c0.3,2.1,0.7,4.1,1,6
	c0.3,1.9,0,2.4-2,2.4c-9.8,0-19.5,0-29.3,0c-0.2,0-0.5,0-0.7,0c-1-0.1-1.5-0.6-1.4-1.6c0-0.4,0.1-0.8,0.2-1.2
	c0.3-1.8,0.6-3.6,0.9-5.6c-3.1,0-6,0-9,0c-0.8,0-1.2,0.6-1.4,1.3c-0.9,3-1.7,6.1-2.6,9.1c-0.6,2.1-1.2,4.2-1.8,6.4
	c20.3,0,40.6,0,60.8,0c0-0.2,0-0.3,0-0.3c-1.4-5.1-2.9-10.3-4.3-15.4c-0.2-0.8-0.9-1.1-1.7-1.1c-1.1,0-2.2,0-3.4,0
	C90.1,53.9,88.4,53.9,86.5,53.9z M84.7,59.6c-0.8-4.5-1.5-9-2.2-13.4c-0.1-0.6-0.4-0.7-0.9-0.7c-7.1,0-14.2,0-21.3,0
	c-0.7,0-1,0.3-1.1,0.9c-0.2,1.6-0.5,3.3-0.8,4.9C58,54,57.5,56.8,57,59.6C66.3,59.6,75.4,59.6,84.7,59.6z M71,73.6
	C71,73.6,71,73.6,71,73.6c-9.9,0-19.8,0-29.7,0c-1.8,0-3.5,0-5.3,0c-1.2,0-1.8,0.6-1.7,1.5c0,0.8,0.7,1.3,1.8,1.4c0.1,0,0.1,0,0.2,0
	c13.1,0,26.3,0,39.4,0c9.8,0,19.7,0,29.5,0c1.6,0,2.2-0.5,2.2-1.4c0-1-0.7-1.4-2.3-1.4C93.7,73.6,82.4,73.6,71,73.6z"/>
</svg>
