\boolfalse {citerequest}\boolfalse {citetracker}\boolfalse {pagetracker}\boolfalse {backtracker}\relax 
\babel@toc {english}{}\relax 
\defcounter {refsection}{0}\relax 
\contentsline {section}{\numberline {1}Question 1}{2}{section.1}%
\defcounter {refsection}{0}\relax 
\contentsline {subsection}{\numberline {1.1}Point A}{2}{subsection.1.1}%
\defcounter {refsection}{0}\relax 
\contentsline {subsection}{\numberline {1.2}Point B}{2}{subsection.1.2}%
\defcounter {refsection}{0}\relax 
\contentsline {subsection}{\numberline {1.3}Point C}{3}{subsection.1.3}%
\defcounter {refsection}{0}\relax 
\contentsline {subsection}{\numberline {1.4}Point D}{4}{subsection.1.4}%
\defcounter {refsection}{0}\relax 
\contentsline {section}{\numberline {2}Question 2}{5}{section.2}%
\defcounter {refsection}{0}\relax 
\contentsline {subsection}{\numberline {2.1}Point A}{5}{subsection.2.1}%
\defcounter {refsection}{0}\relax 
\contentsline {subsection}{\numberline {2.2}Point B}{5}{subsection.2.2}%
\defcounter {refsection}{0}\relax 
\contentsline {section}{\numberline {3}Question 3}{8}{section.3}%
\defcounter {refsection}{0}\relax 
\contentsline {subsection}{\numberline {3.1}Point A}{8}{subsection.3.1}%
\defcounter {refsection}{0}\relax 
\contentsline {subsection}{\numberline {3.2}Point B}{8}{subsection.3.2}%
\defcounter {refsection}{0}\relax 
\contentsline {subsection}{\numberline {3.3}Point C}{9}{subsection.3.3}%
\defcounter {refsection}{0}\relax 
\contentsline {section}{\numberline {4}Question 4}{10}{section.4}%
\defcounter {refsection}{0}\relax 
\contentsline {subsection}{\numberline {4.1}Point A}{10}{subsection.4.1}%
\defcounter {refsection}{0}\relax 
\contentsline {subsection}{\numberline {4.2}Point B}{10}{subsection.4.2}%
