"","(Intercept)","TAL","C3H","COMT","FCS","CCOAOMT","DCS","CURS","TAL:C3H","TAL:COMT","TAL:FCS","TAL:CCOAOMT","TAL:DCS","TAL:CURS","C3H:COMT","C3H:FCS","C3H:CCOAOMT","C3H:DCS","C3H:CURS","COMT:FCS","COMT:CCOAOMT","COMT:DCS","COMT:CURS","FCS:CCOAOMT","FCS:DCS","FCS:CURS","CCOAOMT:DCS","CCOAOMT:CURS","DCS:CURS"
"",5.21032457922446e-99,0.242517609713201,1.1373710860592e-87,2.0766268936334e-34,1.01069684170749e-36,0.00480738941118186,0.0143317048330422,2.30189996709829e-08,0.74646205425996,0.446956350129869,0.659441585973177,0.23499444267581,0.939219530775755,0.444257463777664,2.4816055686136e-24,9.78183881408898e-26,0.576148536169558,0.000645459784070557,1.19460788445096e-07,0.00172790317245521,0.645823223384782,0.403928775023721,0.0399852663565468,0.451255352735106,0.538918664751287,0.169915510127824,0.256109169322407,0.382844496641466,0.790080051188068
"temp",6.59134396853142e-92,0.317119949728836,3.76313339921618e-84,4.76631735425243e-26,1.73327092315949e-32,6.59397847390934e-05,0.000604340156499623,1.71643293326642e-09,0.0199568067440954,0.837702231032446,0.324161428227615,0.553923604854926,0.526195072131753,0.0177364789724888,8.86268010890777e-23,2.79507338420009e-24,0.250825641321854,0.625056322836451,6.20109102938115e-05,7.85346440418408e-06,0.118809936038013,0.534147265842657,0.00157239137079386,0.0515042554665388,0.124857284138804,5.06011756804474e-06,0.96262652723704,0.848513690682935,0.789532576072453
"temp",3.26910944417955e-96,0.0321699728900455,3.0963771077551e-86,5.6192803087017e-28,4.76724855185328e-32,2.97236876483212e-05,0.0415720874629354,4.74427985851446e-05,0.594517172664614,0.272620415020271,0.519027576632466,0.256233444006253,0.599892471776848,0.163156750481158,1.81325014715619e-21,3.05500052232735e-22,0.0214534374048707,0.170270334130315,2.02766701667763e-05,1.2257123312064e-05,0.797716957881904,0.316247539024112,0.574252118031321,0.711670101530167,0.10146649411367,0.047370261006795,0.844385487594783,0.23391357057376,0.244635487715813
"temp",2.95762330987761e-92,0.0302010710130888,7.43366404844922e-85,2.56837905485144e-33,4.22193782008773e-33,5.9671255566518e-05,0.340853118736449,0.000225745175564765,0.989754846881811,0.856928771155138,0.631137194050031,0.477956310815425,0.101184867992736,0.0457812292521609,5.44139663896458e-19,2.30123060128828e-20,0.0800584445626216,0.0458503492882207,6.58633021146521e-08,3.94751073575145e-05,0.548518875513957,0.218991597571547,0.0156089633697537,0.0787490283394885,0.0861452331202359,0.0271308852471624,0.792883444182124,0.0692593938922812,0.497916979628742
"temp",2.0508319794656e-94,0.0408663011064631,6.77760214164797e-86,1.98226647596908e-28,1.55383262148638e-31,0.00016591134810376,0.210655752634898,0.000359121474713979,0.788418877429947,0.665150788169624,0.937263607179054,0.38374164089817,0.130917419518302,0.641775061789447,1.92517226430446e-19,6.42931886939486e-22,0.00313089111237007,0.594941597070761,4.26525915585285e-06,2.65447352709433e-06,0.925681901708225,0.31639464589887,0.0463472613938236,0.997928264881107,0.882270595654361,0.0381048752618541,0.878171479164122,0.203895901497676,0.730867627248937
"temp",3.93795860767059e-94,0.0218204213131612,1.6288955849157e-85,1.63361855756185e-27,1.45621410361539e-35,5.25855807396792e-05,0.0520509465313132,4.70977757825736e-05,0.98582257948684,0.591775779464209,0.882634780905007,0.847160465514152,0.0563310161917787,0.143964035486649,3.02441691266648e-20,5.00776003358604e-23,0.240080801621969,0.150803566218402,1.322278965198e-10,5.11311815321717e-05,0.0826199294450824,0.842553962439127,0.0258199161155229,0.489249431176557,0.0263981153868604,0.000712765162782064,0.694436841134333,0.266300831906309,0.749153441234281
"temp",4.39637784256042e-94,0.0468088954883616,1.40076727468212e-87,9.67499805641776e-28,5.62283605861786e-33,0.00272617794212091,0.0631208321831248,2.46663562596914e-05,0.828809600464526,0.803612461879162,0.735163557429122,0.32045373832401,0.0255318440061105,0.165382071394104,4.72152762051603e-18,1.95678633163992e-24,0.143066497726447,0.117795929874784,7.02806425582727e-08,0.001346639883697,0.491029872908227,0.149361850787216,0.0149456535160167,0.0679936861936034,0.0161249875356239,0.00380758228493836,0.803372607553431,0.0952554842202897,0.512787533562193
"temp",2.55168198090285e-97,0.169410581332566,1.50721000341904e-82,1.24599432487075e-30,3.9052345893646e-34,0.000774239762846026,0.1867472718432,6.28077566235741e-07,0.374471893321838,0.874993033179208,0.965772234597993,0.865216859778471,0.711387585328793,0.996625678144346,1.74042808762141e-20,5.31488481902053e-22,0.00559566166177761,0.0425449900574964,8.72006287209321e-07,2.31926494052401e-06,0.655883540480252,0.0861997344626286,0.0426016417672015,0.0308648529403918,0.128559688634899,0.000160295137702427,0.401457466610178,0.403492718295929,0.886287510255348
"temp",1.23109462954669e-97,0.16207031906935,1.33350520716114e-85,3.02070602845346e-29,1.95596366295944e-33,6.56315708495003e-05,0.0015594529485383,3.84961058364632e-06,0.924008663688154,0.292638087674428,0.253320893018367,0.337774276890153,0.14694152718491,0.300933425964144,2.80836423539977e-18,4.40080735980771e-21,0.00812445227358184,0.165536137616818,3.00641472236144e-07,4.89169398782568e-07,0.227226508787647,0.200976637608718,0.244039385059079,0.298761676281156,0.0631239901174962,0.0442231730367953,0.766635900120957,0.306726322727667,0.371054528052932
"temp",5.66267883444876e-95,0.0329090775326448,2.03204251498065e-87,1.0442832229727e-29,2.36459355107598e-34,4.22493895528132e-05,0.295465613005325,2.5977862661959e-05,0.890626170167452,0.974822774685275,0.974157255564088,0.183378310500434,0.0227825077827385,0.133062665176279,2.46721634536448e-22,1.36188554201557e-22,0.00978051596194288,0.314904553082515,1.41320177325925e-05,8.46079058560368e-07,0.808012779100482,0.650997781287768,0.0993809048081152,0.357597172714932,0.266812525010006,0.0854485627492332,0.77747565547368,0.804227552318456,0.581521408006451
"temp",1.65540835248927e-93,0.0791842715809898,5.73213100705397e-84,3.78156970722249e-28,1.92551673196289e-36,0.00832057620776895,0.173777574329816,1.52422559621175e-07,0.920824636988279,0.716306551356036,0.941283239643372,0.929076907569808,0.462366744999546,0.985629425852389,8.00868082094681e-17,5.74383188837718e-24,0.0166193294746947,0.516493173722944,9.57199440942545e-07,1.51658145379759e-06,0.260965450954699,0.429836556120876,0.0625944415664354,0.202873373230135,0.101738304088646,0.000470097649198454,0.249093061086241,0.499621684215836,0.946878069034898
"temp",1.81078577619896e-99,0.00163714804907802,2.59604669764017e-86,5.30047951431966e-30,6.64536656984751e-34,0.000264991808838929,0.00265994457508952,6.2242994628319e-06,0.102837126738897,0.60910682060373,0.934981993969969,0.0353564789038842,0.190914912167634,0.0793576775495041,4.59778143884553e-23,1.23495803832038e-24,0.000567638778076915,0.0566564762385087,7.30410992600412e-07,1.35069825771557e-05,0.438376802239769,0.0493169811887023,0.0254504669572229,0.748681927234037,0.141833047149678,0.0861481846746827,0.884895132974232,0.0206133877882382,0.259851825370636
"temp",1.35831499871588e-94,0.0319818052606736,1.79872435511533e-84,2.84519603887627e-28,4.49282254612537e-35,0.00284770493509118,0.17681035618322,2.47543201011073e-06,0.616281575641472,0.257496654190368,0.909535092418642,0.849861086088625,0.279530818116239,0.118294236463701,2.70498343565044e-19,6.96306152296165e-23,0.105178390132968,0.0157893592968121,2.67692148177762e-05,8.14219766742941e-06,0.692293156751137,0.176741518690142,0.275177558977419,0.307839816369866,0.946092829200051,0.000225510392344481,0.591576413670857,0.803724193703889,0.865742565159586
"temp",2.97474896821418e-96,0.00281903028522977,9.35367284994536e-85,1.48773690494523e-29,1.28035441222868e-34,0.0243881411413857,0.0651896892333211,5.3281095279407e-07,0.935249637780559,0.953286707385589,0.6663487636641,0.999360850845552,0.0869798694868922,0.55877977124976,1.42638393284594e-19,1.12046741586709e-26,0.0483132432450883,0.255552228904256,1.70340081985236e-07,5.83804033908517e-06,0.212546001191499,0.766671103757445,0.020584439036888,0.134209921720959,0.0296124446832336,0.00287481624450683,0.179850233470959,0.0185924042862084,0.841380156153494
"temp",1.8904571878336e-98,0.904860049939592,1.1169507951807e-86,3.98963644300442e-33,1.44290747916935e-34,0.0218774764305676,0.00618347269501911,6.27403143436869e-08,0.205682451331165,0.785888506980972,0.356115902899327,0.109645923065638,0.4649838893259,0.473447703494159,2.64740563466352e-23,1.77030426579176e-21,0.169142646307731,0.00879118596652171,2.33935687471692e-10,7.42204138850936e-05,0.750892109625327,0.0776722231770745,0.09794834177532,0.62206690950079,0.794319697015814,0.0344009673778018,0.390040354182788,0.793083031306238,0.903217719063516
"temp",3.67811178565451e-96,0.00369140539886925,2.53775845454089e-86,6.46198367650229e-31,7.80962247315635e-35,3.0922311503705e-07,0.623637374779014,1.2947222229683e-05,0.145073698385398,0.767352532238032,0.162486890528203,0.541021713391989,0.077285438628684,0.117020431042421,2.99289551840445e-20,2.61822112631548e-22,0.608952732722121,0.000555468044471623,1.72287663737315e-09,5.24986178675471e-05,0.769872870902583,0.603290097796357,0.0082010304364455,0.0132463471275314,0.00128990927676798,0.0023672242833097,0.579759734317747,0.626011008993997,0.846161713428752
"temp",1.20057271204546e-94,0.225759592506566,1.37190975520975e-87,7.37001470579421e-29,9.07416214882675e-35,0.000642262852086077,0.0332930978767101,0.000232320400572075,0.499480444222129,0.643868165205766,0.707666555273095,0.361199948502696,0.0925611962352048,0.274240589662109,6.54182865073166e-18,2.90953654473684e-22,0.178412997692548,0.222850851350849,8.72586152121516e-09,2.28986250480669e-05,0.815081688538288,0.470733761434741,0.0100571679611346,0.0615013700181788,0.144265566627352,0.0102182486250605,0.82528031606735,0.645979936978689,0.572082078700191
"temp",7.12808839236862e-95,0.0270780019510033,1.81819203678443e-85,2.79752108398495e-26,6.27525380466147e-34,2.00799414275147e-05,0.0030939752822892,3.61169647475823e-05,0.849333350033386,0.102350290734335,0.442883535599137,0.399965802638518,0.967955137975772,0.0469582664357709,1.15490246627399e-20,2.05239842418862e-22,0.0152904210292652,0.0567341847275989,3.51064308381114e-08,1.56390907182873e-06,0.644132525443043,0.292847854612241,0.232419638737274,0.198523469546233,0.27512439845571,0.00409774491635604,0.210098600042185,0.335042675668426,0.759290846951272
"temp",2.49677628384487e-94,0.0422494913251158,1.0582432234773e-87,3.46265495178874e-29,3.90520558699502e-38,0.00255263240150553,0.217521097705907,1.06914343018113e-05,0.718938342037976,0.165972825358395,0.698736419635712,0.438405275832315,0.282810149571038,0.285663038038203,2.29287956318295e-20,7.16710197163033e-25,0.0989217245671541,0.150380607721465,6.63522805958893e-08,4.25045577129974e-06,0.262378704257072,0.112045154166332,0.716949280045781,0.783503201250308,0.506604038249479,0.00229504093097238,0.944579644859311,0.427437281235623,0.540625570852022
"temp",7.17484525912886e-96,0.437117339944715,1.22320444684485e-89,1.10760273801562e-33,5.39674417320248e-36,0.0394651347873219,0.000950791342792959,2.85171103845436e-08,0.430031412552118,0.159965484998513,0.671783863839817,0.392405608848911,0.514001776442272,0.500195833878501,6.35211758885189e-24,3.77570459877106e-22,0.165579736273033,0.00134193002451604,4.38791778130115e-11,0.000447387464514088,0.553003803637826,0.331115117376891,0.0244002397676033,0.963558771473839,0.595704196240326,0.214915250906043,0.979994350026803,0.374425172343213,0.281216243962125
"temp",7.27117770106703e-93,0.0516578763449396,4.22731948339403e-84,5.01410033498459e-27,1.37893562630993e-30,0.00065995269808285,0.0754207477068474,6.44967388682435e-07,0.969189868687825,0.70084566767477,0.990670979511891,0.891951762012668,0.765927883248418,0.269940040445164,6.68106950007829e-18,1.40896522870306e-22,0.314951500973295,0.00812101407557201,3.44921462786468e-06,0.00104862775593257,0.441182415201467,0.75072359623771,0.0451356981025417,0.206113045302614,0.31042773074761,0.0267483496514144,0.516622861845723,0.0918759957191261,0.650828646527185
"temp",1.33574744601473e-90,0.0368813047559753,5.99182082303324e-81,3.26795849553174e-28,1.95744723311841e-28,5.70030065299476e-05,0.140699170665078,6.13754530151546e-06,0.851751000740418,0.75222437691654,0.745176262957238,0.901547853067592,0.289252654591337,0.161729777926115,1.46914726330931e-14,1.53820615923786e-21,0.136902765385235,0.0551515163485596,1.49345896450369e-07,0.000713733707871181,0.397344984451911,0.908093705318435,0.225015063866425,0.06628223093674,0.0590612385380023,0.00277570592798392,0.520910474095966,0.344872400190567,0.805963607597196
"temp",4.44738790985179e-91,0.00842477708162725,3.2409772718089e-86,9.94687353207059e-31,4.36808819249723e-35,4.86972526584664e-05,0.192726761987848,4.62613687837609e-07,0.804813186892696,0.29195449504364,0.8062171343248,0.811115782991894,0.364901666115106,0.304614505527974,1.51062684827719e-17,4.7385204021765e-23,0.315581796859363,0.0324814451369053,1.78137090893017e-05,5.26401865038882e-05,0.375882535012982,0.995624027339066,0.0511676561088425,0.135812394059201,0.0908483447628523,0.0324606992138823,0.744916738423522,0.286499742513139,0.876250150922126
"temp",2.9311155679782e-94,0.0612164522510931,2.37837419731034e-86,1.32817749121485e-27,1.22345995135156e-35,0.00775820671552753,0.0532128346205514,3.74513742382647e-07,0.833989775697433,0.929604589618589,0.939115168681333,0.512663504892924,0.119162065995711,0.200898646713514,3.07447647466522e-22,2.84050428710942e-20,0.0309212989377034,0.483332214894602,8.98241774232055e-07,0.000204543847764124,0.718639232509432,0.195175105987175,0.199571728772897,0.0629685720684871,0.402310851561114,0.000170595065256245,0.988332299623141,0.310412395663391,0.558555759675765
"temp",9.77650444663177e-97,0.0454106983038779,9.51040023968239e-88,1.48578671451052e-28,4.99976953218387e-34,2.71152827025741e-05,0.0913678966048038,9.42532045718305e-07,0.248502098422488,0.887085310179468,0.975594893979108,0.0292354075600062,0.100010551985683,0.0219883058220914,6.65011220360695e-25,1.3217111461158e-28,0.000515827923086018,0.522684222818546,1.83068361422857e-09,1.59751047287907e-07,0.327855567129201,0.105850757793851,0.00617617890812595,0.475712408054005,0.969497673616013,3.6231581777817e-05,0.974418418007088,0.0387778405309076,0.0238082047048144
"temp",1.89049669238272e-95,0.0949267997868182,2.89319722291631e-86,9.8971527808571e-29,8.45290352755453e-35,2.45736449682786e-05,0.221691695311638,8.98580798510474e-05,0.596184678088814,0.923162214685826,0.87338428450796,0.585379897413951,0.274991422138918,0.436020005312388,1.48462289946542e-20,5.80544090243212e-23,0.00240329104109466,0.459204566387437,1.25425973497929e-06,4.35062000509374e-06,0.911164737342447,0.31715697785475,0.0388907802758848,0.6751647950378,0.479458974154392,0.0824498404480574,0.729998199169303,0.317530502745815,0.773711390350845
"temp",5.40050438699607e-91,0.459216145932497,1.21219588579283e-84,6.66418137342836e-28,3.24799968004408e-29,0.00143443268174234,0.0157022544600956,1.56674030536709e-05,0.187043403241495,0.478125096578607,0.566949753701982,0.446864392874366,0.00987360485720649,0.267491782747144,9.00781810233702e-18,1.06477811576454e-25,0.0652515353145393,0.66258781006641,1.17633146225787e-08,1.42921397369598e-05,0.895642488331626,0.609577786489,0.0989752502878443,0.108673594213787,0.0149495312456918,0.00487638760250175,0.936844792874826,0.887782637037188,0.497930411042752
"temp",1.70626391412303e-94,0.0113383272852915,1.74734996585782e-86,2.0677736680612e-27,3.92299623714027e-34,0.000204683598866767,0.0731248278660979,0.000111973606769894,0.869615277173096,0.478762797770799,0.942136802344514,0.781548449867559,0.138497214986917,0.0546186553021368,2.28054813638102e-16,1.52516778453319e-21,0.0473588058045087,0.156332367463764,1.18003931617791e-08,0.00149576168454605,0.900845674439776,0.283111055547011,0.0536695054471549,0.178739867201541,0.277409719385526,0.000666835307661764,0.683634021301541,0.495166464535274,0.892249160123652
"temp",8.40137073883351e-97,0.1698424700308,6.53727319867215e-90,8.31404057811757e-29,2.72676419644173e-29,0.00288002653506793,0.0774952910259529,1.05940728656912e-06,0.785792347084732,0.770322387675221,0.95699130622744,0.159174702631197,0.0190381802688534,0.172737736986114,8.35300999810438e-26,8.64248466892704e-29,1.91383220152713e-05,0.90161716635089,4.03972232910699e-07,8.31617082666524e-06,0.651955452652743,0.0282357998905306,0.00818210829712725,0.674580996481875,0.0741831735890647,2.64132137070351e-05,0.364237023186135,0.00287181589476415,0.112682344000606
"temp",8.59402661876746e-95,0.0189016179409649,7.42817060059758e-84,1.0084213013029e-31,1.26408726485301e-34,2.26225897920064e-05,0.0204956122293439,1.16934073612863e-07,0.823382995129911,0.380201768255112,0.600197882332722,0.49578651385074,0.400941268472589,0.174968790854558,8.85140984259046e-21,8.73816739028363e-25,0.0383737106936038,0.00480698990059601,4.945211431886e-09,0.000677502045667134,0.638759628682493,0.815045411822154,0.0988430443057402,0.0847256299117739,0.519815474995876,0.24133230279093,0.544833666537416,0.249937673331368,0.384409920946186
"temp",6.25705518532011e-94,0.109652109172009,2.23719314531195e-84,2.26004085938481e-31,6.67996291075812e-36,0.00213131696330799,0.231426911289994,7.3440765695788e-05,0.37893090050742,0.635566580770215,0.158009772267026,0.296216808129659,0.462360618564556,0.192351103999581,1.5943569045525e-18,5.51586575682789e-24,0.107130483535623,0.0843875909595155,1.43998628078767e-08,0.000218805705852624,0.409270546893669,0.821334912203522,0.117732004019868,0.336502252146198,0.112428964723816,0.00405413509730504,0.313171115493842,0.292597768311246,0.679350017398338
"temp",8.06409472119884e-94,0.0417916693644172,3.16566846813373e-85,4.93850475103419e-29,3.45212516517001e-31,9.79514192836473e-05,0.34993960847057,1.91538752973653e-05,0.673002296087678,0.291811314885663,0.811618862454575,0.294907960256135,0.1344985970527,0.174497492323388,4.96344829370662e-21,6.12286259576752e-21,0.00108930840064893,0.638117676179813,4.93997294461556e-05,5.79753753662353e-05,0.360290776385628,0.0556708783633677,0.0698193696074947,0.793003884127122,0.457281370823371,0.0492870964640825,0.327328927258958,0.305636822293219,0.640274648579515
"temp",4.68459117581771e-95,0.395476504875116,5.86464560400624e-86,1.58385542195424e-30,2.75244362575701e-35,0.00326673950736883,0.00777337439043764,5.22577857096211e-05,0.20527512399849,0.973795149490664,0.567889874603513,0.798645183741648,0.209159937132678,0.208229456521024,1.69632491329547e-19,1.74543128959807e-22,0.0136317112686245,0.244186072196931,9.23766430902526e-07,6.87801154471808e-09,0.434448068644447,0.140303210742099,0.0333271862310295,0.0886016419011162,0.211006435162918,0.018860750625939,0.737026450417772,0.540863530059087,0.477636071646745
"temp",6.44458858100209e-94,0.0238357577122818,2.97812079616076e-85,6.72593498597344e-29,1.30584396112476e-34,0.00127348764322649,0.299095911417482,0.000399885348420687,0.518485420410284,0.485140801297476,0.502395133771018,0.39949634842443,0.221979083231459,0.375085653041508,6.26204353141122e-21,1.54859547324e-21,0.0270825919933269,0.20095598973721,8.27824463953359e-06,6.30518518318022e-06,0.374916292615878,0.224728982112546,0.103946050754652,0.486228106046659,0.398226978945726,0.00951677164236696,0.932330121095944,0.19434946187336,0.746881760566674
"temp",8.94848940407262e-92,0.114739818762669,3.09114316778491e-87,3.04778838286585e-31,4.91682094425289e-36,0.000128334705974635,0.280773327924914,0.000199511680229051,0.847367503257116,0.976899710357545,0.726277704899973,0.945626205912022,0.414552792991403,0.164697618727245,8.24081787262882e-21,1.04852201573318e-22,0.00420528827924128,0.332525118639911,2.89574323483048e-07,2.78294941725046e-05,0.629874770145648,0.530506176490518,0.241330877303976,0.916870626503735,0.620883015660359,0.0156357349668203,0.446985319694109,0.186639653811852,0.974060096596881
"temp",1.03514713606606e-95,0.476599740599729,4.18630973449866e-86,6.52381250481459e-31,1.71203589203143e-35,2.33099461414962e-05,0.0933865472338118,7.84969091014333e-06,0.987269619682562,0.0974238275803017,0.831903297140323,0.261864743778607,0.0701048981886731,0.271157674120367,4.79026899935413e-19,5.95455330264208e-22,0.00293249347363948,0.181706211559198,7.00835711034704e-08,0.000216413280009093,0.932583914129371,0.168863940107112,0.817057856262489,0.73771344551427,0.31407654138496,0.00685433216739773,0.0987012257814219,0.432479916660762,0.594271891249119
"temp",7.46001925849058e-95,0.185066808262007,1.55491967972651e-87,6.76800089223449e-27,5.41238715135622e-34,0.000436999717929683,0.00768148142797642,6.36138061556072e-05,0.889440541351412,0.115144563405642,0.179941200830572,0.15891786539003,0.968540886929041,0.164347517653761,3.77118263420015e-22,8.04645928553201e-23,0.046288377271009,0.813526365785721,1.1262811817782e-08,3.95780981227826e-06,0.253096462556148,0.438892218845867,0.261655963462689,0.00876409791492683,0.43785424665203,0.00586294559282175,0.32440496114174,0.250812267021752,0.695613594890176
"temp",6.12268655734582e-95,0.331167550712612,5.54538544720101e-85,5.18839016100169e-28,6.53394044264958e-34,0.000618697277292954,0.274172908441938,3.40412044612381e-06,0.302431810738905,0.295523359375697,0.46552302220598,0.72136105311534,0.0554892321993129,0.15024711477682,1.74533490847616e-20,1.29863251064418e-24,0.131740163627336,0.220375625653867,1.81495732506736e-09,3.51926488877966e-06,0.61582262544519,0.501455643737815,0.0897051850758464,0.778405428781439,0.0417981483561396,0.0024752655705033,0.598594583786884,0.415194787026899,0.674831298555439
"temp",2.33040429532869e-94,0.00568154104884699,9.62130272953344e-86,7.68228152171314e-33,5.14972456816383e-36,0.000183170244013898,0.223645743038124,1.93262426935504e-05,0.267817247752077,0.425240661915718,0.650101916560526,0.236924336404806,0.191739935553223,0.0827280179565926,8.32782101245926e-16,1.87407669965963e-21,0.114142892843761,0.0334896844280366,1.54845557093148e-08,2.46845470822972e-05,0.803166698056828,0.406354636454739,0.0744759692725594,0.104072793139253,0.157874283913925,2.08796386328886e-05,0.506657690361245,0.480399841318885,0.996453289812242
"temp",1.64866115381143e-93,0.378941257502591,1.02066650011476e-86,1.42914705651755e-27,4.00506504518093e-33,2.73755967110015e-06,0.116828949507044,4.9677190820414e-05,0.210275698065563,0.751495547930421,0.209237126571748,0.526458247270592,0.0870286950013664,0.00738475428298238,3.20620579576378e-23,2.35667838247064e-23,0.0166296096805949,0.615309844512385,5.5204317395364e-05,1.90790524387976e-05,0.229867046342113,0.14650670071981,0.00201949859076375,0.0692862833102976,0.958490435342605,0.0279296295421486,0.380804581175499,0.113405739703843,0.0157871407499943
"temp",8.81383818586697e-95,0.0563135580974844,3.51819991452094e-84,4.11254672204992e-28,7.10175168560326e-36,0.000932224374555509,0.139641330106079,1.74312023399754e-05,0.803864610394262,0.473617302524083,0.871411941723779,0.822972418584453,0.0833022541607262,0.368757450470005,8.15542140459741e-23,4.28180233048634e-21,0.0563756183079405,0.01597703650253,6.39704016611235e-08,2.9198027706746e-06,0.934831503305557,0.691865542764969,0.0870043304242149,0.48968565544508,0.0746070743393222,0.0151633873699616,0.847503189407112,0.422746098787736,0.840081613372996
"temp",1.33341049933338e-91,0.0880301652270172,1.2037772794916e-79,2.82918690506595e-27,5.98109578953485e-34,0.000456047907687727,0.0994659559801616,5.97415990084346e-05,0.878042366063946,0.704516937370415,0.914692138781688,0.748999863806825,0.253232436783766,0.242547852160681,4.9426529962144e-19,1.52156483794168e-20,0.071949797873528,0.131786724687111,6.75926424093891e-08,6.72343424964542e-05,0.923969398529838,0.353163891277809,0.235634295345572,0.049126082011852,0.037305485253958,0.000122452074040655,0.187926902086716,0.802576950584347,0.36958382565318
"temp",3.78294443284322e-95,0.169095415897212,3.68524045900914e-88,2.3167343635671e-28,5.22212795463379e-35,8.93690199364617e-05,0.00174048619305294,2.15960012312524e-05,0.357472577329142,0.120055981850758,0.417552487149293,0.23772165619924,0.220924336004212,0.769871453380975,6.44093005557337e-18,2.78551516717899e-23,0.00928287564355104,0.0479293608151008,4.07582047276582e-08,1.2084860160138e-05,0.841609359507057,0.82587891187296,0.178938580958604,0.179019590622154,0.0738377787848183,0.0639657191855397,0.454573060090855,0.071113296617524,0.195337365537591
"temp",6.48437888870988e-96,0.143432485831176,6.62227059714533e-86,4.32328170818506e-28,8.87963244662445e-33,0.000363572615282239,0.239558032870843,1.1234515815715e-06,0.560904646843568,0.217884178708141,0.93623769084112,0.957126614136379,0.213177672529086,0.299755773836652,9.79023298468242e-18,3.76447703343092e-24,0.0791996106690276,0.179576454872732,7.85586683534503e-08,9.2311588415694e-05,0.935836013420221,0.220368852086969,0.209547952311916,0.299903207403179,0.194589873302053,0.0239560193365322,0.334586079553826,0.307493705971958,0.403144701330367
"temp",1.70679865030638e-94,0.682484547426028,2.52374325125422e-84,2.67719226973575e-28,1.043855019497e-33,2.24889606906231e-05,0.188278876478832,8.47142330965348e-07,0.388033282495248,0.909257180483856,0.477879644148594,0.337877966833875,0.120730820065167,0.670256781594285,2.35103125365647e-16,7.45847583644532e-25,0.00359149697024325,0.419990246093835,9.54542981166901e-07,9.14603741455256e-05,0.817899709199009,0.325976309154291,0.71828850449911,0.70915003950389,0.960902787893555,0.0127819461467709,0.879243939806379,0.130846843840761,0.672901278804229
"temp",3.41304931637397e-96,0.0525016851985393,2.34756930069596e-86,1.06406645109277e-26,9.0606019257139e-33,1.19906868839415e-05,0.00535010657462987,3.90225849768288e-07,0.678009191423109,0.292557424272901,0.541784799445542,0.309625510332985,0.777349033559435,0.496235720442539,1.45730886043848e-21,9.75032858319139e-24,0.0443432400124151,0.0441161573737151,5.55944462799429e-08,1.7334108436759e-08,0.955880668530742,0.647202028696317,0.0702096197508338,0.0506350069752459,0.478299332818651,0.01074020288137,0.797589747325361,0.953608684962639,0.868237326978724
"temp",9.57171047895731e-95,0.327354973382357,1.50761029032898e-84,8.48639920844714e-32,1.44152979656693e-35,0.001057967553222,0.01077666607505,3.70506203648331e-07,0.992406122176362,0.461306041093095,0.537632845000455,0.588037139239552,0.714682940156142,0.611681408078276,2.45190142709812e-20,3.65406803538187e-21,0.0247606218867269,0.173291668082913,5.93316161627787e-08,3.09428284152182e-05,0.455831012241177,0.0333057149955454,0.00807532907697157,0.67230340757542,0.454386565425847,0.030944426152814,0.566333783574369,0.657404300699124,0.454651771246461
"temp",1.42165272791327e-94,0.0144537794234445,9.53005586752046e-86,5.65335547920404e-29,1.24846006545936e-35,0.00032948146693612,0.0996794414825276,7.69701459178928e-05,0.684049809034359,0.415185948327085,0.479586508457542,0.189883180285334,0.341868869324749,0.143238989978432,8.11436857198479e-19,9.38215156883318e-23,0.102409043338882,0.0489719643704314,1.36796101063044e-07,0.000189421054248162,0.959336960049947,0.065174720671312,0.318933632179423,0.375626102979309,0.111413217644834,0.00905966963351046,0.485344029488812,0.0320281122308365,0.599250513518185
"temp",5.74058039913194e-96,0.0881201593072471,1.89209316792713e-87,5.32414196189411e-31,6.2668038496136e-36,1.00060343644529e-07,0.11821446182855,0.000394993350806091,0.330182155422959,0.719301930141355,0.571607124159462,0.425369346724673,0.319284390337768,0.0155499437218769,2.14490389741115e-21,1.24173807023952e-20,0.000869415051670724,0.356643128791779,0.000327080270434028,5.94573343386971e-06,0.335764432456957,0.181359427838089,0.252163145013338,0.410362741993737,0.999834874522807,0.255678613615327,0.97791043895087,0.113121430793094,0.958155611248664
"temp",9.87146852182474e-91,0.0222747210176813,2.4404952722924e-83,1.73774678310529e-27,5.09466793916282e-33,0.0225060050129019,0.00639893373221916,0.000807285388003112,0.978266668831311,0.871607607922575,0.722779257381109,0.207997387900412,0.0243642948333622,0.874941851123052,1.61322331151639e-20,1.59748724700332e-23,0.0346221206195659,0.271015855788729,4.01646728663798e-08,4.14355487749653e-05,0.4651568624582,0.974582002042534,0.0212175967912958,0.193470499196054,0.0986805859238393,0.00564935151949082,0.364609561986373,0.393391038691348,0.897986924294461
"temp",9.52630467996269e-93,0.017524219577088,5.25213832129997e-83,5.74474335791085e-30,2.05710686643995e-34,0.0108658842757277,0.073697289004093,3.23301356616077e-05,0.777261459513153,0.152125218604239,0.850544859245762,0.864243697563847,0.710582593054377,0.0441944890199494,2.89968918942335e-15,8.89098767240338e-23,0.0784541799763177,0.0884351624760345,6.56063364197591e-06,2.04763774511052e-05,0.937445303627636,0.849590846991217,0.021501922572917,0.229799093355374,0.483239790564629,0.00712925210926618,0.763967088316014,0.868384997071664,0.897578786227422
"temp",7.31155815167258e-96,0.0327489616490309,1.85079723735485e-86,8.87847597848564e-28,4.98626355658866e-35,0.000948131397981068,0.0103382946604623,2.29301837238102e-05,0.978801606496936,0.734786398175562,0.989833227458233,0.742808831358932,0.218002393132085,0.355774208292294,5.37168706459915e-21,5.91169697923132e-23,0.0581588786148733,0.104947064198154,2.80121589118675e-07,2.39712499579707e-06,0.606900593262202,0.372883769693812,0.0145785537166375,0.199295033012178,0.282875171373588,0.0117992815760147,0.318328292137764,0.371632509472537,0.770953149284887
"temp",4.97216141457385e-93,0.943877194349935,7.079259127027e-83,5.2645032507763e-26,7.98160591084154e-34,6.57553470505869e-05,0.00604936164172843,1.32434432394618e-06,0.889351687697309,0.179058135592397,0.274122284000607,0.223355779671066,0.753293588845093,0.122173063407881,6.82815842438683e-20,1.29292107129435e-22,0.108747519926014,0.10889968030397,4.82853299719318e-09,7.48399219823032e-06,0.263877675925794,0.800958509284744,0.145248412287272,0.103637526364618,0.806315177414959,0.00809775060830823,0.898294157080833,0.191494583086351,0.909614961923259
"temp",3.11613212847967e-95,0.114001327578286,7.34929292282782e-84,4.06646192829527e-29,8.26941435191859e-35,0.000928641054515296,0.065460726616178,8.10931354332206e-06,0.772938709166488,0.542400740107071,0.501880753138265,0.892902321670239,0.329435575110171,0.196828502164291,2.82317963043196e-18,2.01805939936456e-21,0.108421915067064,0.393935119613623,1.3133972351585e-07,3.83149410754016e-05,0.597542314906703,0.239333426463347,0.104847202801053,0.739808610966147,0.148825211491974,0.00880245994229269,0.984555018499203,0.600812978811948,0.879246029334307
"temp",3.72233218951577e-100,0.0223352505236542,5.45013246625298e-90,4.13698972634531e-34,1.83417644103648e-34,2.98757185824913e-05,0.00388999756001067,2.81364120803793e-07,0.477302576511692,0.361428140545941,0.383875135672939,0.620824659472241,0.990029326168209,0.197806073582937,1.16884910907766e-20,2.30482791016676e-23,0.0436674768771683,0.00833633731356096,5.75934779176448e-07,5.78107033397509e-05,0.597236035659615,0.175520822502788,0.0342939885053382,0.549688821324019,0.0453469139382048,0.0338260653309833,0.149162818205941,0.121672621727416,0.404178401946111
"temp",1.77806684159599e-93,0.215830013519314,9.5825550971495e-84,2.21967453396735e-29,1.7182828386459e-33,9.59372607299947e-05,0.140226082341395,2.1482525596869e-05,0.261577753970757,0.723541721075126,0.705197640957446,0.593731745984973,0.203996880875038,0.386712139167201,3.05555250139155e-18,2.35262244078636e-23,0.0803843726914149,0.0954309052820086,1.85826223188846e-08,5.25162437091562e-05,0.80042677990039,0.794928907066786,0.217563294425522,0.520548881816124,0.070889516634546,0.001950184376115,0.298843800353345,0.620111025941473,0.626440637070534
"temp",4.04673307238124e-92,0.0520549550841429,5.98087543165616e-80,3.8947156795522e-30,4.70300769696578e-32,0.00229883500069998,0.087323505437141,1.63303458385403e-05,0.797423854577617,0.561659569193999,0.316175649693902,0.617354193424779,0.160621324715946,0.242962354008566,4.06146716670197e-18,1.81375626276003e-23,0.124347461455416,0.344129845109389,5.10477351630036e-07,0.000182208309994629,0.309703573422775,0.466582631719549,0.77634869926029,0.0448756473532353,0.120432400353158,0.000444750419500036,0.586741571217842,0.698696988083071,0.833022494178906
"temp",6.09853269239604e-93,0.179101557929647,6.95775261988248e-85,3.02018335564579e-29,1.71242221742521e-34,0.00184642784109112,0.0880813633703969,7.94976675310499e-05,0.848312841712059,0.802652436114183,0.864741640703352,0.523257258840293,0.0309797224291136,0.0836414002068166,1.07805450425196e-22,8.44792452252213e-24,0.00365372526663972,0.32227944361816,2.11752746728022e-07,1.46674114993136e-06,0.388598758652819,0.633383950458656,0.110287288627915,0.519785684954475,0.379610045735045,0.00474013787594881,0.415101802156578,0.506032979490961,0.563820393333284
"temp",2.98871873356053e-92,0.120271135878263,7.82617112831748e-81,9.09082317081356e-32,3.26536054819184e-35,0.00205694202514637,0.249038301460316,4.58626372579103e-06,0.618623140474504,0.606701729783279,0.493198035004878,0.746888847887609,0.188782830001768,0.130565897926375,1.52404122186885e-20,1.31210205742157e-19,0.000969156417045612,0.0252950537218117,9.51704356650358e-08,1.56233808337274e-05,0.582375739391108,0.49640442321511,0.0942423110006833,0.253423103101337,0.812781640932987,0.00434540757563649,0.78330378994589,0.91448340737429,0.403201533743997
"temp",9.93814977268472e-97,0.060486815636228,1.48194083531306e-88,2.3813206334299e-30,2.89803451896502e-34,0.000479434685905887,0.0187032189383623,1.00543466560812e-05,0.632754986090621,0.960267196385875,0.763413686076493,0.463146195848401,0.420900204816539,0.11324056348705,2.89906219004811e-23,4.41629066869272e-22,0.0165056930404848,0.0425991958087912,2.02281251146775e-09,1.22813424545997e-05,0.743421046666804,0.366548885715569,0.132428735271192,0.695735718805612,0.619788140511695,0.0283606898843233,0.0438577369238223,0.554583393020173,0.318938263208127
"temp",4.66498860747509e-93,0.0187755275703998,2.5653164328389e-86,3.16253754504344e-34,5.24303789967243e-33,1.94080920308017e-06,0.524037781315748,9.2333179546197e-07,0.546810399746465,0.815507055552456,0.535570643123851,0.160924216823151,0.0128368941568979,0.221488557073849,1.01395936757235e-15,3.42204303767501e-25,0.61153655599368,0.00819002623401142,3.03128791001779e-07,4.27691300196754e-06,0.432439338550389,0.861816929371525,0.0291716194146619,0.00906198021762836,0.00146603046349074,0.000863561235224079,0.765480649828135,0.639747297334555,0.919715699916347
"temp",3.77370341226686e-93,0.142058252363611,1.73316845704548e-82,2.58302785257045e-31,5.53695810433702e-33,0.00341932094372668,0.649891288108239,8.63589290826247e-08,0.487046774803864,0.472878841056274,0.38471013950685,0.994153651369267,0.792239325833246,0.22562120447929,5.13470793366092e-18,1.06092323950726e-22,0.0933314099948961,0.321071962324393,1.85926667415113e-06,4.06652954283713e-05,0.876399693117992,0.710879563751733,0.0176720353728533,0.177132852477236,0.109415137739794,0.0366024026936555,0.244352281840485,0.154796344992148,0.993085697995338
"temp",1.92307626702976e-94,0.0281981098024122,1.82231829991152e-84,9.3008515163326e-29,3.83637767486858e-36,0.00654281493634166,0.00820081976507891,1.37372102750153e-05,0.856466728849464,0.888441262183923,0.982033432211134,0.916407820485195,0.135701645926199,0.24662604421057,4.1475401450109e-20,1.06191461087463e-23,0.00622427082108248,0.118426501856453,1.23335234481201e-07,9.31921701886181e-05,0.658906741267817,0.709702256562599,0.153018079045911,0.522288623169934,0.515903087053041,0.000284576591373158,0.83130801486311,0.923768698352959,0.611028192598847
"temp",3.7412870881679e-97,0.0950428697341546,2.17975801066181e-88,7.11660126665397e-31,7.68533962841326e-33,0.000255766941159199,0.0373435729833631,2.15464894107173e-07,0.157526584623327,0.946959772900444,0.259496697796767,0.23017691974008,0.518661026396902,0.605492374057783,2.61599417341528e-24,7.6370668622951e-23,0.166859239590146,0.0051193571435423,2.39294741273087e-10,0.000832767040657684,0.355640212554884,0.249397419576007,0.00468517775845918,0.29079596244254,0.207181098130628,0.0306325040688177,0.151797566976818,0.954543057550484,0.458708657252596
"temp",1.19155340298993e-94,0.0814080489166326,1.31502911282982e-83,8.90321971954354e-26,2.1226112373415e-33,5.96366164443316e-05,0.0175443042741844,0.000447717222863955,0.78226926016123,0.901676858879679,0.849030467585235,0.768207389903297,0.886104421865956,0.177184187371666,9.21635345774848e-19,7.04602102248568e-22,0.217888973943988,0.107695893295305,1.27860427461246e-09,1.3591820702481e-06,0.159764504295585,0.099809367541616,0.0177841605459782,0.0815393278448961,0.0808254703272843,0.000299004414073449,0.722265693250869,0.829310538116726,0.914413200822861
"temp",4.01597061358588e-97,0.201327715670682,5.14967671117601e-91,1.40608600096975e-33,2.91366445511533e-36,0.000688861263849439,0.173518476902052,2.22489024193289e-06,0.502531276836337,0.678856628094827,0.635889561810387,0.74975381326811,0.0984640398725702,0.192953851290678,5.56104630447847e-26,3.79806349223997e-24,0.0278397151535397,0.0151129537630266,1.61046801479074e-09,1.46708903365509e-06,0.914344462117604,0.390701263322522,0.0295872631442486,0.979251797020731,0.24309626438108,0.011964066889373,0.454379650759718,0.84522382560476,0.26330939179578
"temp",2.49698555950971e-93,0.0505906205117785,5.30465184110734e-83,5.09809607510597e-32,1.99771265979722e-34,0.000111613106527959,0.30091277027038,1.63976594985081e-06,0.797978473555777,0.952649546475513,0.644459280048497,0.485814475852616,0.412202999184592,0.487851789115739,2.29921493929175e-19,4.56212898880051e-25,0.206239479087577,0.0441842431008893,9.92010102786665e-08,0.000328379573628048,0.308213996265928,0.760011086361585,0.194133658333277,0.336483720392213,0.178397452334923,0.0598176567315565,0.440306462357641,0.0686829130592107,0.87629919047544
"temp",1.28942500635357e-92,0.555401687623255,2.22432605958775e-83,3.36979659067865e-31,3.8024852676865e-35,2.3778682717374e-05,0.0941857917367338,5.13650802057626e-05,0.929422540805241,0.94088638150774,0.52670961284247,0.829611754734984,0.276574944141238,0.461491655013558,9.78056836265513e-20,8.54655941251729e-25,0.0218917450852345,0.0415187480863306,4.30127210410038e-08,0.000268503601399725,0.666535683037093,0.840461561234376,0.534370757492064,0.287223722280848,0.380095819230101,0.00779970481094855,0.534139009366544,0.414778379800207,0.610344253746047
"temp",1.2859370954518e-89,0.123327405733202,3.56976103758144e-82,2.66836540173546e-29,5.21119207763569e-36,0.000341446875545149,0.0914271460284623,3.13086330107883e-06,0.706536394954042,0.83589783101595,0.778581105415795,0.578092312789497,0.454985695884931,0.328146962814922,2.25541606410837e-17,9.12404249748441e-21,0.00439077353056964,0.21385466295529,2.74224978545029e-07,5.08531947323984e-06,0.559797528161554,0.310401353564405,0.0960548505356097,0.259706325226044,0.239880582616541,0.00322305268615216,0.21719346450023,0.693262418657526,0.89373207071319
"temp",4.66636102212928e-90,0.0435880279192927,9.64594436134648e-83,1.87360516272016e-29,1.03261000784001e-33,0.00160495488253859,0.208923873660299,5.75033515360118e-07,0.896195731319136,0.826902974207016,0.407353351323449,0.891848177220424,0.390859658667905,0.139711005333273,5.58194525382939e-20,6.76283668231032e-25,0.0570429280612935,0.0633885800000191,9.55698996099837e-07,4.24776996806896e-05,0.796524485837459,0.835460688705214,0.0941885690582999,0.335400120738317,0.156614758620206,0.06184205038228,0.784903726177601,0.20900055907933,0.713852899265767
"temp",1.86223628781309e-91,0.0203280134651502,2.66049108288144e-83,1.92153587759686e-30,4.72914387899535e-33,0.000940965604524294,0.0367480228058765,4.71630731846402e-07,0.461502061123449,0.662866439545956,0.350263388798275,0.794512374974123,0.383190488338361,0.313209398848906,1.27097285805546e-18,1.75563772607016e-22,0.00447738552314793,0.0162202117870821,2.02270296653574e-07,6.49079930683355e-07,0.433037555074032,0.928165725274146,0.505932485252968,0.192871148076014,0.209819102439153,0.00114849052646618,0.617222702672626,0.973739729889405,0.309895437848895
"temp",3.43381204751952e-92,0.0101980797053264,8.36434172067373e-87,1.59164131891022e-30,5.95086615244019e-37,0.000211971054276009,0.21650050328588,0.000730164325817916,0.510422215828892,0.414014136422653,0.541826963434366,0.314818338118294,0.22524106228781,0.0484297702585971,1.11399154205628e-18,1.69638794826696e-20,0.255669125393532,0.0168393078058881,4.22779010314875e-09,6.14251703440986e-06,0.629577750498612,0.0302902672341822,0.269405578911051,0.452561788259076,0.123956893343511,6.68138586978622e-05,0.886128712404274,0.524131178736914,0.849880135095903
"temp",2.00644415688653e-94,0.048884772415418,1.88189691843898e-84,3.04332854600591e-29,5.9025619159029e-36,6.62120103955539e-05,0.56709727397823,9.25695789620679e-06,0.448922500074743,0.639836191090112,0.921032400411887,0.119202524521034,0.0801819392769048,0.0922302746878599,6.58474286836885e-21,1.12230042433661e-22,0.0242102535308958,0.0477270170523968,4.61623231537675e-06,5.60851136671924e-06,0.322462441505067,0.97063463883752,0.23310244685428,0.112930747883261,0.0637457515899834,0.00699021046602065,0.379716710492574,0.368723317836771,0.19692359024369
"temp",7.26367535020229e-94,0.013009074817033,1.73066769971213e-89,2.30800723793571e-29,3.83385787108652e-39,1.06065996030424e-05,0.581033529699034,1.13594337590797e-06,0.128012286957676,0.192831899914008,0.363752631950675,0.111540542186721,0.0401956216549392,0.276733444707899,1.91581278144659e-19,5.10556222696053e-21,0.0254542008920622,0.00335058596779513,1.88082855659518e-09,1.61421965794738e-06,0.323581234796668,0.371115842886513,0.0373172140649924,0.0517129397763194,0.125274899184075,0.00136968210482133,0.927530598442123,0.460923764547385,0.420488776753526
"temp",9.10137457058022e-96,0.0144519698984473,3.24283691931079e-86,1.61298571879152e-31,2.3539979913052e-35,0.000414786670161647,0.0529583754213698,4.51770374569627e-06,0.738124719040409,0.711368859739186,0.5310860832219,0.67468813374404,0.834184795255921,0.183963979896414,2.72341437798093e-17,7.07879560117937e-22,0.0204112196136256,0.197597541766645,2.57380526804899e-07,4.1789061905517e-05,0.989462297865877,0.49561528119432,0.00867627718009758,0.0337927960827724,0.0600953685246337,0.000338557118274669,0.932541665588367,0.348188907804233,0.92617470206982
"temp",5.50122136138924e-94,0.0449322822756155,5.61615008551734e-81,1.79090374603947e-31,1.08762738677377e-35,0.000241564835455884,0.0864059430442846,7.42321980938241e-08,0.781504920927423,0.244018042332099,0.746094522198386,0.673080062074908,0.913158687636268,0.340095345484725,3.20029086505011e-17,2.86078126660838e-21,0.055698657777558,0.186325088945537,4.75906589368151e-05,2.02469104164676e-06,0.814366391754146,0.26004925538133,0.00811862548439751,0.114318975864148,0.0161882011403804,0.000461117750412487,0.480365549537472,0.614303481013756,0.599496144878783
"temp",1.52813716903286e-93,0.0731905549736969,4.79182377039666e-84,1.88573517057338e-26,3.09128395577258e-31,0.000123120655931453,0.0393968318559299,4.00753799337835e-05,0.702008994965833,0.980654761273516,0.688978520588339,0.694326590187147,0.707576035532411,0.0979161514683926,2.17032176693156e-18,1.27686821347795e-20,0.00218470244282899,0.218758025685543,6.95941230005338e-06,0.000524078680296927,0.716792520040231,0.235645928003056,0.300882371276346,0.716057510679706,0.094876713152324,0.0412350507097099,0.835745270171715,0.081642889778396,0.924651633490174
"temp",8.24584883336073e-95,0.0719640279031087,2.10933390550276e-81,2.89126703532352e-29,6.88900075384291e-33,0.0007977088617604,0.0516457313799758,2.68434494758816e-05,0.898304992616913,0.991466566669614,0.406803757001063,0.576014626219829,0.324086638133542,0.0942350886018873,8.22069184164897e-22,1.08588914170467e-22,0.0265419053302293,0.325181752447753,2.63750895484267e-07,5.11838386801543e-07,0.558801092679319,0.493640552332337,0.140881234073115,0.238589962051964,0.266060180476995,0.00416786785511812,0.973362191746322,0.344269396255555,0.43886532400532
"temp",6.99525332296668e-94,0.00440526437313527,3.26426319398323e-88,1.70597783231901e-32,1.67125732208411e-37,5.25278104393959e-06,0.129335968147407,3.43562350209328e-06,0.0770463369252693,0.931211741059397,0.212607437399382,0.916638982390278,0.109690019253669,0.494063781686204,2.59142835740647e-16,7.57414610791676e-24,0.0726260222595281,0.0542483461976935,2.21693551890469e-06,9.92855275972304e-07,0.853802382852338,0.0676051689826859,0.0847366590274895,0.0343222054865057,0.0787559560367316,7.11963619146422e-06,0.13799967272524,0.0972789338360703,0.500222686727977
"temp",2.10397840109805e-93,0.232414061356147,1.08958306911636e-83,1.75364185620069e-29,1.57354766329134e-34,0.0188723909616815,0.118359056303525,7.93880144715266e-08,0.474804653175512,0.64078575553619,0.966583143661064,0.588318313609824,0.419016033721189,0.533079120245854,2.4909835788108e-20,1.48711503795859e-19,0.00121503879958069,0.0894994869484083,3.45303963461106e-05,8.72944220818484e-07,0.700920078219253,0.110304978092473,0.073395851437157,0.0482743166801686,0.172530224798753,0.000134921078131036,0.908093898034864,0.985477010045694,0.768585505880319
"temp",5.62408773991163e-96,0.120745833573863,1.28486961435739e-85,1.21049153431594e-31,1.85534340250769e-33,0.0118992057174812,0.0328857963619841,3.47434896338401e-07,0.59944994514502,0.728202848137393,0.30260502943311,0.520391659209315,0.413385389742047,0.740530372131219,3.69798152451396e-23,5.03912794327548e-21,0.121141586786408,0.0356818073664238,3.42003061817397e-09,0.000321274977093694,0.695433265939165,0.0825862530325415,0.0667128855255184,0.625943423857356,0.960942286372741,0.00572369107968433,0.650013306420352,0.758034264789497,0.246042087465907
"temp",5.75791022314729e-93,0.0464977860574147,1.22032804828919e-84,5.99421455773552e-31,1.54893394190967e-35,0.000359429312446187,0.0231373913849663,2.24327837349338e-06,0.479122234179457,0.68991431390301,0.839392457750982,0.877302699159972,0.266458059412441,0.485873552058601,6.04150898149923e-20,2.67247290543302e-23,0.25886683736742,0.268031452588035,6.17984492768651e-09,9.1110556701915e-05,0.918594809882705,0.968899997666612,0.0831563503227066,0.968045750124812,0.0964294796733311,0.00475227774167005,0.945332920932926,0.344562072213696,0.66334523384762
"temp",1.25147488138245e-93,0.222631495807357,1.20596506941851e-84,9.3572508666198e-27,8.67929457107642e-34,2.30978238001576e-05,0.225195158955188,9.83896308635464e-06,0.979644620518728,0.976726109355987,0.98884874933358,0.523212371883223,0.304954179114099,0.402022003184053,2.58848130564252e-19,9.42883839273842e-21,0.0801424061100693,0.0835598722653283,7.70924581004314e-06,0.000301800863588634,0.449798724335423,0.826687143291121,0.181811807964113,0.303087535679377,0.180429106663533,0.00274753084667033,0.957738218223735,0.711635208945015,0.362178033772663
"temp",2.40059860130499e-93,0.34890981095393,3.40702100106604e-84,1.78115941047271e-29,2.93161297989037e-32,0.00137946466730992,0.0397764269631233,5.2738626514278e-06,0.913613078609497,0.211733930818325,0.7004125359361,0.383120856665879,0.230594303084052,0.646643773274105,3.42056664789847e-17,1.98909313403193e-20,0.0177904530937007,0.214484977715225,2.11867240466853e-08,1.64235559154921e-06,0.758417391461389,0.473772994338021,0.179423590571614,0.170226261345639,0.184998306309713,0.0571548034611001,0.586856195198731,0.632634061376141,0.732742154450963
"temp",2.93492848136159e-93,0.283067868400857,2.67446487900287e-82,1.51200453718327e-30,2.9929372576498e-36,1.24834432755276e-05,0.0645542700522704,8.23393861338079e-06,0.990534517128002,0.495161153527066,0.979636213407687,0.53851531601381,0.147149927088947,0.140508834353004,9.02934458856982e-23,3.95031584365275e-24,0.0747519950203298,0.157157986870602,5.47912297993307e-07,4.07425920343772e-06,0.96604327385193,0.910645675025821,0.184379521077691,0.283860742872554,0.468315685704433,0.0277736882344295,0.73518327168307,0.889543977223719,0.895334685920068
"temp",3.64798522586536e-97,0.241572437718799,1.57734880722787e-86,2.14856799352625e-31,2.03157580722712e-35,0.00231337616922318,0.0694085396691106,0.000160665562502193,0.909070724160993,0.844838324093674,0.493544291241989,0.683402590838064,0.105497536662447,0.708452373741316,4.9455683831433e-20,2.98152854959213e-23,0.000691082462942628,0.659405657630865,3.98058361078981e-07,4.90983794708389e-08,0.642189448925236,0.66214428038876,0.0566244856393671,0.33585671995667,0.147773953913089,0.0060166591626111,0.312179487540035,0.722850550370068,0.443861883043188
"temp",1.97658743082378e-98,0.32661273777415,1.66418267235288e-89,4.33889182141725e-30,2.67006156324164e-36,4.07562134125496e-06,0.551788763905628,1.83354813105037e-05,0.142969599365816,0.969224516056095,0.833482316814545,0.0642593593013431,0.00412841149376274,0.70055103324845,9.20775312032103e-19,4.90192351477899e-27,0.0395174458140226,0.64972560781885,6.44967076715411e-10,1.74295298327043e-06,0.572489461039864,0.264546587955928,0.895569389113218,0.978032660296718,0.787700202295986,9.7455437186702e-05,0.188174849634839,0.89670648599933,0.974445629505246
"temp",1.03244478248786e-97,0.896876789172522,3.97625590363262e-89,5.44821687607374e-34,1.70553194441285e-36,0.001495052383986,0.0100267457497677,7.02183934277742e-09,0.579974239434735,0.861827381494626,0.17284939891736,0.601058499254391,0.419152212445995,0.450666055664235,3.00885056616202e-23,1.61864907501656e-23,0.226604809513968,0.0224275911561793,4.74530004595265e-11,0.00247090347460722,0.458701737341914,0.248511553852109,0.0255102014158264,0.592216540624065,0.252456285077626,0.0217780456435242,0.0651701620487591,0.574435321324572,0.184566801626217
"temp",1.70425222600028e-93,0.0254591808654144,3.37949212896464e-84,2.29092138175074e-27,3.24965524724255e-35,0.000521331802504891,0.0939688119295656,1.68182860240701e-06,0.629097537111315,0.655089175090504,0.600945106124814,0.856845264126636,0.262320498444911,0.566778016492054,1.59334251490172e-18,7.03755359094284e-21,0.0774277159076882,0.23486162628183,6.45779257689905e-08,1.60978436602265e-05,0.870724076344723,0.383100855904896,0.0911596524257838,0.243802407594837,0.216085112608098,0.0213260132122192,0.403776566368029,0.147473037594048,0.560222473643943
"temp",1.22461547434225e-96,0.217474489474471,5.50306756336854e-90,2.98417966921841e-29,1.09785207607823e-34,2.86684625758337e-05,0.00208772729597748,3.78250097704119e-07,0.299223231630511,0.291419396833628,0.142954498369166,0.417168031848591,0.909450395461226,0.605236083646297,2.86852388790167e-20,1.39017150141771e-22,0.0583406645223818,0.00278753795639227,2.02088448989947e-09,3.63422410356779e-06,0.39793771139267,0.0301308086107253,0.325234159875657,0.963896413868267,0.79226164648965,0.0080930086626056,0.236036387176425,0.198578570406302,0.128968549820098
"temp",6.39209649512768e-97,0.642246682434219,2.2638195890848e-89,8.88015941648129e-34,6.33952992222235e-37,3.9472426853046e-05,0.37563009592518,0.000411453026834236,0.597244464228971,0.685473781903985,0.806157967545801,0.0112173288216768,0.000293820035424366,0.611339243572675,8.77665393079606e-23,5.88116373410693e-29,0.0112109625929411,0.124344970491648,1.06019965673434e-08,1.76362461943637e-08,0.124489525814709,0.720131869829367,0.101102894742356,0.639806213673203,0.193707359698633,0.000889019097204543,0.643855777991224,0.682249374503296,0.101659741973816
"temp",4.92005186292984e-96,0.0483299430043418,1.43092109602928e-85,3.76972845016173e-28,1.03146186872733e-34,0.00695723729865434,0.0808235695499171,2.46826894325109e-05,0.684924604239036,0.65652230896863,0.467507140777379,0.820821368043541,0.311539005523408,0.677291375619904,7.14549331387832e-23,4.18328004995099e-24,0.022449383785901,0.269254974181341,1.0919058751864e-08,2.10034883199692e-05,0.767994004459467,0.895862882505397,0.400491527923033,0.358441247462914,0.847646296003695,0.0117885404775667,0.958582805844963,0.0352598914518039,0.626686945199642
"temp",4.94787777919103e-97,0.634477649962783,4.65221414917802e-86,2.21892979411441e-27,6.27569139175562e-35,2.97673940197092e-05,0.224572253899472,0.000229513366771799,0.704408827710023,0.912562724141069,0.830438668417717,0.712445241660231,0.0425390593242735,0.639084776818424,3.2516951129939e-20,8.97493169021451e-26,0.003305911770177,0.11174337962828,1.8514966085681e-09,1.49990899195692e-05,0.380141776933457,0.346434267287725,0.273829274736498,0.661044605842518,0.470573656127435,0.00017957394948729,0.424446016392473,0.050771940535442,0.902142620705685
"temp",1.99079666758516e-93,0.274339348045708,3.12046420285716e-86,6.56459710095789e-28,9.91047933387695e-33,6.69406278367764e-08,0.00451846628150068,5.96538300958183e-06,0.650475993768944,0.257990489898905,0.223849259218894,0.206698312377615,0.973879405160865,0.198742726531388,9.93198750191903e-20,7.05141036927682e-23,0.000613826785942475,0.0269734243836835,2.46149970178739e-08,2.00852982686614e-06,0.977376433963566,0.793508780844572,0.485568586359899,0.224864180608629,0.784652639305439,0.109637046161009,0.395429061457769,0.571608713364739,0.728296097719238
"temp",4.96697584238272e-91,0.12897128749098,1.31003178448727e-84,1.24258863213198e-29,7.84650251432458e-34,0.00169289525955928,0.160100431257599,0.00029311417354787,0.960626815259591,0.933865773238812,0.957231672194014,0.798805919954879,0.395570243257492,0.155981157958233,1.303987719345e-18,8.447895237743e-20,0.00694676689245828,0.267620628812378,1.10393516580374e-07,0.000134158592088749,0.550658534335906,0.698976342875821,0.157772260449413,0.495135832456291,0.49365710791451,0.00599633556568616,0.949759481211101,0.372359831476,0.778659149412373
"temp",2.56060392153177e-96,0.264525546304849,1.38796385467543e-86,8.03381042157054e-34,1.64962573466576e-34,0.00516647443369459,0.028906946166809,1.58876979604883e-07,0.868121188286256,0.991472799678014,0.301967280749511,0.863352213908966,0.423194511886593,0.545868927725381,9.62474234298903e-23,6.39668348602845e-24,0.0387584435309095,0.12042839396371,7.47327545569627e-09,1.81854085256744e-05,0.909712514624972,0.125421518446435,0.0251699852396888,0.605659313577528,0.375553316013546,0.0406853504708103,0.725511156285764,0.541491867399617,0.708977971235416
"temp",4.09106589930185e-95,0.274954851354622,2.79078277584316e-82,9.57116197788149e-29,1.72949361204819e-31,0.00286562894578283,0.0939750994547549,2.43268035270989e-06,0.514063973320563,0.730324120821003,0.921207395411029,0.503914474050325,0.0563944666277842,0.315750584376058,1.5044431299079e-21,8.6010807217617e-23,0.0150935280868528,0.0938425976316454,4.80304809996069e-07,4.48156175083681e-05,0.764232922983415,0.277238220981755,0.179713523288896,0.0564621651192566,0.286393347699148,0.000144313336920528,0.562734770934567,0.337131915429083,0.869342120215341
"temp",5.74880291078051e-93,0.200488474390261,2.54420286366409e-80,1.92325328934393e-22,3.45025433726874e-35,0.00474133282428654,0.175361302746513,4.51865387093209e-06,0.524936256805599,0.568943415150747,0.469449868034056,0.988767741614675,0.431357730072186,0.276260542143669,7.00412413561639e-17,3.55632047218912e-24,0.238814966758043,0.823500600071931,3.5836871356865e-06,0.000101491956577079,0.170827410115205,0.913153808863913,0.28732908510014,0.58617504850837,0.303370171096319,0.0036646257652788,0.77086245491666,0.189832340150745,0.921198966408769
"temp",1.13567338228756e-94,0.0335900221163501,2.70157199591364e-86,9.36064598563319e-32,2.20642865460229e-33,4.85830486514749e-06,0.719637336146728,5.07688545246103e-05,0.848362879237307,0.713308814905712,0.829076350517557,0.224762325945963,0.0684917307555853,0.0209282942568246,5.44850361358659e-17,3.83816216915289e-23,0.266745573396905,0.0189462703684757,3.10194441650005e-08,0.000889142267843752,0.968394357779264,0.410809110340127,0.0176791625676932,0.0548691781340405,0.0606165504328025,0.00151248967837478,0.677306520961598,0.101085409765274,0.55787024753513
"temp",7.01799013093032e-93,0.00844124131878881,1.09459153212531e-83,6.92196969840337e-28,5.49748681891706e-34,0.000825133031957475,0.0237995974131792,1.03579522827951e-05,0.817080971143423,0.634051985121429,0.529012221273263,0.246861073113788,0.871780910758567,0.0418189790863668,1.02557169009134e-18,2.49293611428855e-21,0.00271738937235334,0.0816480206037447,1.45577400099686e-06,5.49373730766666e-05,0.354079249435851,0.296931571165343,0.191018447543862,0.463718735180174,0.18143006217483,0.0124616591777627,0.605726100695649,0.70693665004579,0.784795124369287
