"","(Intercept)","CURS","CCOAOMT","DCS","TAL","CURS:CCOAOMT","CURS:DCS","CURS:TAL","CCOAOMT:DCS","CCOAOMT:TAL","DCS:TAL"
"",1.68950007120631e-41,5.20126705501832e-16,9.91639976189466e-06,8.75256698908738e-09,0.92460687332778,0.0181723088548369,0.398102782315928,0.225641460520444,0.512225266051043,0.0656763657532925,0.047743549339891
"temp",1.9259141376912e-38,1.03694396311115e-11,0.0262308395272677,2.35815654053221e-06,0.982600332433934,0.0476764374806621,0.321936328135119,0.37523019355729,0.987107309109228,0.360653314206973,0.750393774106662
"temp",1.71552045188116e-41,5.9865321947153e-13,0.0272580502851692,2.60415359584388e-06,0.483036857495789,0.835493628991346,0.0849239525096211,0.0332027515596083,0.0115066059666733,0.0356755824582179,0.0509459092071725
"temp",2.22921709956675e-40,1.90723249749163e-14,1.31453910651096e-05,1.2075944940239e-06,0.0128616228930134,0.0352146009002433,0.996999126553848,0.347621192428201,0.0419799167505987,0.758074021126367,0.0221847738323943
"temp",3.68716254101781e-39,1.17926605410456e-13,0.0016279177337017,4.38033402302423e-05,0.102792461026993,0.573349877556969,0.665589800547595,0.891796266521681,0.803261288529591,0.435418581311436,0.192107571147218
"temp",9.66486816931938e-37,4.80613026587458e-14,0.0285771368977669,4.9156620287171e-06,0.0639353337385755,0.335884073713783,0.980535933184233,0.651989416273454,0.144393316647858,0.268825779170416,0.970069437426075
"temp",1.40007232618038e-41,5.56295343154369e-14,0.00216266979918896,7.75254091766125e-06,0.541583350483876,0.885339588391649,0.458227045527821,0.239120569711125,0.0210809545144352,0.0653617557274362,0.00967746708986469
"temp",2.68000500882364e-39,5.10363518859919e-13,0.00274637998459054,1.37050650653163e-05,0.0780753230295203,0.505834058140254,0.631241656891002,0.839112320243054,0.554024278941206,0.393703813262156,0.261360748493465
"temp",3.57565166808394e-40,4.40177052289127e-13,0.000209126720545387,3.09589903084492e-07,0.0949686360276491,0.151935694933527,0.63474664474077,0.863914922106445,0.233595641012324,0.368166587699373,0.144986217839573
"temp",9.43129224469147e-42,2.33216945577148e-14,0.000665108008224688,2.08778045915787e-06,0.764104690565013,0.425058035881808,0.0867340024248527,0.424617822449572,0.0100941867820682,0.44353958553899,0.123598433612809
"temp",5.79873589320321e-39,1.75616512779715e-12,0.00133144647733611,1.77030366912917e-05,0.217109155641969,0.406085108352844,0.970720797483168,0.792194373683784,0.456853389362977,0.70966238762388,0.372502739901579
"temp",8.71383150428323e-41,3.23206104735255e-15,1.3474491392001e-05,4.62219485246828e-08,0.601562389900467,0.0398379126691639,0.33879111684984,0.115214865815632,0.687064325516064,0.203675113592096,0.0247784942914713
"temp",8.03319342681332e-40,2.942876264371e-14,0.000418214496727441,1.32112573523164e-05,0.134809492027732,0.582217995930218,0.748308253653209,0.529664706023913,0.719172044503602,0.436304747209034,0.518705754368132
"temp",4.88312071861351e-39,9.14883728649005e-15,0.0120885296379097,0.000107557985433875,0.793384776795055,0.782164738497064,0.210994713670251,0.085316865871368,0.0920676396143822,0.200781532392209,0.0531875841368171
"temp",1.95813204265512e-40,3.00850703328078e-13,7.63571865286269e-05,1.06498873013639e-07,0.0391420666394509,0.845545167675314,0.538636643659004,0.304945312882215,0.891378484732536,0.749680013156506,0.67956102202739
"temp",2.06650456872289e-37,1.27791105392517e-10,0.00013972038083731,4.4164749246824e-07,0.0336910076300944,0.0730433255796416,0.723640184260381,0.424332612562449,0.257842657932397,0.16933131189709,0.155392219888766
"temp",1.15832923766614e-39,1.1154863720373e-13,0.000319643799101438,4.60041275417843e-06,0.0705864121177804,0.843007548408529,0.506601231523277,0.577166617531748,0.54771885919403,0.348276720082483,0.69615137034952
"temp",1.80170843746694e-40,8.64417542201623e-14,1.00244847342314e-05,1.3557324219657e-06,0.0165588904402629,0.465736494193084,0.294531727563806,0.598514479039455,0.516438813744317,0.461167332422528,0.350559806855434
"temp",7.72726120283511e-40,1.59131156948779e-13,0.00324634098380978,1.43090798407531e-06,0.0927089263074701,0.727381153487659,0.600279952535312,0.980361271926087,0.687979734903548,0.873942893176996,0.138325591857057
"temp",1.68950007120631e-41,5.20126705501832e-16,9.91639976189466e-06,8.75256698908738e-09,0.92460687332778,0.0181723088548369,0.398102782315928,0.225641460520444,0.512225266051043,0.0656763657532925,0.047743549339891
"temp",2.01972515736673e-41,2.33186890645883e-13,0.00326735859426197,3.46390203802143e-05,0.751661184614338,0.742408331874399,0.271516340793125,0.105865111979993,0.0422131820003975,0.129511406609511,0.0213327497792466
"temp",6.13721816543474e-37,3.22835354512919e-14,0.000407569880375452,0.000648306106904496,0.0658139531244537,0.502913689250756,0.790427690946626,0.550607793877246,0.846816161635698,0.272305474016518,0.970290233098104
"temp",2.67906772879631e-39,3.63983741980734e-15,8.84390794609423e-05,0.0031568460324624,0.00142501386008412,0.241006545869153,0.0289401937877064,0.014068198229856,0.280707423215599,0.785155129236459,0.233529919813605
"temp",1.27901817962595e-39,2.05557587270163e-13,0.00255517437722273,2.53863447126296e-06,0.195427310780192,0.389759466042896,0.95948533951615,0.999682307857015,0.427685128551142,0.505711344582795,0.506757266822061
