"","V1","V2","V3","V4","V5","V6","V7","V8","V9","V10","V11","V12","V13","V14","V15","V16","V17","V18","V19","V20","V21","V22","V23","V24","V25","V26","V27","V28","V29","V30","V31","V32","V33","V34","V35","V36","V37","V38","V39","V40","V41","V42","V43","V44","V45","V46","V47","V48","V49","V50","V51","V52","V53","V54","V55","V56","V57","V58","V59","V60","V61","V62","V63","V64","V65","V66","V67","V68","V69","V70","V71","V72","V73","V74","V75","V76","V77","V78","V79","V80","V81","V82","V83","V84","V85","V86","V87","V88","V89","V90","V91","V92","V93","V94","V95","V96","V97","V98","V99","V100","V101","V102","V103","V104","V105","V106","V107","V108","V109","V110","V111","V112","V113","V114","V115","V116","V117","V118","V119","V120","V121","V122","V123","V124","V125","V126","V127","V128","V129","V130","V131","V132","V133","V134","V135","V136","V137","V138","V139","V140","V141","V142","V143","V144","V145","V146","V147","V148","V149","V150","V151","V152","V153","V154","V155","V156","V157","V158","V159","V160","V161","V162","V163","V164","V165","V166","V167","V168","V169","V170","V171","V172","V173","V174","V175","V176","V177","V178","V179","V180","V181","V182","V183","V184","V185","V186","V187","V188","V189"
"1",2,3,4,5,6,7,8,30,31,32,33,34,35,36,37,38,39,40,41,42,43,44,45,46,47,48,49,50,51,52,53,54,55,56,57,58,59,60,61,62,63,64,100,101,102,103,105,106,107,108,109,110,111,112,113,114,115,116,117,118,119,120,128,130,131,132,133,134,135,136,158,159,160,161,162,163,164,165,166,167,168,169,170,171,172,173,174,175,176,177,178,179,180,181,182,183,184,185,186,187,188,189,190,191,192,228,229,230,231,233,234,235,236,237,238,239,240,241,242,243,244,245,246,247,248,256,258,259,260,261,262,263,264,286,287,288,289,290,291,292,293,294,295,296,297,298,299,300,301,302,303,304,305,306,307,308,309,310,311,312,313,314,315,316,317,318,319,320,356,357,358,359,361,362,363,364,365,366,367,368,369,370,371,372,373,374,375,376,384
"2",2,3,4,5,6,7,8,30,31,32,33,34,35,36,37,38,39,40,41,43,44,45,46,47,48,49,50,51,52,53,54,55,56,57,58,59,60,61,62,63,64,100,101,102,103,104,105,106,107,108,109,110,111,112,113,114,115,116,117,118,119,120,128,130,131,132,133,134,135,136,158,159,160,161,162,163,164,165,166,167,168,169,171,172,173,174,175,176,177,178,179,180,181,182,183,184,185,186,187,188,189,190,191,192,228,229,230,231,232,233,234,235,236,237,238,239,240,241,242,243,244,245,246,247,248,256,258,259,260,261,262,263,264,286,287,288,289,290,291,292,293,294,295,296,297,299,300,301,302,303,304,305,306,307,308,309,310,311,312,313,314,315,316,317,318,319,320,356,357,358,359,360,361,362,363,364,365,366,367,368,369,370,371,372,373,374,375,376,384
"3",2,3,4,5,6,7,8,30,31,32,33,34,35,36,37,38,39,40,41,42,43,44,45,46,47,48,49,50,51,52,53,54,55,56,57,58,59,60,61,63,64,100,101,102,103,104,105,106,107,108,109,110,111,112,113,114,115,116,117,118,119,120,128,130,131,132,133,134,135,136,158,159,160,161,162,163,164,165,166,167,168,169,170,171,172,173,174,175,176,177,178,179,180,181,182,183,184,185,186,187,188,189,191,192,228,229,230,231,232,233,234,235,236,237,238,239,240,241,242,243,244,245,246,247,248,256,258,259,260,261,262,263,264,286,287,288,289,290,291,292,293,294,295,296,297,298,299,300,301,302,303,304,305,306,307,308,309,310,311,312,313,314,315,316,317,319,320,356,357,358,359,360,361,362,363,364,365,366,367,368,369,370,371,372,373,374,375,376,384
"4",2,3,4,5,6,7,8,30,31,32,33,34,35,36,37,38,39,40,41,42,43,44,45,46,47,48,49,50,51,52,53,54,55,56,57,58,59,60,61,62,63,64,100,102,103,104,105,106,107,108,109,110,111,112,113,114,115,116,117,118,119,120,128,130,131,132,133,134,135,136,158,159,160,161,162,163,164,165,166,167,168,169,170,171,172,173,174,175,176,177,178,179,180,181,182,183,184,185,186,187,188,189,190,191,192,228,230,231,232,233,234,235,236,237,238,239,240,241,242,243,244,245,246,247,248,256,258,259,260,261,262,263,264,286,287,288,289,290,291,292,293,294,295,296,297,298,299,300,301,302,303,304,305,306,307,308,309,310,311,312,313,314,315,316,317,318,319,320,356,358,359,360,361,362,363,364,365,366,367,368,369,370,371,372,373,374,375,376,384
"5",2,3,4,5,6,7,8,30,31,32,33,34,35,36,37,38,39,40,41,42,43,44,45,46,47,48,49,50,51,52,53,54,55,56,57,58,59,60,61,62,63,64,100,101,102,103,104,105,106,107,108,109,110,111,112,113,114,115,116,117,118,119,120,130,131,132,133,134,135,136,158,159,160,161,162,163,164,165,166,167,168,169,170,171,172,173,174,175,176,177,178,179,180,181,182,183,184,185,186,187,188,189,190,191,192,228,229,230,231,232,233,234,235,236,237,238,239,240,241,242,243,244,245,246,247,248,258,259,260,261,262,263,264,286,287,288,289,290,291,292,293,294,295,296,297,298,299,300,301,302,303,304,305,306,307,308,309,310,311,312,313,314,315,316,317,318,319,320,356,357,358,359,360,361,362,363,364,365,366,367,368,369,370,371,372,373,374,375,376
"6",2,3,4,5,7,8,30,31,32,33,34,35,36,37,38,39,40,41,42,43,44,45,46,47,48,49,50,51,52,53,54,55,56,57,58,59,60,61,62,63,64,100,101,102,103,104,105,106,107,108,109,110,111,112,113,114,115,116,117,118,119,120,128,130,131,132,133,135,136,158,159,160,161,162,163,164,165,166,167,168,169,170,171,172,173,174,175,176,177,178,179,180,181,182,183,184,185,186,187,188,189,190,191,192,228,229,230,231,232,233,234,235,236,237,238,239,240,241,242,243,244,245,246,247,248,256,258,259,260,261,263,264,286,287,288,289,290,291,292,293,294,295,296,297,298,299,300,301,302,303,304,305,306,307,308,309,310,311,312,313,314,315,316,317,318,319,320,356,357,358,359,360,361,362,363,364,365,366,367,368,369,370,371,372,373,374,375,376,384
"7",2,3,4,5,6,7,8,30,31,32,33,34,35,36,37,38,39,40,41,42,43,44,45,46,47,48,49,50,51,52,53,54,55,56,57,58,59,60,62,63,64,100,101,102,103,104,105,106,107,108,109,110,111,112,113,114,115,116,117,118,119,120,128,130,131,132,133,134,135,136,158,159,160,161,162,163,164,165,166,167,168,169,170,171,172,173,174,175,176,177,178,179,180,181,182,183,184,185,186,187,188,190,191,192,228,229,230,231,232,233,234,235,236,237,238,239,240,241,242,243,244,245,246,247,248,256,258,259,260,261,262,263,264,286,287,288,289,290,291,292,293,294,295,296,297,298,299,300,301,302,303,304,305,306,307,308,309,310,311,312,313,314,315,316,318,319,320,356,357,358,359,360,361,362,363,364,365,366,367,368,369,370,371,372,373,374,375,376,384
"8",2,3,4,5,6,7,8,30,31,32,33,34,35,36,37,38,39,40,41,42,43,44,45,46,48,49,50,51,52,53,54,55,56,57,58,59,60,61,62,63,64,100,101,102,103,104,105,106,107,108,109,110,111,112,113,114,115,116,117,118,119,120,128,130,131,132,133,134,135,136,158,159,160,161,162,163,164,165,166,167,168,169,170,171,172,173,174,176,177,178,179,180,181,182,183,184,185,186,187,188,189,190,191,192,228,229,230,231,232,233,234,235,236,237,238,239,240,241,242,243,244,245,246,247,248,256,258,259,260,261,262,263,264,286,287,288,289,290,291,292,293,294,295,296,297,298,299,300,301,302,304,305,306,307,308,309,310,311,312,313,314,315,316,317,318,319,320,356,357,358,359,360,361,362,363,364,365,366,367,368,369,370,371,372,373,374,375,376,384
"9",2,3,4,5,6,7,8,30,31,32,33,34,36,37,38,39,40,41,42,43,44,45,46,47,48,49,50,51,52,53,54,55,56,57,58,59,60,61,62,63,64,100,101,102,103,104,105,106,107,108,109,110,111,112,113,114,115,116,117,118,119,120,128,130,131,132,133,134,135,136,158,159,160,161,162,164,165,166,167,168,169,170,171,172,173,174,175,176,177,178,179,180,181,182,183,184,185,186,187,188,189,190,191,192,228,229,230,231,232,233,234,235,236,237,238,239,240,241,242,243,244,245,246,247,248,256,258,259,260,261,262,263,264,286,287,288,289,290,292,293,294,295,296,297,298,299,300,301,302,303,304,305,306,307,308,309,310,311,312,313,314,315,316,317,318,319,320,356,357,358,359,360,361,362,363,364,365,366,367,368,369,370,371,372,373,374,375,376,384
"10",2,3,4,5,6,7,8,30,31,32,33,34,35,36,37,38,39,40,41,42,43,44,45,46,47,48,49,50,51,52,53,54,55,56,57,58,59,60,61,62,63,64,100,101,102,103,104,105,106,107,108,109,110,111,112,113,114,115,116,117,119,120,128,130,131,132,133,134,135,136,158,159,160,161,162,163,164,165,166,167,168,169,170,171,172,173,174,175,176,177,178,179,180,181,182,183,184,185,186,187,188,189,190,191,192,228,229,230,231,232,233,234,235,236,237,238,239,240,241,242,243,244,245,247,248,256,258,259,260,261,262,263,264,286,287,288,289,290,291,292,293,294,295,296,297,298,299,300,301,302,303,304,305,306,307,308,309,310,311,312,313,314,315,316,317,318,319,320,356,357,358,359,360,361,362,363,364,365,366,367,368,369,370,371,372,373,375,376,384
"11",2,3,4,5,6,7,8,30,31,32,33,34,35,36,37,38,39,40,41,42,43,44,45,46,47,48,49,50,51,52,53,55,56,57,58,59,60,61,62,63,64,100,101,102,103,104,105,106,107,108,109,110,111,112,113,114,115,116,117,118,119,120,128,130,131,132,133,134,135,136,158,159,160,161,162,163,164,165,166,167,168,169,170,171,172,173,174,175,176,177,178,179,180,181,183,184,185,186,187,188,189,190,191,192,228,229,230,231,232,233,234,235,236,237,238,239,240,241,242,243,244,245,246,247,248,256,258,259,260,261,262,263,264,286,287,288,289,290,291,292,293,294,295,296,297,298,299,300,301,302,303,304,305,306,307,308,309,311,312,313,314,315,316,317,318,319,320,356,357,358,359,360,361,362,363,364,365,366,367,368,369,370,371,372,373,374,375,376,384
"12",2,3,4,5,6,7,8,30,31,32,33,34,35,36,37,38,39,40,41,42,43,44,45,46,47,48,49,50,51,52,53,54,56,57,58,59,60,61,62,63,64,100,101,102,103,104,105,106,107,108,109,110,111,112,113,114,115,116,117,118,119,120,128,130,131,132,133,134,135,136,158,159,160,161,162,163,164,165,166,167,168,169,170,171,172,173,174,175,176,177,178,179,180,181,182,184,185,186,187,188,189,190,191,192,228,229,230,231,232,233,234,235,236,237,238,239,240,241,242,243,244,245,246,247,248,256,258,259,260,261,262,263,264,286,287,288,289,290,291,292,293,294,295,296,297,298,299,300,301,302,303,304,305,306,307,308,309,310,312,313,314,315,316,317,318,319,320,356,357,358,359,360,361,362,363,364,365,366,367,368,369,370,371,372,373,374,375,376,384
"13",2,3,4,5,6,7,8,30,31,32,33,34,35,36,37,38,39,40,41,42,43,44,45,46,47,48,49,50,51,52,53,54,56,57,58,59,60,61,62,63,64,100,101,102,103,104,105,106,107,108,109,110,111,112,113,114,115,116,117,118,119,120,128,130,131,132,133,134,135,136,158,159,160,161,162,163,164,165,166,167,168,169,170,171,172,173,174,175,176,177,178,179,180,181,182,184,185,186,187,188,189,190,191,192,228,229,230,231,232,233,234,235,236,237,238,239,240,241,242,243,244,245,246,247,248,256,258,259,260,261,262,263,264,286,287,288,289,290,291,292,293,294,295,296,297,298,299,300,301,302,303,304,305,306,307,308,309,310,312,313,314,315,316,317,318,319,320,356,357,358,359,360,361,362,363,364,365,366,367,368,369,370,371,372,373,374,375,376,384
"14",2,3,4,5,6,7,8,30,31,32,33,34,35,36,37,38,39,40,41,42,43,44,45,46,47,48,49,50,51,52,53,54,55,56,57,58,59,60,61,62,63,64,100,101,102,103,104,105,106,107,108,109,110,111,112,113,114,115,116,117,118,119,120,130,131,132,133,134,135,136,158,159,160,161,162,163,164,165,166,167,168,169,170,171,172,173,174,175,176,177,178,179,180,181,182,183,184,185,186,187,188,189,190,191,192,228,229,230,231,232,233,234,235,236,237,238,239,240,241,242,243,244,245,246,247,248,258,259,260,261,262,263,264,286,287,288,289,290,291,292,293,294,295,296,297,298,299,300,301,302,303,304,305,306,307,308,309,310,311,312,313,314,315,316,317,318,319,320,356,357,358,359,360,361,362,363,364,365,366,367,368,369,370,371,372,373,374,375,376
"15",2,3,4,5,6,7,8,30,31,32,33,34,35,36,37,39,40,41,42,43,44,45,46,47,48,49,50,51,52,53,54,55,56,57,58,59,60,61,62,63,64,100,101,102,103,104,105,106,107,108,109,110,111,112,113,114,115,116,117,118,119,120,128,130,131,132,133,134,135,136,158,159,160,161,162,163,164,165,167,168,169,170,171,172,173,174,175,176,177,178,179,180,181,182,183,184,185,186,187,188,189,190,191,192,228,229,230,231,232,233,234,235,236,237,238,239,240,241,242,243,244,245,246,247,248,256,258,259,260,261,262,263,264,286,287,288,289,290,291,292,293,295,296,297,298,299,300,301,302,303,304,305,306,307,308,309,310,311,312,313,314,315,316,317,318,319,320,356,357,358,359,360,361,362,363,364,365,366,367,368,369,370,371,372,373,374,375,376,384
"16",2,3,4,5,6,7,8,30,31,32,33,35,36,37,38,39,40,41,42,43,44,45,46,47,48,49,50,51,52,53,54,55,56,57,58,59,60,61,62,63,64,100,101,102,103,104,105,106,107,108,109,110,111,112,113,114,115,116,117,118,119,120,128,130,131,132,133,134,135,136,158,159,160,161,163,164,165,166,167,168,169,170,171,172,173,174,175,176,177,178,179,180,181,182,183,184,185,186,187,188,189,190,191,192,228,229,230,231,232,233,234,235,236,237,238,239,240,241,242,243,244,245,246,247,248,256,258,259,260,261,262,263,264,286,287,288,289,291,292,293,294,295,296,297,298,299,300,301,302,303,304,305,306,307,308,309,310,311,312,313,314,315,316,317,318,319,320,356,357,358,359,360,361,362,363,364,365,366,367,368,369,370,371,372,373,374,375,376,384
"17",2,3,4,5,6,7,8,30,31,32,33,34,35,36,37,38,39,40,41,42,43,44,45,46,47,48,49,50,51,52,53,54,55,56,57,58,59,60,61,62,64,100,101,102,103,104,105,106,107,108,109,110,111,112,113,114,115,116,117,118,119,120,128,130,131,132,133,134,135,136,158,159,160,161,162,163,164,165,166,167,168,169,170,171,172,173,174,175,176,177,178,179,180,181,182,183,184,185,186,187,188,189,190,192,228,229,230,231,232,233,234,235,236,237,238,239,240,241,242,243,244,245,246,247,248,256,258,259,260,261,262,263,264,286,287,288,289,290,291,292,293,294,295,296,297,298,299,300,301,302,303,304,305,306,307,308,309,310,311,312,313,314,315,316,317,318,320,356,357,358,359,360,361,362,363,364,365,366,367,368,369,370,371,372,373,374,375,376,384
"18",2,3,4,5,6,7,8,30,31,32,33,34,35,36,37,38,39,40,41,42,43,44,45,46,47,48,49,50,51,52,53,54,55,56,57,58,59,60,61,62,63,64,100,101,102,103,105,106,107,108,109,110,111,112,113,114,115,116,117,118,119,120,128,130,131,132,133,134,135,136,158,159,160,161,162,163,164,165,166,167,168,169,170,171,172,173,174,175,176,177,178,179,180,181,182,183,184,185,186,187,188,189,190,191,192,228,229,230,231,233,234,235,236,237,238,239,240,241,242,243,244,245,246,247,248,256,258,259,260,261,262,263,264,286,287,288,289,290,291,292,293,294,295,296,297,298,299,300,301,302,303,304,305,306,307,308,309,310,311,312,313,314,315,316,317,318,319,320,356,357,358,359,361,362,363,364,365,366,367,368,369,370,371,372,373,374,375,376,384
"19",2,3,4,5,6,7,8,30,31,32,33,34,35,36,37,38,39,40,41,42,43,44,45,46,47,48,49,50,51,52,53,54,55,56,57,58,59,60,61,62,64,100,101,102,103,104,105,106,107,108,109,110,111,112,113,114,115,116,117,118,119,120,128,130,131,132,133,134,135,136,158,159,160,161,162,163,164,165,166,167,168,169,170,171,172,173,174,175,176,177,178,179,180,181,182,183,184,185,186,187,188,189,190,192,228,229,230,231,232,233,234,235,236,237,238,239,240,241,242,243,244,245,246,247,248,256,258,259,260,261,262,263,264,286,287,288,289,290,291,292,293,294,295,296,297,298,299,300,301,302,303,304,305,306,307,308,309,310,311,312,313,314,315,316,317,318,320,356,357,358,359,360,361,362,363,364,365,366,367,368,369,370,371,372,373,374,375,376,384
"20",2,3,4,5,6,7,30,31,32,33,34,35,36,37,38,39,40,41,42,43,44,45,46,47,48,49,50,51,52,53,54,55,56,57,58,59,60,61,62,63,64,100,101,102,103,104,105,106,107,108,109,110,111,112,113,114,115,116,117,118,119,120,128,130,131,132,133,134,135,158,159,160,161,162,163,164,165,166,167,168,169,170,171,172,173,174,175,176,177,178,179,180,181,182,183,184,185,186,187,188,189,190,191,192,228,229,230,231,232,233,234,235,236,237,238,239,240,241,242,243,244,245,246,247,248,256,258,259,260,261,262,263,286,287,288,289,290,291,292,293,294,295,296,297,298,299,300,301,302,303,304,305,306,307,308,309,310,311,312,313,314,315,316,317,318,319,320,356,357,358,359,360,361,362,363,364,365,366,367,368,369,370,371,372,373,374,375,376,384
"21",2,3,4,5,6,7,8,30,31,32,33,34,35,36,37,38,39,40,41,42,43,44,45,46,47,48,49,50,51,53,54,55,56,57,58,59,60,61,62,63,64,100,101,102,103,104,105,106,107,108,109,110,111,112,113,114,115,116,117,118,119,120,128,130,131,132,133,134,135,136,158,159,160,161,162,163,164,165,166,167,168,169,170,171,172,173,174,175,176,177,178,179,181,182,183,184,185,186,187,188,189,190,191,192,228,229,230,231,232,233,234,235,236,237,238,239,240,241,242,243,244,245,246,247,248,256,258,259,260,261,262,263,264,286,287,288,289,290,291,292,293,294,295,296,297,298,299,300,301,302,303,304,305,306,307,309,310,311,312,313,314,315,316,317,318,319,320,356,357,358,359,360,361,362,363,364,365,366,367,368,369,370,371,372,373,374,375,376,384
"22",2,3,4,5,6,7,8,30,31,32,33,35,36,37,38,39,40,41,42,43,44,45,46,47,48,49,50,51,52,53,54,55,56,57,58,59,60,61,62,63,64,100,101,102,103,104,105,106,107,108,109,110,111,112,113,114,115,116,117,118,119,120,128,130,131,132,133,134,135,136,158,159,160,161,163,164,165,166,167,168,169,170,171,172,173,174,175,176,177,178,179,180,181,182,183,184,185,186,187,188,189,190,191,192,228,229,230,231,232,233,234,235,236,237,238,239,240,241,242,243,244,245,246,247,248,256,258,259,260,261,262,263,264,286,287,288,289,291,292,293,294,295,296,297,298,299,300,301,302,303,304,305,306,307,308,309,310,311,312,313,314,315,316,317,318,319,320,356,357,358,359,360,361,362,363,364,365,366,367,368,369,370,371,372,373,374,375,376,384
"23",2,3,4,5,6,7,8,30,31,32,33,34,35,36,37,38,39,40,42,43,44,45,46,47,48,49,50,51,52,53,54,55,56,57,58,59,60,61,62,63,64,100,101,102,103,104,105,106,107,108,109,110,111,112,113,114,115,116,117,118,119,120,128,130,131,132,133,134,135,136,158,159,160,161,162,163,164,165,166,167,168,170,171,172,173,174,175,176,177,178,179,180,181,182,183,184,185,186,187,188,189,190,191,192,228,229,230,231,232,233,234,235,236,237,238,239,240,241,242,243,244,245,246,247,248,256,258,259,260,261,262,263,264,286,287,288,289,290,291,292,293,294,295,296,298,299,300,301,302,303,304,305,306,307,308,309,310,311,312,313,314,315,316,317,318,319,320,356,357,358,359,360,361,362,363,364,365,366,367,368,369,370,371,372,373,374,375,376,384
"24",2,3,4,5,6,7,8,30,31,32,33,34,35,36,37,38,39,40,41,42,44,45,46,47,48,49,50,51,52,53,54,55,56,57,58,59,60,61,62,63,64,100,101,102,103,104,105,106,107,108,109,110,111,112,113,114,115,116,117,118,119,120,128,130,131,132,133,134,135,136,158,159,160,161,162,163,164,165,166,167,168,169,170,172,173,174,175,176,177,178,179,180,181,182,183,184,185,186,187,188,189,190,191,192,228,229,230,231,232,233,234,235,236,237,238,239,240,241,242,243,244,245,246,247,248,256,258,259,260,261,262,263,264,286,287,288,289,290,291,292,293,294,295,296,297,298,300,301,302,303,304,305,306,307,308,309,310,311,312,313,314,315,316,317,318,319,320,356,357,358,359,360,361,362,363,364,365,366,367,368,369,370,371,372,373,374,375,376,384
"25",2,3,4,5,6,7,8,30,31,32,33,34,35,36,37,38,39,40,41,42,43,44,45,46,48,49,50,51,52,53,54,55,56,57,58,59,60,61,62,63,64,100,101,102,103,104,105,106,107,108,109,110,111,112,113,114,115,116,117,118,119,120,128,130,131,132,133,134,135,136,158,159,160,161,162,163,164,165,166,167,168,169,170,171,172,173,174,176,177,178,179,180,181,182,183,184,185,186,187,188,189,190,191,192,228,229,230,231,232,233,234,235,236,237,238,239,240,241,242,243,244,245,246,247,248,256,258,259,260,261,262,263,264,286,287,288,289,290,291,292,293,294,295,296,297,298,299,300,301,302,304,305,306,307,308,309,310,311,312,313,314,315,316,317,318,319,320,356,357,358,359,360,361,362,363,364,365,366,367,368,369,370,371,372,373,374,375,376,384
"26",2,3,4,5,6,7,8,30,31,32,33,34,35,36,37,38,39,40,41,42,43,44,45,46,47,48,49,50,51,53,54,55,56,57,58,59,60,61,62,63,64,100,101,102,103,104,105,106,107,108,109,110,111,112,113,114,115,116,117,118,119,120,128,130,131,132,133,134,135,136,158,159,160,161,162,163,164,165,166,167,168,169,170,171,172,173,174,175,176,177,178,179,181,182,183,184,185,186,187,188,189,190,191,192,228,229,230,231,232,233,234,235,236,237,238,239,240,241,242,243,244,245,246,247,248,256,258,259,260,261,262,263,264,286,287,288,289,290,291,292,293,294,295,296,297,298,299,300,301,302,303,304,305,306,307,309,310,311,312,313,314,315,316,317,318,319,320,356,357,358,359,360,361,362,363,364,365,366,367,368,369,370,371,372,373,374,375,376,384
"27",2,3,4,5,6,7,8,30,31,32,33,34,35,36,37,38,39,40,41,42,43,44,45,46,47,48,49,50,51,52,53,54,55,56,57,58,59,60,61,62,63,100,101,102,103,104,105,106,107,108,109,110,111,112,113,114,115,116,117,118,119,120,128,130,131,132,133,134,135,136,158,159,160,161,162,163,164,165,166,167,168,169,170,171,172,173,174,175,176,177,178,179,180,181,182,183,184,185,186,187,188,189,190,191,228,229,230,231,232,233,234,235,236,237,238,239,240,241,242,243,244,245,246,247,248,256,258,259,260,261,262,263,264,286,287,288,289,290,291,292,293,294,295,296,297,298,299,300,301,302,303,304,305,306,307,308,309,310,311,312,313,314,315,316,317,318,319,356,357,358,359,360,361,362,363,364,365,366,367,368,369,370,371,372,373,374,375,376,384
"28",2,3,4,5,6,7,8,30,31,32,33,34,35,36,37,38,39,40,41,42,43,44,45,46,47,48,49,51,52,53,54,55,56,57,58,59,60,61,62,63,64,100,101,102,103,104,105,106,107,108,109,110,111,112,113,114,115,116,117,118,119,120,128,130,131,132,133,134,135,136,158,159,160,161,162,163,164,165,166,167,168,169,170,171,172,173,174,175,176,177,179,180,181,182,183,184,185,186,187,188,189,190,191,192,228,229,230,231,232,233,234,235,236,237,238,239,240,241,242,243,244,245,246,247,248,256,258,259,260,261,262,263,264,286,287,288,289,290,291,292,293,294,295,296,297,298,299,300,301,302,303,304,305,307,308,309,310,311,312,313,314,315,316,317,318,319,320,356,357,358,359,360,361,362,363,364,365,366,367,368,369,370,371,372,373,374,375,376,384
"29",2,3,4,5,6,7,8,30,31,32,33,34,35,36,37,39,40,41,42,43,44,45,46,47,48,49,50,51,52,53,54,55,56,57,58,59,60,61,62,63,64,100,101,102,103,104,105,106,107,108,109,110,111,112,113,114,115,116,117,118,119,120,128,130,131,132,133,134,135,136,158,159,160,161,162,163,164,165,167,168,169,170,171,172,173,174,175,176,177,178,179,180,181,182,183,184,185,186,187,188,189,190,191,192,228,229,230,231,232,233,234,235,236,237,238,239,240,241,242,243,244,245,246,247,248,256,258,259,260,261,262,263,264,286,287,288,289,290,291,292,293,295,296,297,298,299,300,301,302,303,304,305,306,307,308,309,310,311,312,313,314,315,316,317,318,319,320,356,357,358,359,360,361,362,363,364,365,366,367,368,369,370,371,372,373,374,375,376,384
"30",2,3,4,5,6,7,8,30,31,32,33,34,35,36,37,38,39,40,41,42,43,44,45,46,47,48,49,50,51,52,53,55,56,57,58,59,60,61,62,63,64,100,101,102,103,104,105,106,107,108,109,110,111,112,113,114,115,116,117,118,119,120,128,130,131,132,133,134,135,136,158,159,160,161,162,163,164,165,166,167,168,169,170,171,172,173,174,175,176,177,178,179,180,181,183,184,185,186,187,188,189,190,191,192,228,229,230,231,232,233,234,235,236,237,238,239,240,241,242,243,244,245,246,247,248,256,258,259,260,261,262,263,264,286,287,288,289,290,291,292,293,294,295,296,297,298,299,300,301,302,303,304,305,306,307,308,309,311,312,313,314,315,316,317,318,319,320,356,357,358,359,360,361,362,363,364,365,366,367,368,369,370,371,372,373,374,375,376,384
"31",2,3,5,6,7,8,30,31,32,33,34,35,36,37,38,39,40,41,42,43,44,45,46,47,48,49,50,51,52,53,54,55,56,57,58,59,60,61,62,63,64,100,101,102,103,104,105,106,107,108,109,110,111,112,113,114,115,116,117,118,119,120,128,130,131,133,134,135,136,158,159,160,161,162,163,164,165,166,167,168,169,170,171,172,173,174,175,176,177,178,179,180,181,182,183,184,185,186,187,188,189,190,191,192,228,229,230,231,232,233,234,235,236,237,238,239,240,241,242,243,244,245,246,247,248,256,258,259,261,262,263,264,286,287,288,289,290,291,292,293,294,295,296,297,298,299,300,301,302,303,304,305,306,307,308,309,310,311,312,313,314,315,316,317,318,319,320,356,357,358,359,360,361,362,363,364,365,366,367,368,369,370,371,372,373,374,375,376,384
"32",2,3,4,5,6,7,8,30,31,32,33,34,35,36,37,38,39,40,41,42,43,44,45,46,47,48,49,50,51,52,53,54,55,56,57,58,59,60,61,62,63,64,100,101,102,103,104,105,106,107,108,109,111,112,113,114,115,116,117,118,119,120,128,130,131,132,133,134,135,136,158,159,160,161,162,163,164,165,166,167,168,169,170,171,172,173,174,175,176,177,178,179,180,181,182,183,184,185,186,187,188,189,190,191,192,228,229,230,231,232,233,234,235,236,237,239,240,241,242,243,244,245,246,247,248,256,258,259,260,261,262,263,264,286,287,288,289,290,291,292,293,294,295,296,297,298,299,300,301,302,303,304,305,306,307,308,309,310,311,312,313,314,315,316,317,318,319,320,356,357,358,359,360,361,362,363,364,365,367,368,369,370,371,372,373,374,375,376,384
"33",2,3,4,5,6,7,8,30,31,32,33,34,35,36,37,38,39,40,41,42,43,44,45,46,47,48,49,50,51,52,53,54,55,56,57,58,59,60,61,62,63,64,100,101,102,103,104,106,107,108,109,110,111,112,113,114,115,116,117,118,119,120,128,130,131,132,133,134,135,136,158,159,160,161,162,163,164,165,166,167,168,169,170,171,172,173,174,175,176,177,178,179,180,181,182,183,184,185,186,187,188,189,190,191,192,228,229,230,231,232,234,235,236,237,238,239,240,241,242,243,244,245,246,247,248,256,258,259,260,261,262,263,264,286,287,288,289,290,291,292,293,294,295,296,297,298,299,300,301,302,303,304,305,306,307,308,309,310,311,312,313,314,315,316,317,318,319,320,356,357,358,359,360,362,363,364,365,366,367,368,369,370,371,372,373,374,375,376,384
"34",2,3,4,5,6,7,8,30,31,32,33,34,35,36,37,39,40,41,42,43,44,45,46,47,48,49,50,51,52,53,54,55,56,57,58,59,60,61,62,63,64,100,101,102,103,104,105,106,107,108,109,110,111,112,113,114,115,116,117,118,119,120,128,130,131,132,133,134,135,136,158,159,160,161,162,163,164,165,167,168,169,170,171,172,173,174,175,176,177,178,179,180,181,182,183,184,185,186,187,188,189,190,191,192,228,229,230,231,232,233,234,235,236,237,238,239,240,241,242,243,244,245,246,247,248,256,258,259,260,261,262,263,264,286,287,288,289,290,291,292,293,295,296,297,298,299,300,301,302,303,304,305,306,307,308,309,310,311,312,313,314,315,316,317,318,319,320,356,357,358,359,360,361,362,363,364,365,366,367,368,369,370,371,372,373,374,375,376,384
"35",2,3,4,5,6,7,8,30,31,32,33,34,35,36,37,38,39,40,41,42,44,45,46,47,48,49,50,51,52,53,54,55,56,57,58,59,60,61,62,63,64,100,101,102,103,104,105,106,107,108,109,110,111,112,113,114,115,116,117,118,119,120,128,130,131,132,133,134,135,136,158,159,160,161,162,163,164,165,166,167,168,169,170,172,173,174,175,176,177,178,179,180,181,182,183,184,185,186,187,188,189,190,191,192,228,229,230,231,232,233,234,235,236,237,238,239,240,241,242,243,244,245,246,247,248,256,258,259,260,261,262,263,264,286,287,288,289,290,291,292,293,294,295,296,297,298,300,301,302,303,304,305,306,307,308,309,310,311,312,313,314,315,316,317,318,319,320,356,357,358,359,360,361,362,363,364,365,366,367,368,369,370,371,372,373,374,375,376,384
"36",2,3,4,5,6,7,8,30,31,32,33,34,35,36,37,38,39,40,41,42,43,44,45,46,47,48,49,50,51,52,53,54,55,56,57,58,59,60,61,62,63,64,100,101,103,104,105,106,107,108,109,110,111,112,113,114,115,116,117,118,119,120,128,130,131,132,133,134,135,136,158,159,160,161,162,163,164,165,166,167,168,169,170,171,172,173,174,175,176,177,178,179,180,181,182,183,184,185,186,187,188,189,190,191,192,228,229,231,232,233,234,235,236,237,238,239,240,241,242,243,244,245,246,247,248,256,258,259,260,261,262,263,264,286,287,288,289,290,291,292,293,294,295,296,297,298,299,300,301,302,303,304,305,306,307,308,309,310,311,312,313,314,315,316,317,318,319,320,356,357,359,360,361,362,363,364,365,366,367,368,369,370,371,372,373,374,375,376,384
"37",2,3,4,5,6,7,8,30,31,32,33,34,35,36,37,38,39,40,41,42,43,44,45,46,47,48,49,50,51,52,53,54,55,56,57,58,59,60,61,62,64,100,101,102,103,104,105,106,107,108,109,110,111,112,113,114,115,116,117,118,119,120,128,130,131,132,133,134,135,136,158,159,160,161,162,163,164,165,166,167,168,169,170,171,172,173,174,175,176,177,178,179,180,181,182,183,184,185,186,187,188,189,190,192,228,229,230,231,232,233,234,235,236,237,238,239,240,241,242,243,244,245,246,247,248,256,258,259,260,261,262,263,264,286,287,288,289,290,291,292,293,294,295,296,297,298,299,300,301,302,303,304,305,306,307,308,309,310,311,312,313,314,315,316,317,318,320,356,357,358,359,360,361,362,363,364,365,366,367,368,369,370,371,372,373,374,375,376,384
"38",2,3,4,5,6,7,8,30,31,32,33,34,35,36,37,38,39,40,41,42,43,44,45,46,47,48,49,50,51,52,53,55,56,57,58,59,60,61,62,63,64,100,101,102,103,104,105,106,107,108,109,110,111,112,113,114,115,116,117,118,119,120,128,130,131,132,133,134,135,136,158,159,160,161,162,163,164,165,166,167,168,169,170,171,172,173,174,175,176,177,178,179,180,181,183,184,185,186,187,188,189,190,191,192,228,229,230,231,232,233,234,235,236,237,238,239,240,241,242,243,244,245,246,247,248,256,258,259,260,261,262,263,264,286,287,288,289,290,291,292,293,294,295,296,297,298,299,300,301,302,303,304,305,306,307,308,309,311,312,313,314,315,316,317,318,319,320,356,357,358,359,360,361,362,363,364,365,366,367,368,369,370,371,372,373,374,375,376,384
"39",2,3,4,6,7,8,30,31,32,33,34,35,36,37,38,39,40,41,42,43,44,45,46,47,48,49,50,51,52,53,54,55,56,57,58,59,60,61,62,63,64,100,101,102,103,104,105,106,107,108,109,110,111,112,113,114,115,116,117,118,119,120,128,130,131,132,134,135,136,158,159,160,161,162,163,164,165,166,167,168,169,170,171,172,173,174,175,176,177,178,179,180,181,182,183,184,185,186,187,188,189,190,191,192,228,229,230,231,232,233,234,235,236,237,238,239,240,241,242,243,244,245,246,247,248,256,258,259,260,262,263,264,286,287,288,289,290,291,292,293,294,295,296,297,298,299,300,301,302,303,304,305,306,307,308,309,310,311,312,313,314,315,316,317,318,319,320,356,357,358,359,360,361,362,363,364,365,366,367,368,369,370,371,372,373,374,375,376,384
"40",2,3,4,5,6,8,30,31,32,33,34,35,36,37,38,39,40,41,42,43,44,45,46,47,48,49,50,51,52,53,54,55,56,57,58,59,60,61,62,63,64,100,101,102,103,104,105,106,107,108,109,110,111,112,113,114,115,116,117,118,119,120,128,130,131,132,133,134,136,158,159,160,161,162,163,164,165,166,167,168,169,170,171,172,173,174,175,176,177,178,179,180,181,182,183,184,185,186,187,188,189,190,191,192,228,229,230,231,232,233,234,235,236,237,238,239,240,241,242,243,244,245,246,247,248,256,258,259,260,261,262,264,286,287,288,289,290,291,292,293,294,295,296,297,298,299,300,301,302,303,304,305,306,307,308,309,310,311,312,313,314,315,316,317,318,319,320,356,357,358,359,360,361,362,363,364,365,366,367,368,369,370,371,372,373,374,375,376,384
"41",2,3,4,5,6,7,8,30,31,32,33,34,35,36,37,38,39,40,41,42,43,44,45,46,47,48,49,50,51,52,53,54,55,56,57,58,59,60,61,63,64,100,101,102,103,104,105,106,107,108,109,110,111,112,113,114,115,116,117,118,119,120,128,130,131,132,133,134,135,136,158,159,160,161,162,163,164,165,166,167,168,169,170,171,172,173,174,175,176,177,178,179,180,181,182,183,184,185,186,187,188,189,191,192,228,229,230,231,232,233,234,235,236,237,238,239,240,241,242,243,244,245,246,247,248,256,258,259,260,261,262,263,264,286,287,288,289,290,291,292,293,294,295,296,297,298,299,300,301,302,303,304,305,306,307,308,309,310,311,312,313,314,315,316,317,319,320,356,357,358,359,360,361,362,363,364,365,366,367,368,369,370,371,372,373,374,375,376,384
"42",2,3,4,5,6,7,8,30,31,32,33,34,35,36,37,38,39,40,41,42,43,44,45,46,47,48,49,50,51,52,53,54,55,56,57,58,59,60,61,62,63,100,101,102,103,104,105,106,107,108,109,110,111,112,113,114,115,116,117,118,119,120,128,130,131,132,133,134,135,136,158,159,160,161,162,163,164,165,166,167,168,169,170,171,172,173,174,175,176,177,178,179,180,181,182,183,184,185,186,187,188,189,190,191,228,229,230,231,232,233,234,235,236,237,238,239,240,241,242,243,244,245,246,247,248,256,258,259,260,261,262,263,264,286,287,288,289,290,291,292,293,294,295,296,297,298,299,300,301,302,303,304,305,306,307,308,309,310,311,312,313,314,315,316,317,318,319,356,357,358,359,360,361,362,363,364,365,366,367,368,369,370,371,372,373,374,375,376,384
"43",2,3,4,5,6,7,8,30,31,32,33,34,35,36,37,38,39,40,41,42,43,44,45,46,47,48,49,50,51,52,53,54,55,56,57,58,59,60,61,62,63,64,100,101,102,103,104,105,106,107,109,110,111,112,113,114,115,116,117,118,119,120,128,130,131,132,133,134,135,136,158,159,160,161,162,163,164,165,166,167,168,169,170,171,172,173,174,175,176,177,178,179,180,181,182,183,184,185,186,187,188,189,190,191,192,228,229,230,231,232,233,234,235,237,238,239,240,241,242,243,244,245,246,247,248,256,258,259,260,261,262,263,264,286,287,288,289,290,291,292,293,294,295,296,297,298,299,300,301,302,303,304,305,306,307,308,309,310,311,312,313,314,315,316,317,318,319,320,356,357,358,359,360,361,362,363,365,366,367,368,369,370,371,372,373,374,375,376,384
"44",2,3,4,5,6,7,8,30,31,32,33,34,35,36,37,38,39,40,41,42,43,44,45,46,47,48,49,50,51,52,53,54,55,56,57,58,60,61,62,63,64,100,101,102,103,104,105,106,107,108,109,110,111,112,113,114,115,116,117,118,119,120,128,130,131,132,133,134,135,136,158,159,160,161,162,163,164,165,166,167,168,169,170,171,172,173,174,175,176,177,178,179,180,181,182,183,184,185,186,188,189,190,191,192,228,229,230,231,232,233,234,235,236,237,238,239,240,241,242,243,244,245,246,247,248,256,258,259,260,261,262,263,264,286,287,288,289,290,291,292,293,294,295,296,297,298,299,300,301,302,303,304,305,306,307,308,309,310,311,312,313,314,316,317,318,319,320,356,357,358,359,360,361,362,363,364,365,366,367,368,369,370,371,372,373,374,375,376,384
"45",2,3,4,5,6,7,8,30,31,32,34,35,36,37,38,39,40,41,42,43,44,45,46,47,48,49,50,51,52,53,54,55,56,57,58,59,60,61,62,63,64,100,101,102,103,104,105,106,107,108,109,110,111,112,113,114,115,116,117,118,119,120,128,130,131,132,133,134,135,136,158,159,160,162,163,164,165,166,167,168,169,170,171,172,173,174,175,176,177,178,179,180,181,182,183,184,185,186,187,188,189,190,191,192,228,229,230,231,232,233,234,235,236,237,238,239,240,241,242,243,244,245,246,247,248,256,258,259,260,261,262,263,264,286,287,288,290,291,292,293,294,295,296,297,298,299,300,301,302,303,304,305,306,307,308,309,310,311,312,313,314,315,316,317,318,319,320,356,357,358,359,360,361,362,363,364,365,366,367,368,369,370,371,372,373,374,375,376,384
"46",2,3,4,5,6,7,8,30,31,32,33,34,35,36,37,38,39,40,41,42,43,44,45,46,47,48,49,50,51,52,53,54,55,56,57,58,59,60,61,62,63,64,100,101,103,104,105,106,107,108,109,110,111,112,113,114,115,116,117,118,119,120,128,130,131,132,133,134,135,136,158,159,160,161,162,163,164,165,166,167,168,169,170,171,172,173,174,175,176,177,178,179,180,181,182,183,184,185,186,187,188,189,190,191,192,228,229,231,232,233,234,235,236,237,238,239,240,241,242,243,244,245,246,247,248,256,258,259,260,261,262,263,264,286,287,288,289,290,291,292,293,294,295,296,297,298,299,300,301,302,303,304,305,306,307,308,309,310,311,312,313,314,315,316,317,318,319,320,356,357,359,360,361,362,363,364,365,366,367,368,369,370,371,372,373,374,375,376,384
"47",2,3,4,5,6,7,8,30,31,32,33,34,35,36,37,38,39,40,41,42,43,44,45,46,47,48,49,50,51,53,54,55,56,57,58,59,60,61,62,63,64,100,101,102,103,104,105,106,107,108,109,110,111,112,113,114,115,116,117,118,119,120,128,130,131,132,133,134,135,136,158,159,160,161,162,163,164,165,166,167,168,169,170,171,172,173,174,175,176,177,178,179,181,182,183,184,185,186,187,188,189,190,191,192,228,229,230,231,232,233,234,235,236,237,238,239,240,241,242,243,244,245,246,247,248,256,258,259,260,261,262,263,264,286,287,288,289,290,291,292,293,294,295,296,297,298,299,300,301,302,303,304,305,306,307,309,310,311,312,313,314,315,316,317,318,319,320,356,357,358,359,360,361,362,363,364,365,366,367,368,369,370,371,372,373,374,375,376,384
"48",2,3,4,5,6,7,30,31,32,33,34,35,36,37,38,39,40,41,42,43,44,45,46,47,48,49,50,51,52,53,54,55,56,57,58,59,60,61,62,63,64,100,101,102,103,104,105,106,107,108,109,110,111,112,113,114,115,116,117,118,119,120,128,130,131,132,133,134,135,158,159,160,161,162,163,164,165,166,167,168,169,170,171,172,173,174,175,176,177,178,179,180,181,182,183,184,185,186,187,188,189,190,191,192,228,229,230,231,232,233,234,235,236,237,238,239,240,241,242,243,244,245,246,247,248,256,258,259,260,261,262,263,286,287,288,289,290,291,292,293,294,295,296,297,298,299,300,301,302,303,304,305,306,307,308,309,310,311,312,313,314,315,316,317,318,319,320,356,357,358,359,360,361,362,363,364,365,366,367,368,369,370,371,372,373,374,375,376,384
"49",2,3,4,5,6,7,8,30,31,32,33,34,35,36,37,38,39,40,41,42,43,44,45,46,47,48,50,51,52,53,54,55,56,57,58,59,60,61,62,63,64,100,101,102,103,104,105,106,107,108,109,110,111,112,113,114,115,116,117,118,119,120,128,130,131,132,133,134,135,136,158,159,160,161,162,163,164,165,166,167,168,169,170,171,172,173,174,175,176,178,179,180,181,182,183,184,185,186,187,188,189,190,191,192,228,229,230,231,232,233,234,235,236,237,238,239,240,241,242,243,244,245,246,247,248,256,258,259,260,261,262,263,264,286,287,288,289,290,291,292,293,294,295,296,297,298,299,300,301,302,303,304,306,307,308,309,310,311,312,313,314,315,316,317,318,319,320,356,357,358,359,360,361,362,363,364,365,366,367,368,369,370,371,372,373,374,375,376,384
"50",2,4,5,6,7,8,30,31,32,33,34,35,36,37,38,39,40,41,42,43,44,45,46,47,48,49,50,51,52,53,54,55,56,57,58,59,60,61,62,63,64,100,101,102,103,104,105,106,107,108,109,110,111,112,113,114,115,116,117,118,119,120,128,130,132,133,134,135,136,158,159,160,161,162,163,164,165,166,167,168,169,170,171,172,173,174,175,176,177,178,179,180,181,182,183,184,185,186,187,188,189,190,191,192,228,229,230,231,232,233,234,235,236,237,238,239,240,241,242,243,244,245,246,247,248,256,258,260,261,262,263,264,286,287,288,289,290,291,292,293,294,295,296,297,298,299,300,301,302,303,304,305,306,307,308,309,310,311,312,313,314,315,316,317,318,319,320,356,357,358,359,360,361,362,363,364,365,366,367,368,369,370,371,372,373,374,375,376,384
"51",2,3,4,5,6,7,8,30,31,32,33,34,35,36,37,38,39,40,41,42,43,44,45,46,47,48,49,50,51,52,53,54,55,57,58,59,60,61,62,63,64,100,101,102,103,104,105,106,107,108,109,110,111,112,113,114,115,116,117,118,119,120,128,130,131,132,133,134,135,136,158,159,160,161,162,163,164,165,166,167,168,169,170,171,172,173,174,175,176,177,178,179,180,181,182,183,185,186,187,188,189,190,191,192,228,229,230,231,232,233,234,235,236,237,238,239,240,241,242,243,244,245,246,247,248,256,258,259,260,261,262,263,264,286,287,288,289,290,291,292,293,294,295,296,297,298,299,300,301,302,303,304,305,306,307,308,309,310,311,313,314,315,316,317,318,319,320,356,357,358,359,360,361,362,363,364,365,366,367,368,369,370,371,372,373,374,375,376,384
"52",2,3,4,5,6,7,8,30,31,32,33,34,35,36,37,38,39,40,41,42,43,44,45,46,47,48,49,50,51,52,53,54,55,56,57,58,59,60,61,62,63,64,100,101,102,103,104,105,106,107,108,109,110,111,112,113,114,115,117,118,119,120,128,130,131,132,133,134,135,136,158,159,160,161,162,163,164,165,166,167,168,169,170,171,172,173,174,175,176,177,178,179,180,181,182,183,184,185,186,187,188,189,190,191,192,228,229,230,231,232,233,234,235,236,237,238,239,240,241,242,243,245,246,247,248,256,258,259,260,261,262,263,264,286,287,288,289,290,291,292,293,294,295,296,297,298,299,300,301,302,303,304,305,306,307,308,309,310,311,312,313,314,315,316,317,318,319,320,356,357,358,359,360,361,362,363,364,365,366,367,368,369,370,371,373,374,375,376,384
"53",2,3,4,5,6,7,8,30,31,32,33,34,35,36,37,38,39,40,41,42,43,44,45,46,47,48,49,50,51,53,54,55,56,57,58,59,60,61,62,63,64,100,101,102,103,104,105,106,107,108,109,110,111,112,113,114,115,116,117,118,119,120,128,130,131,132,133,134,135,136,158,159,160,161,162,163,164,165,166,167,168,169,170,171,172,173,174,175,176,177,178,179,181,182,183,184,185,186,187,188,189,190,191,192,228,229,230,231,232,233,234,235,236,237,238,239,240,241,242,243,244,245,246,247,248,256,258,259,260,261,262,263,264,286,287,288,289,290,291,292,293,294,295,296,297,298,299,300,301,302,303,304,305,306,307,309,310,311,312,313,314,315,316,317,318,319,320,356,357,358,359,360,361,362,363,364,365,366,367,368,369,370,371,372,373,374,375,376,384
"54",2,3,4,5,6,7,8,30,31,32,33,34,35,36,37,38,39,40,41,42,43,44,45,46,47,48,50,51,52,53,54,55,56,57,58,59,60,61,62,63,64,100,101,102,103,104,105,106,107,108,109,110,111,112,113,114,115,116,117,118,119,120,128,130,131,132,133,134,135,136,158,159,160,161,162,163,164,165,166,167,168,169,170,171,172,173,174,175,176,178,179,180,181,182,183,184,185,186,187,188,189,190,191,192,228,229,230,231,232,233,234,235,236,237,238,239,240,241,242,243,244,245,246,247,248,256,258,259,260,261,262,263,264,286,287,288,289,290,291,292,293,294,295,296,297,298,299,300,301,302,303,304,306,307,308,309,310,311,312,313,314,315,316,317,318,319,320,356,357,358,359,360,361,362,363,364,365,366,367,368,369,370,371,372,373,374,375,376,384
"55",3,4,5,6,7,8,30,31,32,33,34,35,36,37,38,39,40,41,42,43,44,45,46,47,48,49,50,51,52,53,54,55,56,57,58,59,60,61,62,63,64,100,101,102,103,104,105,106,107,108,109,110,111,112,113,114,115,116,117,118,119,120,128,131,132,133,134,135,136,158,159,160,161,162,163,164,165,166,167,168,169,170,171,172,173,174,175,176,177,178,179,180,181,182,183,184,185,186,187,188,189,190,191,192,228,229,230,231,232,233,234,235,236,237,238,239,240,241,242,243,244,245,246,247,248,256,259,260,261,262,263,264,286,287,288,289,290,291,292,293,294,295,296,297,298,299,300,301,302,303,304,305,306,307,308,309,310,311,312,313,314,315,316,317,318,319,320,356,357,358,359,360,361,362,363,364,365,366,367,368,369,370,371,372,373,374,375,376,384
"56",2,3,4,5,6,7,8,30,31,32,33,34,35,36,37,38,39,40,41,42,43,44,45,46,47,48,49,50,51,52,53,54,55,56,57,58,59,60,61,62,63,64,100,102,103,104,105,106,107,108,109,110,111,112,113,114,115,116,117,118,119,120,128,130,131,132,133,134,135,136,158,159,160,161,162,163,164,165,166,167,168,169,170,171,172,173,174,175,176,177,178,179,180,181,182,183,184,185,186,187,188,189,190,191,192,228,230,231,232,233,234,235,236,237,238,239,240,241,242,243,244,245,246,247,248,256,258,259,260,261,262,263,264,286,287,288,289,290,291,292,293,294,295,296,297,298,299,300,301,302,303,304,305,306,307,308,309,310,311,312,313,314,315,316,317,318,319,320,356,358,359,360,361,362,363,364,365,366,367,368,369,370,371,372,373,374,375,376,384
"57",2,3,4,5,6,7,8,30,31,32,33,34,35,36,37,38,39,40,41,42,43,44,45,46,47,48,49,50,51,52,53,54,55,56,57,58,59,60,61,62,63,64,100,101,102,103,105,106,107,108,109,110,111,112,113,114,115,116,117,118,119,120,128,130,131,132,133,134,135,136,158,159,160,161,162,163,164,165,166,167,168,169,170,171,172,173,174,175,176,177,178,179,180,181,182,183,184,185,186,187,188,189,190,191,192,228,229,230,231,233,234,235,236,237,238,239,240,241,242,243,244,245,246,247,248,256,258,259,260,261,262,263,264,286,287,288,289,290,291,292,293,294,295,296,297,298,299,300,301,302,303,304,305,306,307,308,309,310,311,312,313,314,315,316,317,318,319,320,356,357,358,359,361,362,363,364,365,366,367,368,369,370,371,372,373,374,375,376,384
"58",2,3,4,5,6,7,8,30,31,32,33,34,35,36,37,38,39,41,42,43,44,45,46,47,48,49,50,51,52,53,54,55,56,57,58,59,60,61,62,63,64,100,101,102,103,104,105,106,107,108,109,110,111,112,113,114,115,116,117,118,119,120,128,130,131,132,133,134,135,136,158,159,160,161,162,163,164,165,166,167,169,170,171,172,173,174,175,176,177,178,179,180,181,182,183,184,185,186,187,188,189,190,191,192,228,229,230,231,232,233,234,235,236,237,238,239,240,241,242,243,244,245,246,247,248,256,258,259,260,261,262,263,264,286,287,288,289,290,291,292,293,294,295,297,298,299,300,301,302,303,304,305,306,307,308,309,310,311,312,313,314,315,316,317,318,319,320,356,357,358,359,360,361,362,363,364,365,366,367,368,369,370,371,372,373,374,375,376,384
"59",2,3,4,5,6,7,8,30,31,32,33,34,35,36,37,38,39,41,42,43,44,45,46,47,48,49,50,51,52,53,54,55,56,57,58,59,60,61,62,63,64,100,101,102,103,104,105,106,107,108,109,110,111,112,113,114,115,116,117,118,119,120,128,130,131,132,133,134,135,136,158,159,160,161,162,163,164,165,166,167,169,170,171,172,173,174,175,176,177,178,179,180,181,182,183,184,185,186,187,188,189,190,191,192,228,229,230,231,232,233,234,235,236,237,238,239,240,241,242,243,244,245,246,247,248,256,258,259,260,261,262,263,264,286,287,288,289,290,291,292,293,294,295,297,298,299,300,301,302,303,304,305,306,307,308,309,310,311,312,313,314,315,316,317,318,319,320,356,357,358,359,360,361,362,363,364,365,366,367,368,369,370,371,372,373,374,375,376,384
"60",2,3,4,5,6,7,8,30,31,32,33,34,35,37,38,39,40,41,42,43,44,45,46,47,48,49,50,51,52,53,54,55,56,57,58,59,60,61,62,63,64,100,101,102,103,104,105,106,107,108,109,110,111,112,113,114,115,116,117,118,119,120,128,130,131,132,133,134,135,136,158,159,160,161,162,163,165,166,167,168,169,170,171,172,173,174,175,176,177,178,179,180,181,182,183,184,185,186,187,188,189,190,191,192,228,229,230,231,232,233,234,235,236,237,238,239,240,241,242,243,244,245,246,247,248,256,258,259,260,261,262,263,264,286,287,288,289,290,291,293,294,295,296,297,298,299,300,301,302,303,304,305,306,307,308,309,310,311,312,313,314,315,316,317,318,319,320,356,357,358,359,360,361,362,363,364,365,366,367,368,369,370,371,372,373,374,375,376,384
"61",2,3,4,5,6,8,30,31,32,33,34,35,36,37,38,39,40,41,42,43,44,45,46,47,48,49,50,51,52,53,54,55,56,57,58,59,60,61,62,63,64,100,101,102,103,104,105,106,107,108,109,110,111,112,113,114,115,116,117,118,119,120,128,130,131,132,133,134,136,158,159,160,161,162,163,164,165,166,167,168,169,170,171,172,173,174,175,176,177,178,179,180,181,182,183,184,185,186,187,188,189,190,191,192,228,229,230,231,232,233,234,235,236,237,238,239,240,241,242,243,244,245,246,247,248,256,258,259,260,261,262,264,286,287,288,289,290,291,292,293,294,295,296,297,298,299,300,301,302,303,304,305,306,307,308,309,310,311,312,313,314,315,316,317,318,319,320,356,357,358,359,360,361,362,363,364,365,366,367,368,369,370,371,372,373,374,375,376,384
"62",2,3,4,5,6,7,8,30,31,32,33,34,35,36,37,38,39,40,41,42,43,44,45,46,47,48,49,50,51,52,53,54,55,56,57,58,59,60,61,62,63,64,100,101,102,103,104,105,106,107,108,110,111,112,113,114,115,116,117,118,119,120,128,130,131,132,133,134,135,136,158,159,160,161,162,163,164,165,166,167,168,169,170,171,172,173,174,175,176,177,178,179,180,181,182,183,184,185,186,187,188,189,190,191,192,228,229,230,231,232,233,234,235,236,238,239,240,241,242,243,244,245,246,247,248,256,258,259,260,261,262,263,264,286,287,288,289,290,291,292,293,294,295,296,297,298,299,300,301,302,303,304,305,306,307,308,309,310,311,312,313,314,315,316,317,318,319,320,356,357,358,359,360,361,362,363,364,366,367,368,369,370,371,372,373,374,375,376,384
"63",2,3,4,5,6,7,8,30,31,32,33,34,35,36,37,38,39,40,41,42,43,44,45,46,47,48,49,50,51,52,53,54,55,56,57,58,59,60,61,62,63,64,100,101,103,104,105,106,107,108,109,110,111,112,113,114,115,116,117,118,119,120,128,130,131,132,133,134,135,136,158,159,160,161,162,163,164,165,166,167,168,169,170,171,172,173,174,175,176,177,178,179,180,181,182,183,184,185,186,187,188,189,190,191,192,228,229,231,232,233,234,235,236,237,238,239,240,241,242,243,244,245,246,247,248,256,258,259,260,261,262,263,264,286,287,288,289,290,291,292,293,294,295,296,297,298,299,300,301,302,303,304,305,306,307,308,309,310,311,312,313,314,315,316,317,318,319,320,356,357,359,360,361,362,363,364,365,366,367,368,369,370,371,372,373,374,375,376,384
"64",2,3,4,5,6,8,30,31,32,33,34,35,36,37,38,39,40,41,42,43,44,45,46,47,48,49,50,51,52,53,54,55,56,57,58,59,60,61,62,63,64,100,101,102,103,104,105,106,107,108,109,110,111,112,113,114,115,116,117,118,119,120,128,130,131,132,133,134,136,158,159,160,161,162,163,164,165,166,167,168,169,170,171,172,173,174,175,176,177,178,179,180,181,182,183,184,185,186,187,188,189,190,191,192,228,229,230,231,232,233,234,235,236,237,238,239,240,241,242,243,244,245,246,247,248,256,258,259,260,261,262,264,286,287,288,289,290,291,292,293,294,295,296,297,298,299,300,301,302,303,304,305,306,307,308,309,310,311,312,313,314,315,316,317,318,319,320,356,357,358,359,360,361,362,363,364,365,366,367,368,369,370,371,372,373,374,375,376,384
"65",2,3,4,5,6,7,8,30,31,32,33,34,35,36,37,38,39,40,41,42,43,44,45,46,47,48,49,50,51,52,53,54,56,57,58,59,60,61,62,63,64,100,101,102,103,104,105,106,107,108,109,110,111,112,113,114,115,116,117,118,119,120,128,130,131,132,133,134,135,136,158,159,160,161,162,163,164,165,166,167,168,169,170,171,172,173,174,175,176,177,178,179,180,181,182,184,185,186,187,188,189,190,191,192,228,229,230,231,232,233,234,235,236,237,238,239,240,241,242,243,244,245,246,247,248,256,258,259,260,261,262,263,264,286,287,288,289,290,291,292,293,294,295,296,297,298,299,300,301,302,303,304,305,306,307,308,309,310,312,313,314,315,316,317,318,319,320,356,357,358,359,360,361,362,363,364,365,366,367,368,369,370,371,372,373,374,375,376,384
"66",2,3,4,5,6,7,8,30,31,32,33,34,35,36,37,38,39,40,41,42,43,44,45,46,47,48,49,50,51,52,53,54,55,56,57,58,59,60,61,62,63,64,100,101,102,103,104,105,106,107,108,109,110,111,112,114,115,116,117,118,119,120,128,130,131,132,133,134,135,136,158,159,160,161,162,163,164,165,166,167,168,169,170,171,172,173,174,175,176,177,178,179,180,181,182,183,184,185,186,187,188,189,190,191,192,228,229,230,231,232,233,234,235,236,237,238,239,240,242,243,244,245,246,247,248,256,258,259,260,261,262,263,264,286,287,288,289,290,291,292,293,294,295,296,297,298,299,300,301,302,303,304,305,306,307,308,309,310,311,312,313,314,315,316,317,318,319,320,356,357,358,359,360,361,362,363,364,365,366,367,368,370,371,372,373,374,375,376,384
"67",2,3,4,5,6,7,8,30,32,33,34,35,36,37,38,39,40,41,42,43,44,45,46,47,48,49,50,51,52,53,54,55,56,57,58,59,60,61,62,63,64,100,101,102,103,104,105,106,107,108,109,110,111,112,113,114,115,116,117,118,119,120,128,130,131,132,133,134,135,136,158,160,161,162,163,164,165,166,167,168,169,170,171,172,173,174,175,176,177,178,179,180,181,182,183,184,185,186,187,188,189,190,191,192,228,229,230,231,232,233,234,235,236,237,238,239,240,241,242,243,244,245,246,247,248,256,258,259,260,261,262,263,264,286,288,289,290,291,292,293,294,295,296,297,298,299,300,301,302,303,304,305,306,307,308,309,310,311,312,313,314,315,316,317,318,319,320,356,357,358,359,360,361,362,363,364,365,366,367,368,369,370,371,372,373,374,375,376,384
"68",2,3,4,5,6,7,8,30,31,33,34,35,36,37,38,39,40,41,42,43,44,45,46,47,48,49,50,51,52,53,54,55,56,57,58,59,60,61,62,63,64,100,101,102,103,104,105,106,107,108,109,110,111,112,113,114,115,116,117,118,119,120,128,130,131,132,133,134,135,136,158,159,161,162,163,164,165,166,167,168,169,170,171,172,173,174,175,176,177,178,179,180,181,182,183,184,185,186,187,188,189,190,191,192,228,229,230,231,232,233,234,235,236,237,238,239,240,241,242,243,244,245,246,247,248,256,258,259,260,261,262,263,264,286,287,289,290,291,292,293,294,295,296,297,298,299,300,301,302,303,304,305,306,307,308,309,310,311,312,313,314,315,316,317,318,319,320,356,357,358,359,360,361,362,363,364,365,366,367,368,369,370,371,372,373,374,375,376,384
"69",2,3,4,5,6,7,8,30,31,32,33,34,35,36,37,38,39,40,41,42,43,44,45,46,47,48,49,50,51,52,53,55,56,57,58,59,60,61,62,63,64,100,101,102,103,104,105,106,107,108,109,110,111,112,113,114,115,116,117,118,119,120,128,130,131,132,133,134,135,136,158,159,160,161,162,163,164,165,166,167,168,169,170,171,172,173,174,175,176,177,178,179,180,181,183,184,185,186,187,188,189,190,191,192,228,229,230,231,232,233,234,235,236,237,238,239,240,241,242,243,244,245,246,247,248,256,258,259,260,261,262,263,264,286,287,288,289,290,291,292,293,294,295,296,297,298,299,300,301,302,303,304,305,306,307,308,309,311,312,313,314,315,316,317,318,319,320,356,357,358,359,360,361,362,363,364,365,366,367,368,369,370,371,372,373,374,375,376,384
"70",2,3,4,5,6,7,8,30,31,32,33,34,35,36,37,38,39,40,41,42,43,44,45,46,47,48,49,50,51,52,53,55,56,57,58,59,60,61,62,63,64,100,101,102,103,104,105,106,107,108,109,110,111,112,113,114,115,116,117,118,119,120,128,130,131,132,133,134,135,136,158,159,160,161,162,163,164,165,166,167,168,169,170,171,172,173,174,175,176,177,178,179,180,181,183,184,185,186,187,188,189,190,191,192,228,229,230,231,232,233,234,235,236,237,238,239,240,241,242,243,244,245,246,247,248,256,258,259,260,261,262,263,264,286,287,288,289,290,291,292,293,294,295,296,297,298,299,300,301,302,303,304,305,306,307,308,309,311,312,313,314,315,316,317,318,319,320,356,357,358,359,360,361,362,363,364,365,366,367,368,369,370,371,372,373,374,375,376,384
"71",2,3,4,6,7,8,30,31,32,33,34,35,36,37,38,39,40,41,42,43,44,45,46,47,48,49,50,51,52,53,54,55,56,57,58,59,60,61,62,63,64,100,101,102,103,104,105,106,107,108,109,110,111,112,113,114,115,116,117,118,119,120,128,130,131,132,134,135,136,158,159,160,161,162,163,164,165,166,167,168,169,170,171,172,173,174,175,176,177,178,179,180,181,182,183,184,185,186,187,188,189,190,191,192,228,229,230,231,232,233,234,235,236,237,238,239,240,241,242,243,244,245,246,247,248,256,258,259,260,262,263,264,286,287,288,289,290,291,292,293,294,295,296,297,298,299,300,301,302,303,304,305,306,307,308,309,310,311,312,313,314,315,316,317,318,319,320,356,357,358,359,360,361,362,363,364,365,366,367,368,369,370,371,372,373,374,375,376,384
"72",2,3,4,5,6,7,8,30,32,33,34,35,36,37,38,39,40,41,42,43,44,45,46,47,48,49,50,51,52,53,54,55,56,57,58,59,60,61,62,63,64,100,101,102,103,104,105,106,107,108,109,110,111,112,113,114,115,116,117,118,119,120,128,130,131,132,133,134,135,136,158,160,161,162,163,164,165,166,167,168,169,170,171,172,173,174,175,176,177,178,179,180,181,182,183,184,185,186,187,188,189,190,191,192,228,229,230,231,232,233,234,235,236,237,238,239,240,241,242,243,244,245,246,247,248,256,258,259,260,261,262,263,264,286,288,289,290,291,292,293,294,295,296,297,298,299,300,301,302,303,304,305,306,307,308,309,310,311,312,313,314,315,316,317,318,319,320,356,357,358,359,360,361,362,363,364,365,366,367,368,369,370,371,372,373,374,375,376,384
"73",2,3,4,5,6,7,8,30,31,32,33,34,35,36,37,38,39,40,41,42,43,44,45,46,47,48,49,50,51,52,53,54,55,56,57,58,59,60,61,62,63,64,100,101,102,103,104,105,106,107,108,109,110,111,112,114,115,116,117,118,119,120,128,130,131,132,133,134,135,136,158,159,160,161,162,163,164,165,166,167,168,169,170,171,172,173,174,175,176,177,178,179,180,181,182,183,184,185,186,187,188,189,190,191,192,228,229,230,231,232,233,234,235,236,237,238,239,240,242,243,244,245,246,247,248,256,258,259,260,261,262,263,264,286,287,288,289,290,291,292,293,294,295,296,297,298,299,300,301,302,303,304,305,306,307,308,309,310,311,312,313,314,315,316,317,318,319,320,356,357,358,359,360,361,362,363,364,365,366,367,368,370,371,372,373,374,375,376,384
"74",2,3,4,5,6,7,8,30,31,32,33,34,35,36,37,38,39,40,41,42,43,44,45,46,47,48,49,50,51,52,53,54,55,56,57,58,59,60,61,62,63,64,100,101,102,103,104,105,106,107,108,109,110,111,112,113,114,115,117,118,119,120,128,130,131,132,133,134,135,136,158,159,160,161,162,163,164,165,166,167,168,169,170,171,172,173,174,175,176,177,178,179,180,181,182,183,184,185,186,187,188,189,190,191,192,228,229,230,231,232,233,234,235,236,237,238,239,240,241,242,243,245,246,247,248,256,258,259,260,261,262,263,264,286,287,288,289,290,291,292,293,294,295,296,297,298,299,300,301,302,303,304,305,306,307,308,309,310,311,312,313,314,315,316,317,318,319,320,356,357,358,359,360,361,362,363,364,365,366,367,368,369,370,371,373,374,375,376,384
"75",2,3,5,6,7,8,30,31,32,33,34,35,36,37,38,39,40,41,42,43,44,45,46,47,48,49,50,51,52,53,54,55,56,57,58,59,60,61,62,63,64,100,101,102,103,104,105,106,107,108,109,110,111,112,113,114,115,116,117,118,119,120,128,130,131,133,134,135,136,158,159,160,161,162,163,164,165,166,167,168,169,170,171,172,173,174,175,176,177,178,179,180,181,182,183,184,185,186,187,188,189,190,191,192,228,229,230,231,232,233,234,235,236,237,238,239,240,241,242,243,244,245,246,247,248,256,258,259,261,262,263,264,286,287,288,289,290,291,292,293,294,295,296,297,298,299,300,301,302,303,304,305,306,307,308,309,310,311,312,313,314,315,316,317,318,319,320,356,357,358,359,360,361,362,363,364,365,366,367,368,369,370,371,372,373,374,375,376,384
"76",2,3,4,5,6,7,30,31,32,33,34,35,36,37,38,39,40,41,42,43,44,45,46,47,48,49,50,51,52,53,54,55,56,57,58,59,60,61,62,63,64,100,101,102,103,104,105,106,107,108,109,110,111,112,113,114,115,116,117,118,119,120,128,130,131,132,133,134,135,158,159,160,161,162,163,164,165,166,167,168,169,170,171,172,173,174,175,176,177,178,179,180,181,182,183,184,185,186,187,188,189,190,191,192,228,229,230,231,232,233,234,235,236,237,238,239,240,241,242,243,244,245,246,247,248,256,258,259,260,261,262,263,286,287,288,289,290,291,292,293,294,295,296,297,298,299,300,301,302,303,304,305,306,307,308,309,310,311,312,313,314,315,316,317,318,319,320,356,357,358,359,360,361,362,363,364,365,366,367,368,369,370,371,372,373,374,375,376,384
"77",2,3,4,5,6,7,8,30,31,32,33,34,35,36,37,38,39,40,41,42,43,44,45,46,47,48,50,51,52,53,54,55,56,57,58,59,60,61,62,63,64,100,101,102,103,104,105,106,107,108,109,110,111,112,113,114,115,116,117,118,119,120,128,130,131,132,133,134,135,136,158,159,160,161,162,163,164,165,166,167,168,169,170,171,172,173,174,175,176,178,179,180,181,182,183,184,185,186,187,188,189,190,191,192,228,229,230,231,232,233,234,235,236,237,238,239,240,241,242,243,244,245,246,247,248,256,258,259,260,261,262,263,264,286,287,288,289,290,291,292,293,294,295,296,297,298,299,300,301,302,303,304,306,307,308,309,310,311,312,313,314,315,316,317,318,319,320,356,357,358,359,360,361,362,363,364,365,366,367,368,369,370,371,372,373,374,375,376,384
"78",2,3,4,5,6,7,8,30,31,32,33,34,35,36,37,38,39,40,41,42,43,44,45,46,47,48,49,50,51,52,53,54,55,57,58,59,60,61,62,63,64,100,101,102,103,104,105,106,107,108,109,110,111,112,113,114,115,116,117,118,119,120,128,130,131,132,133,134,135,136,158,159,160,161,162,163,164,165,166,167,168,169,170,171,172,173,174,175,176,177,178,179,180,181,182,183,185,186,187,188,189,190,191,192,228,229,230,231,232,233,234,235,236,237,238,239,240,241,242,243,244,245,246,247,248,256,258,259,260,261,262,263,264,286,287,288,289,290,291,292,293,294,295,296,297,298,299,300,301,302,303,304,305,306,307,308,309,310,311,313,314,315,316,317,318,319,320,356,357,358,359,360,361,362,363,364,365,366,367,368,369,370,371,372,373,374,375,376,384
"79",2,3,4,5,6,7,8,30,31,32,33,34,35,36,37,38,39,40,41,42,43,44,45,46,47,48,49,50,51,52,53,54,55,56,57,58,59,60,61,62,63,64,100,101,102,103,104,105,106,107,108,109,110,111,112,113,114,116,117,118,119,120,128,130,131,132,133,134,135,136,158,159,160,161,162,163,164,165,166,167,168,169,170,171,172,173,174,175,176,177,178,179,180,181,182,183,184,185,186,187,188,189,190,191,192,228,229,230,231,232,233,234,235,236,237,238,239,240,241,242,244,245,246,247,248,256,258,259,260,261,262,263,264,286,287,288,289,290,291,292,293,294,295,296,297,298,299,300,301,302,303,304,305,306,307,308,309,310,311,312,313,314,315,316,317,318,319,320,356,357,358,359,360,361,362,363,364,365,366,367,368,369,370,372,373,374,375,376,384
"80",2,3,4,5,6,7,8,30,31,32,33,34,35,36,37,38,39,40,41,42,43,44,45,46,47,48,49,50,51,52,53,54,55,56,57,58,59,60,61,62,63,64,100,101,103,104,105,106,107,108,109,110,111,112,113,114,115,116,117,118,119,120,128,130,131,132,133,134,135,136,158,159,160,161,162,163,164,165,166,167,168,169,170,171,172,173,174,175,176,177,178,179,180,181,182,183,184,185,186,187,188,189,190,191,192,228,229,231,232,233,234,235,236,237,238,239,240,241,242,243,244,245,246,247,248,256,258,259,260,261,262,263,264,286,287,288,289,290,291,292,293,294,295,296,297,298,299,300,301,302,303,304,305,306,307,308,309,310,311,312,313,314,315,316,317,318,319,320,356,357,359,360,361,362,363,364,365,366,367,368,369,370,371,372,373,374,375,376,384
"81",2,3,4,5,6,7,8,30,31,32,33,34,35,36,37,38,39,40,41,42,43,44,45,46,47,48,49,50,51,52,53,54,55,56,57,58,59,60,61,62,63,64,100,101,102,103,104,105,106,107,108,109,110,111,112,113,114,115,116,117,119,120,128,130,131,132,133,134,135,136,158,159,160,161,162,163,164,165,166,167,168,169,170,171,172,173,174,175,176,177,178,179,180,181,182,183,184,185,186,187,188,189,190,191,192,228,229,230,231,232,233,234,235,236,237,238,239,240,241,242,243,244,245,247,248,256,258,259,260,261,262,263,264,286,287,288,289,290,291,292,293,294,295,296,297,298,299,300,301,302,303,304,305,306,307,308,309,310,311,312,313,314,315,316,317,318,319,320,356,357,358,359,360,361,362,363,364,365,366,367,368,369,370,371,372,373,375,376,384
"82",2,3,4,5,6,7,8,30,31,33,34,35,36,37,38,39,40,41,42,43,44,45,46,47,48,49,50,51,52,53,54,55,56,57,58,59,60,61,62,63,64,100,101,102,103,104,105,106,107,108,109,110,111,112,113,114,115,116,117,118,119,120,128,130,131,132,133,134,135,136,158,159,161,162,163,164,165,166,167,168,169,170,171,172,173,174,175,176,177,178,179,180,181,182,183,184,185,186,187,188,189,190,191,192,228,229,230,231,232,233,234,235,236,237,238,239,240,241,242,243,244,245,246,247,248,256,258,259,260,261,262,263,264,286,287,289,290,291,292,293,294,295,296,297,298,299,300,301,302,303,304,305,306,307,308,309,310,311,312,313,314,315,316,317,318,319,320,356,357,358,359,360,361,362,363,364,365,366,367,368,369,370,371,372,373,374,375,376,384
"83",2,3,4,5,6,7,8,30,31,32,34,35,36,37,38,39,40,41,42,43,44,45,46,47,48,49,50,51,52,53,54,55,56,57,58,59,60,61,62,63,64,100,101,102,103,104,105,106,107,108,109,110,111,112,113,114,115,116,117,118,119,120,128,130,131,132,133,134,135,136,158,159,160,162,163,164,165,166,167,168,169,170,171,172,173,174,175,176,177,178,179,180,181,182,183,184,185,186,187,188,189,190,191,192,228,229,230,231,232,233,234,235,236,237,238,239,240,241,242,243,244,245,246,247,248,256,258,259,260,261,262,263,264,286,287,288,290,291,292,293,294,295,296,297,298,299,300,301,302,303,304,305,306,307,308,309,310,311,312,313,314,315,316,317,318,319,320,356,357,358,359,360,361,362,363,364,365,366,367,368,369,370,371,372,373,374,375,376,384
"84",2,3,4,5,6,7,8,30,31,32,33,34,35,36,37,38,39,40,41,42,43,44,45,46,47,48,49,50,51,52,54,55,56,57,58,59,60,61,62,63,64,100,101,102,103,104,105,106,107,108,109,110,111,112,113,114,115,116,117,118,119,120,128,130,131,132,133,134,135,136,158,159,160,161,162,163,164,165,166,167,168,169,170,171,172,173,174,175,176,177,178,179,180,182,183,184,185,186,187,188,189,190,191,192,228,229,230,231,232,233,234,235,236,237,238,239,240,241,242,243,244,245,246,247,248,256,258,259,260,261,262,263,264,286,287,288,289,290,291,292,293,294,295,296,297,298,299,300,301,302,303,304,305,306,307,308,310,311,312,313,314,315,316,317,318,319,320,356,357,358,359,360,361,362,363,364,365,366,367,368,369,370,371,372,373,374,375,376,384
"85",2,3,4,5,6,7,8,30,31,32,33,34,35,36,37,38,39,40,41,42,43,44,45,46,47,48,49,50,52,53,54,55,56,57,58,59,60,61,62,63,64,100,101,102,103,104,105,106,107,108,109,110,111,112,113,114,115,116,117,118,119,120,128,130,131,132,133,134,135,136,158,159,160,161,162,163,164,165,166,167,168,169,170,171,172,173,174,175,176,177,178,180,181,182,183,184,185,186,187,188,189,190,191,192,228,229,230,231,232,233,234,235,236,237,238,239,240,241,242,243,244,245,246,247,248,256,258,259,260,261,262,263,264,286,287,288,289,290,291,292,293,294,295,296,297,298,299,300,301,302,303,304,305,306,308,309,310,311,312,313,314,315,316,317,318,319,320,356,357,358,359,360,361,362,363,364,365,366,367,368,369,370,371,372,373,374,375,376,384
"86",2,3,4,5,6,7,8,30,31,32,33,34,35,36,37,38,39,40,41,42,43,44,45,46,47,48,49,50,51,52,53,54,55,56,57,58,59,60,61,62,63,64,100,102,103,104,105,106,107,108,109,110,111,112,113,114,115,116,117,118,119,120,128,130,131,132,133,134,135,136,158,159,160,161,162,163,164,165,166,167,168,169,170,171,172,173,174,175,176,177,178,179,180,181,182,183,184,185,186,187,188,189,190,191,192,228,230,231,232,233,234,235,236,237,238,239,240,241,242,243,244,245,246,247,248,256,258,259,260,261,262,263,264,286,287,288,289,290,291,292,293,294,295,296,297,298,299,300,301,302,303,304,305,306,307,308,309,310,311,312,313,314,315,316,317,318,319,320,356,358,359,360,361,362,363,364,365,366,367,368,369,370,371,372,373,374,375,376,384
"87",2,3,4,5,6,7,8,30,31,32,33,34,35,37,38,39,40,41,42,43,44,45,46,47,48,49,50,51,52,53,54,55,56,57,58,59,60,61,62,63,64,100,101,102,103,104,105,106,107,108,109,110,111,112,113,114,115,116,117,118,119,120,128,130,131,132,133,134,135,136,158,159,160,161,162,163,165,166,167,168,169,170,171,172,173,174,175,176,177,178,179,180,181,182,183,184,185,186,187,188,189,190,191,192,228,229,230,231,232,233,234,235,236,237,238,239,240,241,242,243,244,245,246,247,248,256,258,259,260,261,262,263,264,286,287,288,289,290,291,293,294,295,296,297,298,299,300,301,302,303,304,305,306,307,308,309,310,311,312,313,314,315,316,317,318,319,320,356,357,358,359,360,361,362,363,364,365,366,367,368,369,370,371,372,373,374,375,376,384
"88",2,3,4,5,6,7,8,30,31,32,33,34,35,36,37,38,39,40,41,42,43,44,45,46,47,48,49,50,51,52,53,54,55,56,57,58,59,60,61,62,63,64,100,101,102,104,105,106,107,108,109,110,111,112,113,114,115,116,117,118,119,120,128,130,131,132,133,134,135,136,158,159,160,161,162,163,164,165,166,167,168,169,170,171,172,173,174,175,176,177,178,179,180,181,182,183,184,185,186,187,188,189,190,191,192,228,229,230,232,233,234,235,236,237,238,239,240,241,242,243,244,245,246,247,248,256,258,259,260,261,262,263,264,286,287,288,289,290,291,292,293,294,295,296,297,298,299,300,301,302,303,304,305,306,307,308,309,310,311,312,313,314,315,316,317,318,319,320,356,357,358,360,361,362,363,364,365,366,367,368,369,370,371,372,373,374,375,376,384
"89",2,3,4,5,6,7,8,30,31,32,33,34,35,36,37,38,39,40,41,42,43,44,45,46,47,48,49,50,51,52,53,54,55,56,58,59,60,61,62,63,64,100,101,102,103,104,105,106,107,108,109,110,111,112,113,114,115,116,117,118,119,120,128,130,131,132,133,134,135,136,158,159,160,161,162,163,164,165,166,167,168,169,170,171,172,173,174,175,176,177,178,179,180,181,182,183,184,186,187,188,189,190,191,192,228,229,230,231,232,233,234,235,236,237,238,239,240,241,242,243,244,245,246,247,248,256,258,259,260,261,262,263,264,286,287,288,289,290,291,292,293,294,295,296,297,298,299,300,301,302,303,304,305,306,307,308,309,310,311,312,314,315,316,317,318,319,320,356,357,358,359,360,361,362,363,364,365,366,367,368,369,370,371,372,373,374,375,376,384
"90",2,3,4,5,6,7,8,30,31,32,33,34,35,36,37,38,39,40,41,42,43,44,45,46,47,48,49,50,51,52,53,54,55,56,57,58,59,60,61,62,63,64,100,101,102,103,104,105,106,107,108,110,111,112,113,114,115,116,117,118,119,120,128,130,131,132,133,134,135,136,158,159,160,161,162,163,164,165,166,167,168,169,170,171,172,173,174,175,176,177,178,179,180,181,182,183,184,185,186,187,188,189,190,191,192,228,229,230,231,232,233,234,235,236,238,239,240,241,242,243,244,245,246,247,248,256,258,259,260,261,262,263,264,286,287,288,289,290,291,292,293,294,295,296,297,298,299,300,301,302,303,304,305,306,307,308,309,310,311,312,313,314,315,316,317,318,319,320,356,357,358,359,360,361,362,363,364,366,367,368,369,370,371,372,373,374,375,376,384
"91",2,3,4,5,6,7,8,30,31,32,33,34,35,36,37,38,39,40,41,42,43,44,45,46,47,48,49,50,51,52,53,54,55,56,57,58,59,60,61,62,63,100,101,102,103,104,105,106,107,108,109,110,111,112,113,114,115,116,117,118,119,120,128,130,131,132,133,134,135,136,158,159,160,161,162,163,164,165,166,167,168,169,170,171,172,173,174,175,176,177,178,179,180,181,182,183,184,185,186,187,188,189,190,191,228,229,230,231,232,233,234,235,236,237,238,239,240,241,242,243,244,245,246,247,248,256,258,259,260,261,262,263,264,286,287,288,289,290,291,292,293,294,295,296,297,298,299,300,301,302,303,304,305,306,307,308,309,310,311,312,313,314,315,316,317,318,319,356,357,358,359,360,361,362,363,364,365,366,367,368,369,370,371,372,373,374,375,376,384
"92",2,3,4,5,6,7,8,30,31,32,33,34,35,36,37,39,40,41,42,43,44,45,46,47,48,49,50,51,52,53,54,55,56,57,58,59,60,61,62,63,64,100,101,102,103,104,105,106,107,108,109,110,111,112,113,114,115,116,117,118,119,120,128,130,131,132,133,134,135,136,158,159,160,161,162,163,164,165,167,168,169,170,171,172,173,174,175,176,177,178,179,180,181,182,183,184,185,186,187,188,189,190,191,192,228,229,230,231,232,233,234,235,236,237,238,239,240,241,242,243,244,245,246,247,248,256,258,259,260,261,262,263,264,286,287,288,289,290,291,292,293,295,296,297,298,299,300,301,302,303,304,305,306,307,308,309,310,311,312,313,314,315,316,317,318,319,320,356,357,358,359,360,361,362,363,364,365,366,367,368,369,370,371,372,373,374,375,376,384
"93",3,4,5,6,7,8,30,31,32,33,34,35,36,37,38,39,40,41,42,43,44,45,46,47,48,49,50,51,52,53,54,55,56,57,58,59,60,61,62,63,64,100,101,102,103,104,105,106,107,108,109,110,111,112,113,114,115,116,117,118,119,120,128,131,132,133,134,135,136,158,159,160,161,162,163,164,165,166,167,168,169,170,171,172,173,174,175,176,177,178,179,180,181,182,183,184,185,186,187,188,189,190,191,192,228,229,230,231,232,233,234,235,236,237,238,239,240,241,242,243,244,245,246,247,248,256,259,260,261,262,263,264,286,287,288,289,290,291,292,293,294,295,296,297,298,299,300,301,302,303,304,305,306,307,308,309,310,311,312,313,314,315,316,317,318,319,320,356,357,358,359,360,361,362,363,364,365,366,367,368,369,370,371,372,373,374,375,376,384
"94",2,3,4,5,6,7,8,30,31,32,33,34,35,36,37,38,39,40,41,42,43,44,45,46,47,48,49,50,52,53,54,55,56,57,58,59,60,61,62,63,64,100,101,102,103,104,105,106,107,108,109,110,111,112,113,114,115,116,117,118,119,120,128,130,131,132,133,134,135,136,158,159,160,161,162,163,164,165,166,167,168,169,170,171,172,173,174,175,176,177,178,180,181,182,183,184,185,186,187,188,189,190,191,192,228,229,230,231,232,233,234,235,236,237,238,239,240,241,242,243,244,245,246,247,248,256,258,259,260,261,262,263,264,286,287,288,289,290,291,292,293,294,295,296,297,298,299,300,301,302,303,304,305,306,308,309,310,311,312,313,314,315,316,317,318,319,320,356,357,358,359,360,361,362,363,364,365,366,367,368,369,370,371,372,373,374,375,376,384
"95",2,3,4,5,6,7,8,30,31,32,33,34,35,36,37,38,39,40,41,42,43,44,45,47,48,49,50,51,52,53,54,55,56,57,58,59,60,61,62,63,64,100,101,102,103,104,105,106,107,108,109,110,111,112,113,114,115,116,117,118,119,120,128,130,131,132,133,134,135,136,158,159,160,161,162,163,164,165,166,167,168,169,170,171,172,173,175,176,177,178,179,180,181,182,183,184,185,186,187,188,189,190,191,192,228,229,230,231,232,233,234,235,236,237,238,239,240,241,242,243,244,245,246,247,248,256,258,259,260,261,262,263,264,286,287,288,289,290,291,292,293,294,295,296,297,298,299,300,301,303,304,305,306,307,308,309,310,311,312,313,314,315,316,317,318,319,320,356,357,358,359,360,361,362,363,364,365,366,367,368,369,370,371,372,373,374,375,376,384
"96",2,3,4,6,7,8,30,31,32,33,34,35,36,37,38,39,40,41,42,43,44,45,46,47,48,49,50,51,52,53,54,55,56,57,58,59,60,61,62,63,64,100,101,102,103,104,105,106,107,108,109,110,111,112,113,114,115,116,117,118,119,120,128,130,131,132,134,135,136,158,159,160,161,162,163,164,165,166,167,168,169,170,171,172,173,174,175,176,177,178,179,180,181,182,183,184,185,186,187,188,189,190,191,192,228,229,230,231,232,233,234,235,236,237,238,239,240,241,242,243,244,245,246,247,248,256,258,259,260,262,263,264,286,287,288,289,290,291,292,293,294,295,296,297,298,299,300,301,302,303,304,305,306,307,308,309,310,311,312,313,314,315,316,317,318,319,320,356,357,358,359,360,361,362,363,364,365,366,367,368,369,370,371,372,373,374,375,376,384
"97",2,3,4,5,6,7,8,30,31,32,33,34,35,36,37,38,39,40,41,42,43,44,45,46,47,48,49,50,51,52,53,55,56,57,58,59,60,61,62,63,64,100,101,102,103,104,105,106,107,108,109,110,111,112,113,114,115,116,117,118,119,120,128,130,131,132,133,134,135,136,158,159,160,161,162,163,164,165,166,167,168,169,170,171,172,173,174,175,176,177,178,179,180,181,183,184,185,186,187,188,189,190,191,192,228,229,230,231,232,233,234,235,236,237,238,239,240,241,242,243,244,245,246,247,248,256,258,259,260,261,262,263,264,286,287,288,289,290,291,292,293,294,295,296,297,298,299,300,301,302,303,304,305,306,307,308,309,311,312,313,314,315,316,317,318,319,320,356,357,358,359,360,361,362,363,364,365,366,367,368,369,370,371,372,373,374,375,376,384
"98",2,3,4,5,6,7,8,30,31,32,33,34,35,36,37,38,39,40,41,42,43,44,46,47,48,49,50,51,52,53,54,55,56,57,58,59,60,61,62,63,64,100,101,102,103,104,105,106,107,108,109,110,111,112,113,114,115,116,117,118,119,120,128,130,131,132,133,134,135,136,158,159,160,161,162,163,164,165,166,167,168,169,170,171,172,174,175,176,177,178,179,180,181,182,183,184,185,186,187,188,189,190,191,192,228,229,230,231,232,233,234,235,236,237,238,239,240,241,242,243,244,245,246,247,248,256,258,259,260,261,262,263,264,286,287,288,289,290,291,292,293,294,295,296,297,298,299,300,302,303,304,305,306,307,308,309,310,311,312,313,314,315,316,317,318,319,320,356,357,358,359,360,361,362,363,364,365,366,367,368,369,370,371,372,373,374,375,376,384
"99",2,3,4,5,6,7,8,30,31,32,33,34,35,36,37,38,39,40,41,42,43,44,45,46,47,48,49,50,51,52,54,55,56,57,58,59,60,61,62,63,64,100,101,102,103,104,105,106,107,108,109,110,111,112,113,114,115,116,117,118,119,120,128,130,131,132,133,134,135,136,158,159,160,161,162,163,164,165,166,167,168,169,170,171,172,173,174,175,176,177,178,179,180,182,183,184,185,186,187,188,189,190,191,192,228,229,230,231,232,233,234,235,236,237,238,239,240,241,242,243,244,245,246,247,248,256,258,259,260,261,262,263,264,286,287,288,289,290,291,292,293,294,295,296,297,298,299,300,301,302,303,304,305,306,307,308,310,311,312,313,314,315,316,317,318,319,320,356,357,358,359,360,361,362,363,364,365,366,367,368,369,370,371,372,373,374,375,376,384
"100",2,3,4,5,6,7,8,30,31,32,33,34,35,36,37,38,39,40,41,42,43,44,45,46,48,49,50,51,52,53,54,55,56,57,58,59,60,61,62,63,64,100,101,102,103,104,105,106,107,108,109,110,111,112,113,114,115,116,117,118,119,120,128,130,131,132,133,134,135,136,158,159,160,161,162,163,164,165,166,167,168,169,170,171,172,173,174,176,177,178,179,180,181,182,183,184,185,186,187,188,189,190,191,192,228,229,230,231,232,233,234,235,236,237,238,239,240,241,242,243,244,245,246,247,248,256,258,259,260,261,262,263,264,286,287,288,289,290,291,292,293,294,295,296,297,298,299,300,301,302,304,305,306,307,308,309,310,311,312,313,314,315,316,317,318,319,320,356,357,358,359,360,361,362,363,364,365,366,367,368,369,370,371,372,373,374,375,376,384
