"","V1","V2","V3","V4","V5","V6","V7","V8","V9","V10","V11","V12","V13","V14","V15","V16","V17","V18","V19","V20","V21","V22","V23","V24","V25","V26","V27","V28","V29","V30","V31","V32","V33","V34","V35","V36"
"1",1,2,3,4,5,6,8,10,11,12,15,16,17,18,19,20,21,22,24,26,27,28,31,32,33,34,35,36,37,38,40,42,43,44,47,48
"2",2,3,5,6,7,8,10,12,13,14,15,16,18,19,21,22,23,24,26,28,29,30,31,32,34,35,37,38,39,40,42,44,45,46,47,48
"3",1,2,4,5,7,8,10,12,13,14,15,16,17,18,20,21,23,24,26,28,29,30,31,32,33,34,36,37,39,40,42,44,45,46,47,48
"4",2,3,5,6,7,8,9,11,12,13,14,15,18,19,21,22,23,24,25,27,28,29,30,31,34,35,37,38,39,40,41,43,44,45,46,47
"5",1,2,4,6,7,9,10,11,13,14,15,16,17,18,20,22,23,25,26,27,29,30,31,32,33,34,36,38,39,41,42,43,45,46,47,48
"6",2,4,5,7,9,10,11,12,13,14,15,16,18,20,21,23,25,26,27,28,29,30,31,32,34,36,37,39,41,42,43,44,45,46,47,48
"7",2,3,5,6,7,8,9,12,13,14,15,16,18,19,21,22,23,24,25,28,29,30,31,32,34,35,37,38,39,40,41,44,45,46,47,48
"8",1,2,4,6,7,8,9,10,11,12,14,16,17,18,20,22,23,24,25,26,27,28,30,32,33,34,36,38,39,40,41,42,43,44,46,48
"9",1,2,3,5,6,7,9,10,11,14,15,16,17,18,19,21,22,23,25,26,27,30,31,32,33,34,35,37,38,39,41,42,43,46,47,48
"10",1,2,7,8,9,10,11,12,13,14,15,16,17,18,23,24,25,26,27,28,29,30,31,32,33,34,39,40,41,42,43,44,45,46,47,48
"11",1,2,3,6,9,10,11,12,13,14,15,16,17,18,19,22,25,26,27,28,29,30,31,32,33,34,35,38,41,42,43,44,45,46,47,48
"12",3,4,5,7,8,9,10,11,12,14,15,16,19,20,21,23,24,25,26,27,28,30,31,32,35,36,37,39,40,41,42,43,44,46,47,48
"13",2,3,4,6,7,8,10,11,12,13,14,16,18,19,20,22,23,24,26,27,28,29,30,32,34,35,36,38,39,40,42,43,44,45,46,48
"14",1,2,3,4,5,6,8,9,11,13,14,15,17,18,19,20,21,22,24,25,27,29,30,31,33,34,35,36,37,38,40,41,43,45,46,47
"15",1,2,3,5,6,8,9,11,13,14,15,16,17,18,19,21,22,24,25,27,29,30,31,32,33,34,35,37,38,40,41,43,45,46,47,48
"16",1,2,3,4,5,7,8,9,10,12,14,15,17,18,19,20,21,23,24,25,26,28,30,31,33,34,35,36,37,39,40,41,42,44,46,47
"17",1,2,3,4,5,8,10,11,12,14,15,16,17,18,19,20,21,24,26,27,28,30,31,32,33,34,35,36,37,40,42,43,44,46,47,48
"18",2,3,4,5,6,7,8,10,11,12,14,15,18,19,20,21,22,23,24,26,27,28,30,31,34,35,36,37,38,39,40,42,43,44,46,47
"19",1,2,3,4,5,6,7,9,11,12,13,16,17,18,19,20,21,22,23,25,27,28,29,32,33,34,35,36,37,38,39,41,43,44,45,48
"20",1,3,4,6,8,9,11,12,13,14,15,16,17,19,20,22,24,25,27,28,29,30,31,32,33,35,36,38,40,41,43,44,45,46,47,48
"21",1,2,3,4,5,7,8,10,12,14,15,16,17,18,19,20,21,23,24,26,28,30,31,32,33,34,35,36,37,39,40,42,44,46,47,48
"22",1,4,5,6,8,10,11,12,13,14,15,16,17,20,21,22,24,26,27,28,29,30,31,32,33,36,37,38,40,42,43,44,45,46,47,48
"23",2,3,4,6,7,9,11,12,13,14,15,16,18,19,20,22,23,25,27,28,29,30,31,32,34,35,36,38,39,41,43,44,45,46,47,48
"24",1,3,4,5,6,7,9,10,11,12,14,15,17,19,20,21,22,23,25,26,27,28,30,31,33,35,36,37,38,39,41,42,43,44,46,47
