"","(Intercept)","TAL","C3H","COMT","FCS","CCOAOMT","DCS","CURS","TAL:C3H","TAL:COMT","TAL:FCS","TAL:CCOAOMT","TAL:DCS","TAL:CURS","C3H:COMT","C3H:FCS","C3H:CCOAOMT","C3H:DCS","C3H:CURS","COMT:FCS","COMT:CCOAOMT","COMT:DCS","COMT:CURS","FCS:CCOAOMT","FCS:DCS","FCS:CURS","CCOAOMT:DCS","CCOAOMT:CURS","DCS:CURS"
"",1.36897975100332e-17,0.39094537822389,7.34798311494831e-17,2.02038896845595e-10,0.876189902896756,0.0613957108839606,0.0455079113922606,1.5508861482219e-05,0.582421120063734,0.0227866587830494,0.000222610429968799,0.0294943096785736,3.55324383478861e-08,NA,NA,NA,0.223042843445473,NA,NA,NA,NA,NA,NA,NA,NA,NA,NA,NA,NA
"temp",1.67028970157267e-20,0.561811936623015,5.24165702258266e-20,3.38026135814122e-05,1.18367268482361e-08,0.506638669874943,0.0486368461629068,0.00239098451472626,0.0198993171365595,0.20716160500985,0.950078570842243,1.97048772441548e-06,0.00663044241253044,NA,NA,NA,NA,NA,0.00416696496718263,NA,NA,NA,NA,NA,NA,NA,NA,NA,NA
"temp",5.06515823857533e-17,0.00842899032456972,4.52832872803443e-17,1.11716961282404e-09,0.000679283402168959,1.67507522668577e-05,0.0090694910687078,0.0402618196586738,0.0263936260302572,0.0167539272713397,0.000427232527503478,0.380244179705227,0.000611780533180018,0.000473163392151579,NA,NA,NA,NA,NA,NA,NA,NA,NA,NA,NA,NA,NA,NA,NA
"temp",8.10059262304296e-19,0.104589952846912,2.82117003893728e-18,1.23088381975529e-06,2.23430300534905e-07,0.87767289696056,0.295161654463004,0.0034962682711378,0.904813829474259,0.837700560308102,0.466868308889372,4.77260826367502e-07,2.8326948170526e-06,NA,NA,NA,NA,NA,0.00589542389420213,NA,NA,NA,NA,NA,NA,NA,NA,NA,NA
"temp",1.18557465369028e-18,0.262247636287944,4.64511972560008e-18,0.0651520484379655,5.62581130386791e-05,0.0354881402334272,0.0131793600681948,0.084397154281888,0.640668048028975,0.215603305549477,0.0107160214786739,0.0759008326215193,0.00108323714440319,0.932529674139295,NA,NA,NA,NA,NA,NA,NA,NA,NA,NA,NA,NA,NA,NA,NA
"temp",8.26108750329813e-19,0.0164361373172149,5.45901372518021e-18,2.92984685503143e-07,1.00412344524393e-07,0.500493895199219,0.852456141557428,0.487787797709557,0.000946554435818983,2.6927266397404e-06,3.72347351891359e-07,0.818417064805994,0.535136856945482,NA,NA,NA,0.323059686085702,NA,NA,NA,NA,NA,NA,NA,NA,NA,NA,NA,NA
"temp",3.15021503058151e-23,0.938645953066346,1.10354481994105e-21,9.29360327408754e-12,4.62081763091544e-05,0.0954645993063392,0.503299701221348,0.00202569685827267,0.444177553770365,0.257634992676314,0.00668324305424388,3.0625602428732e-11,0.152729482284466,0.0163925862886965,NA,NA,NA,NA,NA,NA,NA,NA,NA,NA,NA,NA,NA,NA,NA
"temp",1.78394313732341e-22,0.000194196415588189,1.90058969193325e-21,0.719977259136678,1.96874541134825e-11,0.0131589887030638,0.853434590475404,0.0320300400576177,0.00397978110414008,1.35025962298884e-10,NA,0.296105810275491,0.00539426124487053,0.241254197660575,NA,NA,NA,NA,0.04145512227039,NA,NA,NA,NA,NA,NA,NA,NA,NA,NA
"temp",9.36204645161675e-20,0.678317361465777,4.18919845277251e-19,4.05618329631192e-08,0.000342426963604745,9.57473679381709e-05,0.00105248813917342,0.700964102504262,0.625407408140098,0.021260111482534,1.14518912599237e-07,0.583127307996893,NA,0.00389964423380597,NA,NA,8.63584682614148e-05,NA,NA,NA,NA,NA,NA,NA,NA,NA,NA,NA,NA
"temp",1.78087584628537e-17,4.41743043956703e-06,1.10548643765062e-21,2.84032357540678e-12,2.04336917151282e-09,0.757412929633053,1.20870014120499e-05,0.000862623487690388,1.14914666892696e-07,2.05547060780971e-06,0.992734885978845,0.00232934541219386,NA,0.0204807795944858,NA,0.000995488062880872,NA,NA,NA,NA,NA,NA,NA,NA,NA,NA,NA,NA,NA
"temp",3.92627132821393e-23,0.2705160259125,7.23596172122049e-20,4.04043986432876e-13,3.806034535839e-13,0.0201874850666252,0.100886594050916,1.017972696091e-09,0.00174103208615338,1.98724815272576e-08,0.0560926548503606,0.184099553508486,0.0143757341817867,NA,NA,NA,NA,0.102061666515604,NA,NA,NA,NA,NA,NA,NA,NA,NA,NA,NA
"temp",1.00880218385388e-21,0.345810169709517,2.87154893054336e-19,4.05569568746782e-09,7.65479133165513e-10,0.336174870779486,0.0585086461612921,0.0144532018763176,0.00214284331930573,0.189394806348282,0.0246455645370327,7.2028598128923e-05,0.000513673052854183,0.00030440709534349,NA,NA,NA,NA,NA,NA,NA,NA,NA,NA,NA,NA,NA,NA,NA
"temp",7.0684660379229e-20,0.913767160245608,1.00623467854896e-19,0.00429717230277636,5.73029484435487e-09,0.000217391377728196,0.189032371340139,0.0286195312663128,0.00299561464174729,1.85243813680382e-05,3.42401950310722e-05,0.663262364380452,0.0214697454750546,0.34463714880782,NA,NA,NA,NA,NA,NA,NA,NA,NA,NA,NA,NA,NA,NA,NA
"temp",2.71735435268899e-22,0.330304524100337,7.02375641141482e-21,3.26358245554277e-08,5.82629289849302e-08,0.0078563926363732,0.17957268860798,0.000113523979414551,0.00110481479582701,1.51711091677108e-06,0.00108668401549806,0.0103638484281712,0.179126841611334,0.468540737877458,NA,NA,NA,NA,NA,NA,NA,NA,NA,NA,NA,NA,NA,NA,NA
"temp",5.44852592807917e-17,0.978383411055027,1.07501583296774e-15,0.0584838063041871,0.882552541748562,0.0752038327675961,0.057040687802801,0.0324022834349028,0.602008346350975,0.0301006037959499,0.00360428877406702,0.196979371141478,0.939568664799339,NA,NA,NA,0.745367997008343,NA,NA,NA,NA,NA,NA,NA,NA,NA,NA,NA,NA
"temp",1.40511119215091e-19,0.0223482755484269,1.6696354711547e-16,8.94442258053579e-11,6.52634581302142e-08,4.53428902462548e-06,0.00065430525011199,0.0165580357675546,0.280419506611429,4.39956882269514e-07,0.237762892531467,2.39866238512386e-07,0.00965224476383617,NA,NA,0.000970745445459589,NA,NA,NA,NA,NA,NA,NA,NA,NA,NA,NA,NA,NA
"temp",4.13458557214699e-20,0.292845636660325,6.35968122682386e-21,7.54901216850751e-06,6.55240978645509e-08,0.000257252910365464,0.552528503778606,0.000254994232805104,0.0067049341571267,3.06606175759293e-05,2.39025033874624e-05,0.916798758441379,0.119159213002306,NA,NA,NA,NA,0.511140660134917,NA,NA,NA,NA,NA,NA,NA,NA,NA,NA,NA
"temp",3.7018398591256e-20,0.525652233367489,1.1696496345632e-21,3.40869391405368e-07,6.49925529320875e-14,6.16039175418887e-05,1.24576157373716e-05,0.000880545532577782,1.19371810100099e-07,0.36281109746546,2.56562111287663e-05,0.104603578966246,NA,0.0207211870419457,NA,0.00101579479633224,NA,NA,NA,NA,NA,NA,NA,NA,NA,NA,NA,NA,NA
"temp",1.1361932712406e-20,0.541076056485204,9.88390098244344e-16,3.08553767005157e-08,0.00354585096697459,0.0105583544496683,0.00261606343452008,5.32507031317623e-05,1.43316728485488e-05,0.0103070859271151,0.00256284484873563,0.117547497247419,NA,0.210706075762794,NA,7.13975231955926e-06,NA,NA,NA,NA,NA,NA,NA,NA,NA,NA,NA,NA,NA
"temp",8.59821973212207e-19,0.000316699201038474,4.84142976399124e-20,2.05759767070488e-06,2.32481300885814e-05,2.27705475617907e-06,2.09078918824082e-05,0.00175270015961167,0.0375544964987635,0.00766201026773293,0.0297872478650773,0.636308512427572,0.308876041302469,6.27099226752999e-09,NA,NA,NA,NA,NA,NA,NA,NA,NA,NA,NA,NA,NA,NA,NA
"temp",1.20945621034544e-20,0.449174525815026,2.05843058134371e-18,0.00015993913186523,7.11190952319264e-11,0.74793780158984,0.258899426304182,2.77789161720372e-05,0.00325256675695852,0.0464941870859695,0.01666129131234,3.43117285811947e-05,1.46548082643327e-05,NA,NA,1.35512394561985e-05,NA,NA,NA,NA,NA,NA,NA,NA,NA,NA,NA,NA,NA
"temp",7.8339177852045e-21,0.12994513525298,4.752753581133e-14,1.0220614652384e-11,2.50434853523817e-05,1.81009375468282e-07,0.00154115059560183,0.0338148506752415,0.10634996659962,0.165071908862262,7.3229669133806e-06,0.00441903960438632,0.000420194680405626,0.00150769285648479,NA,NA,NA,NA,NA,NA,NA,NA,NA,NA,NA,NA,NA,NA,NA
"temp",1.53194330394623e-18,0.967211719426381,4.91918688636049e-18,1.88827761722715e-06,0.00169550512801741,0.068748533434055,0.335734676840306,0.026379209443114,0.156004993771518,0.0313139530450529,0.873944249626899,4.03223804381808e-05,0.000381702442573573,NA,NA,NA,NA,NA,0.0527176799488904,NA,NA,NA,NA,NA,NA,NA,NA,NA,NA
"temp",3.4210351617024e-20,0.0137383378131318,1.88492468097952e-20,2.41608317476783e-07,2.90083049748146e-09,0.0259654834243045,0.0874894809425093,0.980395325137142,0.478444195200459,0.00138967137932392,0.000234357934534269,0.0309061064013629,0.0451814233859531,NA,NA,NA,NA,0.226407733203367,NA,NA,NA,NA,NA,NA,NA,NA,NA,NA,NA
"temp",6.12387919819866e-17,0.925077418895467,1.06092430110633e-17,1.08415822961907e-09,3.86979170960356e-07,0.00276515991981602,0.000502064441361103,0.160322568154481,0.00530109126491494,0.343218217000159,9.2073550415064e-05,0.196459549035646,0.000430698775199064,0.470755442680203,NA,NA,NA,NA,NA,NA,NA,NA,NA,NA,NA,NA,NA,NA,NA
"temp",1.19232744894471e-21,1.67322102036134e-07,1.26341819640083e-19,1.10891335567045e-13,3.13130837372627e-14,4.19520705750486e-10,0.938400490826925,0.00325724682171398,3.41128471310649e-06,0.384799049943633,0.000447186523663747,0.024010934644469,1.01297263221568e-05,0.0622015462905961,NA,NA,NA,NA,NA,NA,NA,NA,NA,NA,NA,NA,NA,NA,NA
"temp",4.85696085640856e-20,0.304718848024588,2.20758528163715e-18,2.2860189673101e-05,7.52444334109881e-07,0.0621678194868426,0.854038238329896,0.00167721348635224,0.0471491754316504,0.444505922554458,0.00663735308641453,0.213724163614466,0.000106001976641774,0.000248226762584337,NA,NA,NA,NA,NA,NA,NA,NA,NA,NA,NA,NA,NA,NA,NA
"temp",7.94247325596789e-17,0.978303319576748,1.64778217072412e-15,4.38216404649277e-05,0.00558465021619707,0.0375019922833626,0.244139931532691,0.364257840894411,0.600669624483886,0.381794971633816,0.994171002940741,0.195373780615689,0.00970044001539775,0.00805931259288598,NA,NA,NA,NA,NA,NA,NA,NA,NA,NA,NA,NA,NA,NA,NA
"temp",3.26662859914556e-19,0.239700171058819,5.69178810761793e-17,4.36086183225563e-05,0.341588194759743,0.101991616086337,0.000367089846985206,3.17127397451996e-05,0.0276325524421754,0.147729814644845,0.264075544343712,0.0472644222391682,0.0135926887847962,0.279892660465409,NA,NA,NA,NA,NA,NA,NA,NA,NA,NA,NA,NA,NA,NA,NA
"temp",5.51198070541487e-20,0.0039852258260925,4.30652012313571e-16,3.9018399952629e-07,5.99689627539126e-08,0.00719488822599002,0.297771594684586,0.356202737036664,0.0804054073766979,0.00477859148290414,0.235688157752037,0.000414487005803245,NA,0.00158053041400385,NA,0.000928769237632458,NA,NA,NA,NA,NA,NA,NA,NA,NA,NA,NA,NA,NA
"temp",2.5740684769921e-21,0.332144334595356,8.13174692303319e-21,1.69038228268206e-07,2.05157443807311e-05,0.476770342558343,0.0354368572928039,0.864705672029402,0.453553110958489,0.177191709824227,0.946487165973896,4.97158705117563e-05,4.20673765605388e-07,NA,NA,NA,NA,NA,0.0949462787180481,NA,NA,NA,NA,NA,NA,NA,NA,NA,NA
"temp",1.16295601957188e-19,0.000351095859082796,1.12096335680643e-16,3.4519252903073e-10,0.00182436045177251,1.96047899587886e-05,0.0576225297814498,0.0765509497176895,0.162963499872235,2.67073872844882e-05,0.993974770698686,0.0766254809725441,NA,0.000262639651791987,NA,NA,0.736188133465868,NA,NA,NA,NA,NA,NA,NA,NA,NA,NA,NA,NA
"temp",1.79060919295242e-22,8.6285130850643e-06,4.500843040841e-21,0.566521969826754,5.42455386931832e-05,0.851709084713769,3.10333267330704e-07,0.00135551031017522,0.000157785272696471,4.41538529351911e-06,0.00567057045105877,0.199472743817147,NA,0.0166114410117538,NA,NA,0.0798009361242745,NA,NA,NA,NA,NA,NA,NA,NA,NA,NA,NA,NA
"temp",1.49581269101486e-20,0.263590972422858,1.28652745307484e-19,0.181930420305272,2.61730820204534e-11,0.0423730927548205,0.000319440609409615,4.80623033087452e-08,0.50634103620347,0.000263859634684848,0.160770218799168,0.217217204498636,7.92017011539423e-11,NA,NA,NA,0.0132951239222845,NA,NA,NA,NA,NA,NA,NA,NA,NA,NA,NA,NA
"temp",2.34757311624298e-22,0.307208276862869,4.9941054481771e-19,3.77857248312669e-07,0.167503803451046,3.93908577732432e-05,8.14273880956375e-08,7.07344136925213e-10,6.24224604452156e-06,5.19950190850063e-05,0.0576033850298503,9.78885580042411e-05,3.09083244513934e-06,0.156395318159009,NA,NA,NA,NA,NA,NA,NA,NA,NA,NA,NA,NA,NA,NA,NA
"temp",1.33096316890998e-18,0.92662624101668,2.15108597351478e-18,4.37539020145072e-11,3.56612928843843e-08,0.000500340569171894,2.93692150726662e-06,0.0136363919375815,0.157184130103837,2.50932230296293e-07,0.223168956182664,0.00919765506544313,1.62047605633972e-07,NA,NA,0.00070608827122282,NA,NA,NA,NA,NA,NA,NA,NA,NA,NA,NA,NA,NA
"temp",4.63234942135372e-23,0.913734285757187,8.42476771546823e-19,1.18763881535358e-07,2.30487784167203e-09,0.0866486839410825,0.0622168817250796,3.65341310208244e-05,4.08266537132994e-05,1.9701170506052e-08,0.00088042001497713,1.76660253779527e-12,0.755351770428833,0.000168695781455728,NA,NA,NA,NA,NA,NA,NA,NA,NA,NA,NA,NA,NA,NA,NA
"temp",7.13170448525175e-19,0.253296486484901,2.80300985490129e-18,0.0603981115680497,3.02053775927002e-08,2.85392344407788e-05,0.969474846066872,0.369007185274857,0.634217403731825,0.207058834026788,0.9601675184834,0.398174227409035,5.48022176449834e-07,0.00863631784578896,NA,NA,NA,NA,NA,NA,NA,NA,NA,NA,NA,NA,NA,NA,NA
"temp",8.77530506276889e-17,0.926110780344827,1.85907813352844e-16,0.000292902285958347,5.63828358813338e-05,0.160410861823119,0.167155753591152,0.30789820177643,0.00178913513033117,0.0053046098231025,3.03226683930095e-05,0.00216590692559012,0.00257980616697,0.925350300004091,NA,NA,NA,NA,NA,NA,NA,NA,NA,NA,NA,NA,NA,NA,NA
"temp",6.35536145340025e-21,0.0242918612365063,2.89761357341466e-20,5.45815896853237e-07,1.89734025966231e-07,0.0136040754825143,0.142430572623397,0.00148504349206393,0.239323114695645,0.583537392855225,0.25017587729423,3.26055478888682e-08,0.420176844297799,0.00639660145840651,NA,NA,NA,NA,NA,NA,NA,NA,NA,NA,NA,NA,NA,NA,NA
"temp",1.49203753951051e-15,0.814572058544097,1.46599892639044e-18,1.02893235563189e-07,0.184546511566237,1.05686833633062e-07,1.71082253164374e-07,0.00558704403308281,1.14145761401487e-05,8.22004965360546e-08,0.0676481591486444,2.00440316281862e-05,5.79638197915852e-06,0.529625639645231,NA,NA,NA,NA,NA,NA,NA,NA,NA,NA,NA,NA,NA,NA,NA
"temp",5.22449769092906e-15,0.0152180381634062,8.34365323824524e-17,2.8255752043154e-09,3.59699238934401e-05,0.149110023705903,0.000700618547756713,0.362071524784229,0.629232638223532,2.22876863860361e-05,0.959578897847751,7.41879599024881e-05,NA,0.930207305957056,0.00966260296123744,NA,NA,NA,NA,NA,NA,NA,NA,NA,NA,NA,NA,NA,NA
"temp",1.84091873162905e-18,1.10450762863412e-05,2.52895475893927e-16,2.33349631351886e-07,2.5091764747343e-11,0.0106595692598538,0.0161052564744326,0.000960856530048642,0.000976872105864879,1.47386419922052e-07,0.0897441633939406,6.45610982926317e-05,0.132945335801774,4.36121146309204e-08,NA,NA,NA,NA,NA,NA,NA,NA,NA,NA,NA,NA,NA,NA,NA
"temp",2.44031753744826e-18,0.000698285380332172,3.93873705752924e-18,4.68887864026823e-11,1.00980989587626e-11,0.000368326145019511,0.0380698835397415,0.354038741524519,1.89469293169867e-05,0.00461415943425313,0.233604387584737,0.441561526578772,1.43616739812225e-07,0.839938358811233,NA,NA,NA,NA,NA,NA,NA,NA,NA,NA,NA,NA,NA,NA,NA
"temp",2.85327467337924e-17,0.167238050156772,1.19335443906614e-15,0.00178573193227739,0.000596404274615431,0.494519970524227,0.250067946730363,0.519799000041972,0.453278035919573,0.12348868333802,0.0266717850693899,0.219799478502367,0.772431451869333,0.732836306477948,NA,NA,NA,NA,NA,NA,NA,NA,NA,NA,NA,NA,NA,NA,NA
"temp",3.45091893974827e-20,0.840053033350001,3.49377780632309e-19,1.7728073067922e-08,3.03329699370306e-09,0.0381184053955484,0.0374473146067529,1.53892616490156e-05,0.524285512449981,0.558141871642827,0.00129905183307629,0.168668485394221,3.27927019102323e-07,2.42971841798505e-05,NA,NA,NA,NA,NA,NA,NA,NA,NA,NA,NA,NA,NA,NA,NA
"temp",2.53929589341685e-19,0.000406521013721042,9.71902259709032e-16,1.73284929909108e-06,0.882088480219543,0.0374566959811255,0.0501398659232708,0.0317726892182419,0.600570054969108,0.0918050516003479,0.00349090568792121,1.01853073450125e-05,0.000464000241530349,NA,NA,NA,0.744391318815517,NA,NA,NA,NA,NA,NA,NA,NA,NA,NA,NA,NA
"temp",1.75873003343252e-20,0.0039275538965496,1.06351284474872e-19,0.000935254861842966,0.00492534808039409,0.727891213270851,0.00202014797941584,2.36913900818439e-05,0.000148639253390007,0.0998530550112579,0.00121330673598848,0.802990014159412,2.96221852542484e-05,0.00340278384524307,NA,NA,NA,NA,NA,NA,NA,NA,NA,NA,NA,NA,NA,NA,NA
"temp",6.87092516298459e-15,0.00131625267745812,4.55919142501403e-19,4.65710514065981e-10,0.000435506162556254,0.0386189867247206,0.0659229453870152,0.00264717510766904,0.000168426740727569,4.54782566281936e-06,0.679811406640135,0.191204441674846,0.000516731097461224,NA,NA,NA,0.0364426736251012,NA,NA,NA,NA,NA,NA,NA,NA,NA,NA,NA,NA
"temp",7.15286149620435e-21,0.400220901336272,2.42425189595849e-15,8.13720592518602e-10,1.32712244486351e-10,0.000727149667454875,0.427126890661102,0.0195244110163152,0.389108793609029,0.336739673746494,0.160476268796039,0.564318207346098,0.394978537861675,6.63350083054816e-05,NA,NA,NA,NA,NA,NA,NA,NA,NA,NA,NA,NA,NA,NA,NA
"temp",3.79961323964364e-16,0.930198785771948,2.00959975963163e-14,0.0858755303141145,0.0180553883024628,0.00163291812307298,0.465201002188447,0.125326049656757,0.42826965661346,0.841725120026173,0.534981128325291,0.596180688914102,0.433993492421463,0.033036668003492,NA,NA,NA,NA,NA,NA,NA,NA,NA,NA,NA,NA,NA,NA,NA
"temp",1.53649263022956e-21,0.091720157322803,1.95077753994601e-20,9.2727711724809e-05,1.17619209556621e-07,0.0101689353367664,0.180052565479086,0.117226080800419,0.142869641673607,4.21689894374892e-07,7.10572911852985e-06,0.519059151276336,0.540859488977558,NA,NA,NA,NA,NA,0.0561312881340704,NA,NA,NA,NA,NA,NA,NA,NA,NA,NA
"temp",1.02447552726501e-22,0.292728362847413,4.08965375480544e-22,0.379762232617071,0.155148905252587,0.385657083377562,0.144819419475094,3.68640721098801e-10,0.854153112484446,0.332570028693287,0.0507293438236714,0.230777878767445,1.85103186980264e-12,0.144390569668108,NA,NA,NA,NA,NA,NA,NA,NA,NA,NA,NA,NA,NA,NA,NA
"temp",4.65386902124136e-24,0.600533234950994,5.00700360373208e-20,1.85175494711549e-06,2.84929130311737e-07,0.00626501242251962,0.384695977162314,0.00344267279013722,1.38000926353304e-08,6.90821602336188e-09,0.00240066253712816,1.90995296196284e-09,5.18944273595185e-09,0.0638905488463788,NA,NA,NA,NA,NA,NA,NA,NA,NA,NA,NA,NA,NA,NA,NA
"temp",1.1423443119212e-20,0.52920556785515,3.31158714859233e-19,4.29225148888791e-09,2.26984648800574e-09,0.00442268714633002,0.0178690013333744,7.57546068746224e-06,0.431430260086284,0.141408623904601,0.244439815787145,4.2348888495469e-06,0.000391351332094924,NA,NA,3.50928889231379e-05,NA,NA,NA,NA,NA,NA,NA,NA,NA,NA,NA,NA,NA
"temp",4.59081463999903e-20,0.00133132425481517,1.52876253590001e-20,2.61195395117268e-07,1.31588733569696e-10,0.0108618628301592,7.21698557867836e-07,0.0779907661886629,0.116029948437169,5.17621576018125e-06,0.358858338373348,0.145304072969571,4.70435507030502e-05,0.00571918171155598,NA,NA,NA,NA,NA,NA,NA,NA,NA,NA,NA,NA,NA,NA,NA
"temp",7.8589339677844e-25,9.61504401944734e-05,5.14213206548742e-21,3.16295937377398e-08,3.92828445940171e-09,0.0897394681239572,1.21239702605977e-05,1.32147409825138e-09,0.022650001816755,0.369779066773557,0.0154190993591953,2.9812157290394e-06,0.0718661579490534,NA,NA,NA,0.00369671973345343,NA,NA,NA,NA,NA,NA,NA,NA,NA,NA,NA,NA
"temp",7.00580701734292e-20,8.99710592570937e-07,8.52146635873294e-17,0.00028161425809424,6.82502981673093e-12,0.739469489993168,1.84459083478341e-06,5.7654974170766e-08,3.52294782979183e-05,0.00319312638754389,0.22588033397974,0.0057769100326747,0.00265086560631089,1.22348268657597e-06,NA,NA,NA,NA,NA,NA,NA,NA,NA,NA,NA,NA,NA,NA,NA
"temp",3.95925603577953e-19,6.53219231571705e-06,1.07307438350438e-20,1.91228372977548e-05,2.01458995762275e-09,5.25521860732198e-08,7.72998171501869e-05,5.26357288414172e-09,0.756639948751848,0.569485441492629,0.233156493962456,1.4376291680618e-11,7.72234529177164e-06,NA,NA,NA,NA,0.129842976179806,NA,NA,NA,NA,NA,NA,NA,NA,NA,NA,NA
"temp",2.74947318245548e-22,0.0271126594149081,1.29895600147384e-20,1.91918991468634e-09,4.55810431426267e-05,0.500478928666092,0.502860036742674,0.0020073060719543,0.00352082680822198,0.220530465523307,0.0066335574714109,7.54684622520112e-09,0.152319048838563,0.0162921186008362,NA,NA,NA,NA,NA,NA,NA,NA,NA,NA,NA,NA,NA,NA,NA
"temp",6.91001030251113e-20,0.0924788543123186,8.49287404333798e-19,1.04761635498503e-07,3.8482199341048e-05,0.0011529188290308,0.0631750045921133,0.24947009599279,0.396992303359192,0.0540877159825398,0.544428323010054,5.88216027229745e-05,0.000238041108157961,NA,NA,NA,NA,NA,0.000552594378153116,NA,NA,NA,NA,NA,NA,NA,NA,NA,NA
"temp",6.20138082519968e-23,1.92314415617159e-05,1.53328806815122e-16,5.02454230150162e-07,4.87853208167181e-13,6.97815193372981e-05,0.823096884028734,0.0166852655915441,1.65919289425244e-07,0.425164331969251,1.8747012696259e-07,NA,2.06797651442136e-06,0.53710992006466,NA,NA,NA,NA,7.2717917855125e-05,NA,NA,NA,NA,NA,NA,NA,NA,NA,NA
"temp",4.06050004272288e-22,0.316812569317682,1.61348910298257e-21,0.403484357146058,1.79351711538347e-08,7.23876058560829e-08,3.06264104949201e-05,0.0166338854888324,0.861293644722652,0.356666897306267,4.60988839185108e-09,1.49928381876967e-05,3.5286540371092e-05,3.07592449349995e-05,NA,NA,NA,NA,NA,NA,NA,NA,NA,NA,NA,NA,NA,NA,NA
"temp",1.70908863157933e-20,0.954053390011633,2.66672503374008e-18,9.23639747213297e-08,8.60278509455844e-08,0.464483825393881,0.662337166221481,3.3504901732681e-05,0.769562566745665,0.12461343162659,0.00189247266590789,4.69704780467344e-08,NA,1.04801742865699e-06,NA,NA,NA,0.076143258498015,NA,NA,NA,NA,NA,NA,NA,NA,NA,NA,NA
"temp",1.99755109587653e-18,0.929880326143246,1.01980631398386e-18,0.000233577773854394,2.03061833935827e-09,0.0124380936093635,0.908101921739992,0.000526211619603204,0.0025741747568959,0.87401404075411,0.00154205148108462,7.96481268816007e-07,NA,0.00110172882395868,NA,0.000217114879423192,NA,NA,NA,NA,NA,NA,NA,NA,NA,NA,NA,NA,NA
"temp",5.59362063795688e-19,0.56188139934508,3.09006534910359e-18,2.56041150717211e-08,0.000384947568137099,0.819267109520316,0.627841625545313,0.396909718961557,0.695947403822953,0.093833141073051,0.0825297343664717,0.259280185745315,0.000787018283602799,5.95623341815247e-07,NA,NA,NA,NA,NA,NA,NA,NA,NA,NA,NA,NA,NA,NA,NA
"temp",8.40714049528738e-21,0.130915196220739,5.06948614997689e-14,1.08558173083512e-11,1.79038516463036e-11,0.280904056579491,0.032091855307765,0.00146064101993762,0.107229297726731,0.166146290346542,0.780188804258124,1.34879606534564e-09,0.0883546228364425,0.0326874997760867,NA,NA,NA,NA,NA,NA,NA,NA,NA,NA,NA,NA,NA,NA,NA
"temp",1.91521363415298e-17,0.260848897592927,1.24470345401426e-15,8.46310671165757e-07,0.00263963233136068,0.513072551173463,0.0258625741905783,0.368734937774916,0.844195188799808,0.0948424723458503,0.741324220609005,0.0392537745179749,0.000514279249133782,0.00860235325598526,NA,NA,NA,NA,NA,NA,NA,NA,NA,NA,NA,NA,NA,NA,NA
"temp",8.1767415315726e-21,0.109858060396926,1.20403632461251e-19,6.35367696512763e-05,1.02164190645382e-07,0.176970932796846,0.950368411756214,0.0510988609620574,0.87348741391353,4.23335428207291e-05,5.63821230152587e-06,0.0618553041699826,0.127808955317746,0.0116882456326596,NA,NA,NA,NA,NA,NA,NA,NA,NA,NA,NA,NA,NA,NA,NA
"temp",1.8973775859895e-18,0.952994326861954,2.35640263077851e-18,8.40387328258336e-12,0.307446706914624,0.000201073837808481,0.923220849171448,0.00577801096626439,0.146931787105563,1.07075097830764e-07,3.93430700022351e-06,9.27013677488813e-11,0.821113969778285,NA,NA,NA,NA,0.00365331655527613,NA,NA,NA,NA,NA,NA,NA,NA,NA,NA,NA
"temp",2.78605793096326e-20,0.910722374117599,5.65237475768654e-19,1.07820213548539e-07,1.514664478668e-07,0.0090731926665141,0.0203002996204663,0.900326793097402,0.279583613707492,1.82053023062003e-06,2.92845966701747e-07,0.26570448097293,0.00345602848465183,0.21531468847459,NA,NA,NA,NA,NA,NA,NA,NA,NA,NA,NA,NA,NA,NA,NA
"temp",1.85057369663877e-20,0.909353975688702,2.63866829227486e-20,5.93045522766851e-06,6.87558627750691e-07,0.0390805499716643,0.384969733961188,0.0219436092191508,0.0019518262677332,2.12531388190942e-08,0.00757936321772869,0.010061422704234,4.07558228775611e-05,0.320814418873289,NA,NA,NA,NA,NA,NA,NA,NA,NA,NA,NA,NA,NA,NA,NA
"temp",3.0681561479602e-16,0.929614272663611,1.04784758975359e-18,5.59482717104634e-05,6.87936250561806e-10,0.574736189799788,0.00711799416000836,1.42483980244074e-05,0.914604837660428,0.0104527696582797,0.192365695570654,0.0228996111175877,0.000124217188282749,0.175742746469283,NA,NA,NA,NA,NA,NA,NA,NA,NA,NA,NA,NA,NA,NA,NA
"temp",7.40311571244717e-23,0.915202550063224,1.32773716556976e-18,5.93634825388863e-13,3.28119997686497e-09,5.92957715133704e-08,0.00106364827861924,0.463007570862123,5.12277871111387e-05,0.0499746065070469,0.00104115442869374,1.22244258304067e-06,1.3993194248654e-05,0.205711063154246,NA,NA,NA,NA,NA,NA,NA,NA,NA,NA,NA,NA,NA,NA,NA
"temp",4.10658591666381e-20,0.351274194966409,4.29035757796547e-19,3.03700925404367e-08,1.12856493415225e-06,0.00177282760933692,0.267269918348165,0.00226655240283215,0.916119310128469,0.0652362227199429,0.898231816295447,2.51638179302921e-07,6.32755409031228e-06,NA,NA,NA,NA,NA,0.000100768290094736,NA,NA,NA,NA,NA,NA,NA,NA,NA,NA
"temp",1.06715712854831e-17,3.99543203682613e-07,3.0905086083212e-15,0.428915668779161,1.19659771483952e-09,7.72043295154327e-05,0.054754974082311,2.37677546452105e-05,6.2990582862241e-08,0.000183630263918438,0.0557277419112825,NA,6.83750071414563e-06,0.184564061924432,NA,2.83406911736334e-06,NA,NA,NA,NA,NA,NA,NA,NA,NA,NA,NA,NA,NA
"temp",1.40346738821205e-19,0.000198369770523907,6.95964275796457e-19,1.14934666225668e-05,0.794046686114302,0.0602090103831623,0.0555174254412851,0.40479946737027,0.000330439306006418,0.0992129509194188,0.00273325055235066,0.26719902970337,NA,0.000298827148747645,NA,NA,0.0374018794675919,NA,NA,NA,NA,NA,NA,NA,NA,NA,NA,NA,NA
"temp",1.02831862645568e-17,0.0158095730896653,2.6116393667112e-18,0.000102993677703358,3.62658449060114e-07,0.0174042472219026,0.993086790459752,0.982405733061821,0.0946313695104905,0.0217851417297672,0.284245298405986,8.38195422052706e-05,0.080853083710212,NA,1.91588022884155e-06,NA,NA,NA,NA,NA,NA,NA,NA,NA,NA,NA,NA,NA,NA
"temp",2.6100688131165e-18,0.000942782020430206,2.17882427114766e-14,0.0868501338644518,1.35554697170911e-06,0.895086891230397,0.00772518614220671,0.126511965003989,0.429760760785289,0.842234256115006,0.000223541080467857,0.00028649216139361,0.000142872992233945,0.0335679375201933,NA,NA,NA,NA,NA,NA,NA,NA,NA,NA,NA,NA,NA,NA,NA
"temp",1.43482855127736e-18,0.442127916908575,4.3343003861887e-17,3.10955788531897e-07,0.00674725899115167,0.00205112421703872,0.059325545704065,0.510208387025507,0.84728399820683,0.702828853224678,0.0819809232030287,NA,0.000674810336451539,0.000207356675933491,NA,NA,0.0201726000619308,NA,NA,NA,NA,NA,NA,NA,NA,NA,NA,NA,NA
"temp",1.08633315856184e-19,2.68744596425251e-07,5.95645060759553e-19,0.397176617260501,1.01412243422295e-07,4.30310027326953e-05,0.159510966893702,8.14277410899494e-10,6.89956458274949e-06,0.350240149284668,0.000881912256751889,0.000106259369274309,4.41829796289031e-12,0.159064428066394,NA,NA,NA,NA,NA,NA,NA,NA,NA,NA,NA,NA,NA,NA,NA
"temp",9.60504918263779e-21,0.0704936756617176,2.82557864668079e-20,2.73123590878915e-09,5.04066360557237e-10,0.554504181052181,0.374638452445856,0.00288858039244402,0.122930026048878,0.590560314574879,7.57545577460116e-06,NA,0.055629851250955,0.000110972246734099,5.31103722072939e-07,NA,NA,NA,NA,NA,NA,NA,NA,NA,NA,NA,NA,NA,NA
"temp",1.80204421304841e-18,0.929606160096031,4.91576926416396e-17,0.00131667159196236,3.90780440884933e-06,0.340705726546976,0.44051010272348,0.781569840453791,0.73854741973214,0.617596185200944,0.59589552928505,0.0120746149163068,0.511160896181381,NA,NA,0.000207550501812633,NA,NA,NA,NA,NA,NA,NA,NA,NA,NA,NA,NA,NA
"temp",7.7982949893971e-22,0.39168881307782,3.29641958915518e-20,2.66563241030521e-06,2.14091119467109e-10,0.00647272220478839,0.014687702385914,0.55819440834183,0.118743128595591,7.57904860989558e-09,2.59482485487374e-06,0.00863087346765755,0.109047020639698,0.328594037078162,NA,NA,NA,NA,NA,NA,NA,NA,NA,NA,NA,NA,NA,NA,NA
"temp",1.21122681892374e-18,0.50026398801619,4.35731334315908e-16,1.94885944075332e-08,6.5139584577457e-08,0.00504984855859819,0.0779574077407112,0.00269143398001392,0.368683452063623,0.0423613548981498,0.000433068831973285,NA,1.86985252810479e-06,0.000408992984666351,NA,NA,0.976292878809717,NA,NA,NA,NA,NA,NA,NA,NA,NA,NA,NA,NA
"temp",5.37898888352309e-17,0.724883994906524,2.84835114081989e-16,7.61574159810104e-07,0.000262438272204805,0.510443117039739,0.398289851060013,0.365771004768724,0.0983415398738585,0.0928815973693151,0.249960499632561,0.0381219631084914,0.00443258191672496,0.00823961030483657,NA,NA,NA,NA,NA,NA,NA,NA,NA,NA,NA,NA,NA,NA,NA
"temp",1.81605619972172e-21,0.227497304652694,3.05807772936232e-22,0.149912965781129,2.96465576085067e-08,0.123880424720468,0.586826822387722,1.06014044923409e-08,0.0037796572738529,0.0001048098642342,0.0273230505952516,1.39243233805673e-05,1.22040793495823e-07,NA,NA,NA,0.0079397510019359,NA,NA,NA,NA,NA,NA,NA,NA,NA,NA,NA,NA
"temp",5.78693275379013e-17,1.20088601149141e-06,1.00818646512288e-21,7.6853718321034e-14,2.71622691818486e-08,0.000170628337204778,0.0707777749659942,0.000402025612046737,1.82386926088747e-06,1.53650038396437e-09,0.260290551463172,NA,1.76295300921052e-05,0.584481266152956,NA,7.68600890518035e-06,NA,NA,NA,NA,NA,NA,NA,NA,NA,NA,NA,NA,NA
"temp",2.74605203249163e-18,0.391812929379246,2.90616379219997e-16,2.30005968008465e-05,5.67777521122912e-05,0.304197602368633,0.374476511565634,0.0353652623777108,0.835172468050507,0.359335817104418,0.380609395918021,0.0135547745802794,0.00294937543765664,0.000222685289285789,NA,NA,NA,NA,NA,NA,NA,NA,NA,NA,NA,NA,NA,NA,NA
"temp",3.5298868164426e-19,0.000464193212496295,3.00085549568521e-13,7.57950260622054e-10,0.00269942733420038,0.332599770320189,0.0528459232406503,0.0337685594647417,0.0140280866975432,3.9808580974864e-05,0.994241343230985,0.0397402217933895,0.000528803266879805,NA,NA,NA,0.747431303107654,NA,NA,NA,NA,NA,NA,NA,NA,NA,NA,NA,NA
"temp",1.22518614915012e-18,0.511116331881738,1.03707701147463e-19,1.34473527950943e-13,9.13986728326314e-10,1.83191144922883e-08,8.51478654265284e-08,5.50317394916529e-11,1.9986592186375e-06,0.0379084618438541,0.000561991606311516,4.3176725225014e-07,4.73457690776867e-05,0.554596574018225,NA,NA,NA,NA,NA,NA,NA,NA,NA,NA,NA,NA,NA,NA,NA
"temp",1.66730153508673e-20,0.301647922812877,9.99160987687848e-19,0.000149358981160738,1.8264042030886e-07,0.0621281112132474,0.192504588843861,0.0110621319530556,0.323549869601045,4.09095721992836e-05,1.65447673919603e-05,0.312960896734548,0.00177509348955256,NA,NA,NA,NA,NA,0.158065883990563,NA,NA,NA,NA,NA,NA,NA,NA,NA,NA
"temp",4.2065294313316e-23,0.29019538449527,7.22641505531103e-21,3.33006824622644e-08,3.95064486464531e-10,0.434774181609937,0.180018728966887,0.022698358696316,0.00111603286221551,1.54349388811808e-06,4.04613167301175e-06,0.503549209853193,0.179572486296374,0.00911468916395757,NA,NA,NA,NA,NA,NA,NA,NA,NA,NA,NA,NA,NA,NA,NA
"temp",9.18786463342122e-19,0.136652934883154,8.51459516359524e-19,5.91697008459987e-06,3.72751590567154e-05,0.218477520575778,0.0949753805719214,0.332576682547426,0.770390021229344,0.00179949058173788,0.992026628603009,9.65856848597979e-07,NA,4.69402981165951e-06,NA,NA,NA,0.106640641390441,NA,NA,NA,NA,NA,NA,NA,NA,NA,NA,NA
"temp",2.74592425217064e-20,0.322889562416227,7.48529818679577e-17,0.0536793702520395,2.71123385292204e-05,0.000270875899916298,0.000113365723575729,0.20085109680314,0.00285667581877781,1.57470600012648e-07,0.247301585847222,0.000255496536639536,0.000385993890931596,NA,NA,NA,NA,0.0692626851750742,NA,NA,NA,NA,NA,NA,NA,NA,NA,NA,NA
"temp",4.8425828506549e-24,0.00011505676372748,8.92750512915247e-23,0.992582590533188,4.75190871668793e-13,0.0167970753068531,0.508103246452983,0.0162046439384853,0.000748709728239736,8.00088307043367e-12,NA,0.385956986985704,0.193553364676832,0.357613326064437,NA,NA,NA,NA,0.0551570042408142,NA,NA,NA,NA,NA,NA,NA,NA,NA,NA
"temp",2.87336502184958e-21,0.318740685708292,1.08577016028002e-19,4.22055573425117e-07,3.17281016541619e-09,0.449236132138585,0.711407480349346,0.00343323322642279,0.76179215315003,0.577912503614447,0.011129474611601,3.6127490010219e-06,0.291428442833436,5.89396067796176e-07,NA,NA,NA,NA,NA,NA,NA,NA,NA,NA,NA,NA,NA,NA,NA
"temp",2.65063667043223e-20,0.541930544328639,1.04322323987655e-15,2.06353468967362e-07,0.00360697356450041,1.67560881270156e-07,7.35739677008095e-07,0.000390008454443481,0.00014005661787856,0.0104521632338584,7.51610757590971e-07,0.118295700089011,NA,0.211650511069913,NA,5.3161850831674e-05,NA,NA,NA,NA,NA,NA,NA,NA,NA,NA,NA,NA,NA
"temp",1.67924719355259e-20,0.000737318252262205,2.87632998315984e-19,5.78755249005023e-08,3.193963995694e-06,0.0111681499581307,0.434642858304967,0.778801620225057,0.000377027297701853,0.00351494928054167,0.59113960789616,5.98813284089885e-07,0.505715980171956,NA,NA,0.000178559857131789,NA,NA,NA,NA,NA,NA,NA,NA,NA,NA,NA,NA,NA
"temp",6.22593033442131e-21,0.0137961823024314,3.19676632553564e-19,0.00184379562495388,0.000288858976327979,0.0316450121199829,0.213758465007438,0.000203103329553092,0.00221943915338043,0.823977834393898,0.429839944298862,1.43094860962603e-08,8.92061747152938e-08,0.0217245198948021,NA,NA,NA,NA,NA,NA,NA,NA,NA,NA,NA,NA,NA,NA,NA
