%YAML 1.1
%TAG !u! tag:unity3d.com,2011:
--- !u!114 &11400000
MonoBehaviour:
  m_ObjectHideFlags: 0
  m_CorrespondingSourceObject: {fileID: 0}
  m_PrefabInstance: {fileID: 0}
  m_PrefabAsset: {fileID: 0}
  m_GameObject: {fileID: 0}
  m_Enabled: 1
  m_EditorHideFlags: 0
  m_Script: {fileID: 11500000, guid: 93a010e2b0725fe4ebaef4b56671c5b9, type: 3}
  m_Name: Belt2Params
  m_EditorClassIdentifier: 
  speed: 16.29681
  direction: 0.9184747
  spawnCoolDown: 1
  beltCoolDown: 2
  beltSpeed: 2
