<?xml version="1.0" encoding="UTF-8" standalone="no"?>
<!-- Created with Inkscape (http://www.inkscape.org/) -->

<svg
   width="1920"
   height="1080"
   viewBox="0 0 508 285.75"
   version="1.1"
   id="svg1"
   inkscape:version="1.3.2 (091e20ef0f, 2023-11-25, custom)"
   xml:space="preserve"
   sodipodi:docname="orbita-mechanics-images.svg"
   xmlns:inkscape="http://www.inkscape.org/namespaces/inkscape"
   xmlns:sodipodi="http://sodipodi.sourceforge.net/DTD/sodipodi-0.dtd"
   xmlns:xlink="http://www.w3.org/1999/xlink"
   xmlns="http://www.w3.org/2000/svg"
   xmlns:svg="http://www.w3.org/2000/svg"><sodipodi:namedview
     id="namedview1"
     pagecolor="#ffffff"
     bordercolor="#000000"
     borderopacity="0.25"
     inkscape:showpageshadow="true"
     inkscape:pageopacity="0.0"
     inkscape:pagecheckerboard="true"
     inkscape:deskcolor="#d1d1d1"
     inkscape:document-units="mm"
     inkscape:window-width="1898"
     inkscape:window-height="1024"
     inkscape:window-x="0"
     inkscape:window-y="0"
     inkscape:window-maximized="1"
     inkscape:current-layer="layer1"
     showborder="true"
     borderlayer="true"
     inkscape:clip-to-page="false"
     labelstyle="default"><inkscape:page
       x="-6.0159282e-14"
       y="0"
       width="508"
       height="285.75"
       id="page153"
       margin="0"
       bleed="0" /></sodipodi:namedview><defs
     id="defs1" /><g
     inkscape:label="Layer 1"
     inkscape:groupmode="layer"
     id="layer1"
     transform="translate(-322.0928,-3.74059)"><image
       width="114.3"
       height="109.88347"
       preserveAspectRatio="none"
       xlink:href="data:image/png;base64,iVBORw0KGgoAAAANSUhEUgAAAocAAAJuCAIAAABNPT//AAAAA3NCSVQICAjb4U/gAAAgAElEQVR4&#10;nOzdeVxNa9sH8LvalebpqBCaFEkyZjjOkUSlSClTCYUMFZKKY8oxZGxAHAoZK5lKkyFTZEplSIQ0&#10;KErzXLv9/rHes856NtKw9773cH3/eD5r3XvttX48R1drui8hZ2dnBAAAAAAuQEMIHTt2DHcMAAAA&#10;QNC5uLgI484AAAAAgP8HVRkAAADgFlCVAQAAAG4BVRkAAADgFlCVAQAAAG4BVRkAAADgFlCVAQAA&#10;AG5Bwx0AAPCfx48fX758mVzV09NzcHDAmAcAwGFQlQHgIqamplVVVeSqiIhInz59/vjjD3Kkvr5+&#10;9uzZN27cIEeqq6uFhIQ4mhIAwDZwBRsALtK3b1/qKp1Op9Pp1JGqqqorV67U/qtnz56cDQgAYC+o&#10;ygBwkatXrw4ePLidGw8YMCAhIQFOlAHgJ1CVAeAi6urqu3fvbmODS5cuEQv9+vWLjY3V1NTkSC4A&#10;AIdAVQaAu5iamvr7+5OrDg4Or1+/JpZTU1OXLl2KEBo4cODt27ehJAPAf6AqA8B1HB0d1dXVieXP&#10;nz8fOXIkNjY2NjbW09OTGIyLi4M7ygDwJXgGGwCu06NHj7i4uAkTJhQXFyOEgoKCgoKCiI9oNNrq&#10;1at79eqFNSAAgF3gXBkAbjRgwABfX9/vn+RatmyZv7+/iIgIllQAAHaDqgwAl3J3d+/Tpw91pGfP&#10;ns7OzrjyAAA4AKoyANwrLCxMWVmZXJ02bZqBgQHGPAAAdoOqDAD3mjBhwsCBA8lVJycnjGEAABwA&#10;VRkA3jB69GgtLS3cKQAA7AVVGQDeoKGh8dtvv+FOAQBgL6jKAAAAALeAqgwAb4iPj3/58iXuFAAA&#10;9oKqDABvKC8vLywsxJ0CAMBeUJUB4F7btm3LyckhVxcsWJCeno4xDwCA3WDGTQC4EYPBsLe3v3Dh&#10;AnWwqKgoOzvb0NAQVyoAALtBVQaAGzEYjNraWnNzc+pg3759LSwscEUCAHAAVGUAuJGwsHBcXBzu&#10;FAAAToP7ygAAAAC3gKoMAAAAcAuoygAAAAC3gKoMAAAAcAuoygAAAAC3gKoMAAAAcAuoygAAAAC3&#10;gKoMAAAAcAuoygAAAAC3gKoMAAAAcAuoygAAAAC3gKoMAAAAcAuoygBwtcbGxvfv3+NOAQDgEKjK&#10;AHC17du36+npxcbG4g4CAOAEqMoAcLV79+41NTU9evQIdxAAACdAVQYAAAC4BVRlAAAAgFtAVQYA&#10;AAC4BVRlAAAAgFtAVQYAAAC4BVRlALjX3bt3nz17hjsFAIBzoCoDwL3KysqqqqokJCTs7e1xZwEA&#10;cAJUZQC4HY1GGzRoEO4UAABOgKoMAAAAcAuoygAAAAC3gKoMAAAAcAuoygAAAAC3gKoMAAAAcAsa&#10;7gAAAMBGYWFh27dv/+VmmpqaJ0+e7NGjB8sDhIaG7tixg1gOCgqysLBg+SEAP4GqDADgZ1FRUe/f&#10;v//lZu/fv4+Ojl6xYgXLA0RGRpIBnJycEhIShg0bxvKjAL4BV7ABAPxs3bp1IiIi1BExMTFJClFR&#10;UWLc39+fJUek0+l1dXV0Op1YXb9+PRmgtLS0rKyMJUcB/AqqMgCAn40bN87KyopcnTlz5t27d2sp&#10;4uLiunXrxsIjRkZGSklJRUREEKt//PEHNQAAbYOqDAAQIM7OzkZGRtSRiRMnRkVF2dvbh4WFseQQ&#10;GzduRAg9f/78+4969OihoqLCkqMAfgX3lQEAgs7S0tLS0pJcrayszM7Opm6gqan522+//ezrjx8/&#10;Jpdv3Ljx6dMnhFBoaKidnd2wYcOo1881NTUbGhqo27e9ZyCAoCoDAATXly9fPD099+3bp6ysTIw0&#10;NDS4urqeP3+eupmxsXFsbKykpCRCqLW1tayszMvLq7m5mfj0zJkz3++5vLzcyMjo4MGDy5YtIwdT&#10;UlKYztRNTU2TkpJY+4cCPA2qMgDcrrGx8ebNmyYmJriD8JvPnz+bm5tnZmaKiIicPHmSGLS3t4+J&#10;iWHaMjk5eefOnX5+fgihEydOODs7t/MQv2zEef/+/eTkZGNj4w5mB3wL7isDwO2amppu376NOwWf&#10;sLa2lvuXjo5OZmYm0waJiYnEwpgxYyorK9XU1IjVXbt2ffv2DSFUUVHRzmMNHTp07NixbW9TX19/&#10;9+7dDvwBAL+DqgwATrm5ubdv366urm57s0+fPpHXS0kvX76Eat1RdXV1Vf+qra0lBmNiYrKyspi2&#10;nDNnjqysrLDw//+QbGxsZDAYCCF3d/eFCxd+v2dtbe309HQ3NzdidcSIEXFxcd9vKSkpeejQofT0&#10;9O7duxMjubm5LS0tLPrzAZ4HVRkAFvj69Wt+fn7b29y8edPGxoZ6w7KgoMDCwsLY2HjlypV1dXXE&#10;YFFRUV5eXl5eHvW7p06d2rp1a15eHrnZ3bt3TU1NjY2NAwICiJ/pDAYj719kvQFMREVF+/xLVVWV&#10;GCwvL6+vryeWPTw8iDeYy8vL8/Lyvq+XNBqNvAmtqqp68V+HDx8ePHgwOTvYypUrf/i4dd++fZcu&#10;XTp48GAa7f9vIJ44cQL+/wL/cXZ2ZgAAuuDVq1d9+/al0WjXrl0jRs6cOePp6enp6VlYWEiM3L9/&#10;X0FBASEkIiISExPDYDAKCgr09PTIf4mRkZEMBuPBgwdKSkoIISEhoStXrly6dInpH+z58+cZDEZq&#10;air1wd2cnBwGg3H27FlyxM7Ojox3/PhxT0/P6OhoYrWlpcXzX0+ePOHg3xM21tbW5N+Mr68vOV5c&#10;XExMszV8+PDi4mJyvH///j/8aVlSUkJs4OPjQ4ysXr2a6Vjk7J5nzpz5YYABAwYQg9TZPSsqKtj1&#10;hwc8xdnZGZ72AqADkpKS3r17hxBSU1ObNm0aQigzM9PU1PTr168IISsrq8LCwoKCAgcHBwaDgRBK&#10;S0u7desWQmjChAlNTU0IITqdfvfuXUtLy69fv75+/Zpp/5mZmcTNSwaDcfv27T/++OOHMV68eFFa&#10;Wso0mJyc/P3y8OHD09LSGAzG/v37jx49unDhQg8Pj4MHDxKfnjhxgtxPbW2tra3tzZs3Q0JCXFxc&#10;uvCXxNWoz1WpqKgkJyf7+vru3LlTWlq6i3sDgCXgCjYA7ZWenj5jxowVK1asWLFizpw5N2/eRAjd&#10;vn2bKMkIodbWVoSQnJxcz549iRHyrItcEBYWJpb19PTWr19PDA4bNszc3BwhNGvWrAULFlhYWFha&#10;Wq5bt448tLa2dlpa2tu3b4neBvb29uTp17x58/r06YMQIvdG7JxYoNPpxO8Hra2txC8Burq65Gbk&#10;rJBlZWWOjo6JiYktLS0eHh537twhxpOTk+Pi4uLi4t6+fdvlvz9uJCMjc+DAAWlp6fDwcOJO8Pr1&#10;6z98+EB8qqGhISEhgTchEDRwrgwAQgi1tLTk5OTIy8uT9xoPHz58+fJlhJCYmFhoaGj37t2FhISE&#10;hISIT+vq6oh7gdbW1sePH09PT0cIzZw5U0FBQVVVNT4+/vPnzwihMWPGENvHxMQ4Ojp+/fpVVFSU&#10;eAJIXFx806ZN48aNQwgpKCgQ52pycnLfzzAlISERHx+vra1NjsjKyoaGhrq6uiKE+vbtS9wHVVNT&#10;S0hI2LhxY1VV1Zo1a4gtDx06VFVVRSwTx3J1dT106FBOTk5LS8vSpUuJj16/fk1eLSf/aBcvXpw7&#10;d25DQwNCSFNT8/nz57KyssRflI6ODvkYFB+orKz09/d//fr1lClTyMHly5e7ublNmjSJvMfv7++/&#10;detW1k7PCQAzuK8MQGtr6759+xBCenp6+fn5DAaDPIkkrFu3jtjS0dGRmKpJV1f348ePxGBubm5I&#10;SEhISEhqaiprgxGVUkZGhrW7ZTAY4eHhISEhb968IVY/f/48YsQI4g+rp6f36dMnBoMREBBA/haC&#10;ECopKWltbQ0ICEAIhYWFtba2kntrbGwkTsq5E/W2blJSEtOnLS0t1GJMCgwMbGxs7N27N3Xw4cOH&#10;DMp95UuXLjHtjbyvbG1t3fivqVOnknuA+8qgDc7OzlCVgYA6e/ZsYGAgsUzMDkEwNTVlMBitra3U&#10;W4ZkVWYwGPHx8V5eXkeOHOFASPZV5e9VVlZ6eXl5eXkdPXqUHCSujSOERo8eXVNT8+DBA2rRIrZ5&#10;9uyZoqIi9a+I21Crsre3N/Wj+vp6U1PT70vyz4wZM4ZBqcpaWlpMx/plL2eoyqANUJWBgNq2bRvR&#10;zu/ly5cMBoPa75aoygwGIyYmhrj+LCUlVVlZiSUnJ6vyDxUXF/v4+MyYMePcuXMMBoNalT09PYlt&#10;5OXlEUKioqJeXl64crbh0KFD1GvONBqtFwW1NJqZmRUUFIiJibVRU8XExHr16iUjI0Pd28aNG8nD&#10;fV+VTU1NyecMoCqDtjk7O/PPnSEAfqipqYm4ffvw4UNi5Pz5835+fk1NTXV1dZGRkQihdevWEa8t&#10;IYQ8PDyIBUtLy6tXr967dy8pKUlWVhZLeOxUVFR27NgRFRU1a9YshNDAgQOdnJwQQr/99ht5T7qy&#10;shIh1NzcfOXKFWLk+vXr48aNGzdunJeXF/bHxK5du0bcGie0tLQUUhQVFZEfubi49OrVy93dvY29&#10;NTU1FRYWkrO+EHuj/uehqqpKvoiMEFqyZMmlS5dsbGxY9ucB/A6e9gL8rKWlxd/fn7hAbWdnFx8f&#10;P2jQoIKCgsbGRoSQpKQkcRZlY2OjpKREtPr5/fffya8rKSlRV4GsrGxISMiECRP69eunpaVFDC5c&#10;uPD48eNCQkLkQ+CbNm0ifge6f//+6dOnY2Njhw0b1tjYuH79ent7+5EjR3Iy87Fjx8j2D3///XdJ&#10;SckPN9PS0ho+fDhCyMXFZdCgQUyfNjQ0eHt7Dx8+3NHRESEUExNz48YN4iNbW1tPT09yywULFmRn&#10;Zx85coRY3bNnj5SU1I4dOwoLC5OTkzds2ED+vS1YsODQoUOSkpI7duyAJ73Bf+AKNuAzoaGh/v7+&#10;xDLThJTx8fEMBiMlJUVWVnb+/PnPnz/HmvTXsF/BbqeAgICDBw+Sq1u2bKH+tV+8eJHBYBBPVP32&#10;228CMnUJAJ0As4gA/kGn052dnWNiYqqqquh0upCQkJeXl4qKSp8+fYg3W3r16kXc3hszZsynT5+k&#10;paWpVxpBV5CX/Qnr1q1bsGABceqsra1N1OOEhASEUGlpqYmJSXJy8tChQ8vKyq5du0Z8ZcqUKYqK&#10;ihwPDgDXgZ9KgFfdv3+fKAYDBw4MCgoSFxcnm/HRaDRi6v/+/ftfunSJ2GzUqFEGBgbEBsQDSoBN&#10;aDRa7969w8PDqYOamprEtGg1NTWPHj0aOnToihUrzp07R3w6e/Zs6oyhAAgsqMqAZ5SUlNDpdHKW&#10;j927d6elpSGE0tLS6HR6eHh4VFQUMYfGwoUL58+fT2w2dOjQe/fu4coMSHFxccRcK8LCwsTTT9RO&#10;WWRvj9raWm9vb1tbW5jMEggmqMqAN6Snp1tYWFRWVsbExEyYMOH7T0VERGbMmDFjxgws8cAvaWtr&#10;U6cnQwht2bIlNjaWWCbn2SAeyjt79uy1a9dGjx7N6ZQA4AZvRgEekJaWNmHChKKiorq6usmTJ9fU&#10;1CCEqP3k9+zZgy8d6KQhQ4aUlZUtWbJkyZIlM2fOJAaJ2cXLy8upv3vdvn37yJEj1BecAOBXcK4M&#10;uBGDwUhKSlJWVh4yZAhCKCEhoby8nPiI7He7atUqOp1+584dPT29n/VWAtxMSEhIQUHh8OHD1MH+&#10;/ftnZmYihNauXUuMXLlyxcnJqbKy8vbt24cPH5aTk8OQFQBOgXNlwHWam5v9/f3NzMzMzc2JMyd7&#10;e3vy4ue8efOIlztFRUV9fX0TEhL27dsnJSWFMzFgnZiYmLFjx44ZM4bo4fHw4UNnZ2diopLz589n&#10;Z2fjDggAe8G5MuA6+/bt8/X1RQh9+fJl9erVGRkZ2tracXFxiYmJCKFRo0YR/SEEAYPBwB2B0/r0&#10;6XP//n1y9cuXL2VlZcQytWcXAPwKqjLgCrGxse/evXNzc6PRaD98ZLpfv379+vXjfDC8Vq1ahTsC&#10;ZtbW1ps2bdq8eTNCaM6cOWRjq+Dg4JaWFllZWWdnZ5z5AGA1qMoAsy1btoSFhZWWltbV1X358mXn&#10;zp27d+/OysoiOs9v2rQJd0CAma+v74IFCxBC5H0Kf39/X19fBoNBo9GEhYWJTwHgD1CVAWbBwcHf&#10;vn0jliUlJRFCAwYMSEhIKCwsRAgZGhriDAe4gJiYGNlQkiAhISEkJMRgMISFhcXFxRFCUVFRhw4d&#10;mjVr1tSpU6m9mADgOVCVAacRc0cICwsTpz5BQUHbt2/Py8uzsrIi2xsI5vVq0E7u7u7y8vItLS0y&#10;MjJ2dnYIIW9v748fP96+ffvQoUPXr19XVlbGnRGAToKqDDjq2rVrlpaWCKEePXokJCQYGBjMmTNn&#10;zpw5uHMBHjNv3rwfjmdmZrq7u58/fx4hdPv27fv37y9atEhFRYWz6QDoPHgzCnBUXFwcsVBUVPT8&#10;+XO8YQDfOHnyJNEDAyG0fft2hFBiYuKUKVM2bNhgaWlZUFCANR0AHQDnyoCNqqqq1qxZk5GRYWtr&#10;S0wK4enpSRTjXr16kT9GAeiicePGDR8+/MWLFwih3r17v379eu7cuXV1dQihp0+fPn36VE1NDXdG&#10;ANoFqjJgo/T09KNHjyKEiH7yCCFNTc0HDx5gDQX4k4SExMiRI4nlxsbG2tpaYllMTKxbt27Ecmlp&#10;qaysrJiYGJ6IALQDXMEGrPTixYt169YRrYEAwGXIkCGhoaHE8pgxY8zMzBBCDx8+1NHR8fLywhoN&#10;gF+AqgxYJiMjw8TEZMeOHRMmTCB6LP7+++/W1ta4cwFBNHv27Nra2tra2oSEBGJkwoQJ5eXlBw4c&#10;cHFxwZsNgDZAVQas0djYOHny5JKSEoRQeXk50aFPWFg4KCjoxYsX5CtPAHCGkJCQpKSkpKQk8UIz&#10;Qqi5uRkh1Nra+vjxY6zRAGgLVGXQJR8/fiR+2KF/f+ohhISFhRUUFIjl3r176+vr9+zZE08+AP7l&#10;6ekpKioqKirq4+NDjDx69Gjq1KlTp04lb0IDgB087QU679KlS7a2tv7+/l5eXuLi4omJiSYmJlVV&#10;VQoKCm5ubrjTAfA//P399fT0hIWFyffjPT09U1JSEOUXSgCwg6oMOunTp082NjYIobVr11ZWVv79&#10;99/Dhw8nOu4BwJ2cnJxwRwDgF+AKNmCBt2/f4o7An/T19XFH4GcbN26krjY0NLi4uDg6OtbU1OCK&#10;BABUZdABBQUFL1++bG1tRQipqKgsX74cISQjI7Ny5Urc0fgTPC3MVqNGjbpx48aNGzekpaURQqWl&#10;paGhoadPn37y5AnuaEBwQVUG7ZWdnW1sbDxo0CBnZ+eCgoJu3bodOHDg6NGjUVFRY8aMwZ0OgA6T&#10;lZU1MTExMTGh0f7nXp6/vz+uSABAVQbt8vr1a1NT05ycHITQiRMnysrKiHEXF5fJkydjjQYAa8jI&#10;yIwaNQp3CiDooCqDnyosLIyIiPjw4QNCKCMjIz8/nxi3tbWVl5fHGg0A1pOTk1uxYoWw8H8/FQ8f&#10;Pqyqqjpx4kSMqYCggWewwY8VFxfb29s/ePBgwIABSUlJpqamdnZ2nz59mjJlyvr160VERHAHBID1&#10;5s6dq6WlJScnR6zW1tZ++fKlpqbm2rVr0EwFcAZUZfBjlpaWz549QwhlZWWFhIRs27YtMjISdygA&#10;2I56EVtCQkJYWLi2tnbfvn1EVW5ubq6urlZUVMQXEPA5uIINfoDBYBAlGQBBtmzZssWLFyOElJWV&#10;iZEtW7b07dv33r17WHMBfgZVGfwnPDw8MTERISQkJHT16lXidRFJSUmm1zoBEBzBwcFVVVXh4eHE&#10;alJSUk1NTWBgYEtLC95ggF/BFWyAEEJNTU3r1q3bv3+/lJRUQEDAwoULraysHj9+3NTUJCwsTM7v&#10;D4CgodFoMjIyTIPR0dFNTU1M71MBwBJwrgwQQmj37t179+5tbW2trq7evn07MThgwIDBgwcPGjQI&#10;bzYAuMfChQuZRsrLy/Py8uDUGbAKVGWAEEKZmZm4IwDAA6ZOnWpoaEiufvv2zcTEpG/fvgcOHMCY&#10;CvATqMqCq6mp6cCBA9evX0cIHTlyZNiwYcT4vn37sOYC/4GnirhNz549nz171tLSIikpmZ+fP2HC&#10;hOfPnyOEVq9enZycjDsd4AdwX0RAVVVVubq6njt3TkZGJiUlZdCgQYmJicSMXdALmXtER0fjjgCY&#10;kdOMZGdnkxeZGAwGg8Fg2vLt27fEdHhM9PX1+/Tpw9aQgHdBVRZQHz58OHfuHEKourq6oaEBIaSk&#10;pKSkpIQ7FwA8Y8iQIVOnTr169SpCaPTo0dQr2/X19Vu3biWnxmOip6fn5OS0evVq1j4v1tjY+PHj&#10;R4SQrKws+bv127dvW1tbe/Xq9f0za1SVlZVFRUUIIWVlZerb2GVlZV+/fu3Tp4+kpCQLo4I2QFUW&#10;UEJCQsLCwq2trWPGjOnbty/uOADwHiUlpVOnTp09exYhpK6urqioWFdX5+npiRD6+vXrxYsXf/bF&#10;169fe3t7i4qKrly5UkhIiFV5tm3btnXrVoSQtrZ2UlKShobG1atXZ8yY0dzcPGfOnDNnzvzsi3Q6&#10;fc6cOXFxcQih3bt3r1mzhhhvbGy0tLR8+PDh8uXL4cY5x0BVFhQfP36MiooSFhYm/skNHjz4/Pnz&#10;T58+3bRpE/wWDEDnyMrKurq6kqseHh7Hjh1r53dXr15dXV3NwskAUlJSiIWcnJwvX76oqKgEBgY2&#10;NzdTP/ohPz8/oiR/n/Dhw4e//DpgLajKgiIyMtLHxwchlJGRceTIEUlJSTs7Ozs7O9y5ABBcf//9&#10;d3NzM3GC23WGhoa3bt0ilm/duvX69WtitXv37m3/rqCnpycqKkrU78zMzNbWVmqLDsBh8FcvKI4f&#10;P04snD59+tu3b3jDAAAQQs3NzTt37iT/bXaRn5/f0qVLieX169c7Ozujfy+zt932aubMmcSv7Aih&#10;U6dO5ebmMm3g7u7OkoSgPaAqC4q5c+cSCzY2NjC3PgAs9+7duzt37nT0Wy0tLYGBgXV1dV0PICUl&#10;FRQUNGPGDOrg7Nmz29MB3cnJqX///sTy9u3b6XQ6+dHw4cMtLCy6Hg+0E1RlQTF79uzNmzf7+flF&#10;R0dLSUnhjgMAv3F1dX337l0nvpiRkUFcPe46Go02ZMgQ6siOHTva80UtLa0jR44Qy6GhoTk5OaWl&#10;pU+ePEEI9enTR0VFhSXxQHvAfWW+9f79e2tr65qami1btjg4OGhra2/atAl3KAD4U35+fnFxMe4U&#10;LHP58mWEEFGV21nXAavAuTJ/ysvLs7S0fPnyZW5urpOTE/V6FACA5S5cuPD69WvcKRCdTme6K+zl&#10;5VVbW9ue7w4dOnTChAnEso+PD3Gn2dHRUV1dncUpQZugKvOnsLCwN2/eIIRERER69eqFOw4AfC4o&#10;KAh3BIQQCgkJOXr0KHXk8OHDaWlpTJtVVFQUFhYSc/mRpKWlV61aRR0RERFZs2aNmJgYm9KCH4Kq&#10;zJ9MTU27deuGEFqyZElBQYGoqCjuRAAA9iouLiZKsqGh4a5du8gbzA4ODq9evSI3+/r16/jx49XU&#10;1KhvWhMGDx5MXbW2tjYwMGBzasAMqjKfoNPpdnZ24uLio0ePRgiNHTu2srKysbExODgYdzQA+N/Y&#10;sWNxR0BOTk7EvNwuLi5eXl7Xrl0jxvPy8k6cOEFuNn/+/IyMDIRQdHT07t27qXtQU1Ojni6TF7QB&#10;J0FV5hMtLS0XLlxoamoiH+YUExMTExOD2QAA4IDly5fjfeHw1q1b9+/fRwhpamoSr0FSJ9kODAw8&#10;efIksUy2gm5tbY2IiKDuREhIyMfHh/iihobG7NmzORMeUMGPbD4hJCT022+/4U4BgIBi6k7BeXv3&#10;7q2rq+vWrVt8fLy8vDzTp9SWVm5ubnJycj/bj7KyMjE1d69evRQUFNgXGPwMVGU+ISYm5u3tTaPR&#10;WNuFBgDQTkzTd3DYwIEDaTTarFmzdHR0iBFpaWlzc3MajTZgwIDQ0ND58+cT41ZWVjNnzvzZfi5d&#10;ukSn04WEhP766y8OxAbfg5/gvG3//v3q6urTp09HCK1Zs4Zs9gIA4LDff/8d49F37dq1a9cu6oiE&#10;hMQPe05QGRsbI4QePHhAdKFACMXGxra2tpqZmbVnRjDADlCVeVVdXd3SpUvDw8MlJCRGjx598+ZN&#10;3IkAEGj9+/efNWvW+fPnO/HdzZs379+/n+WRfqi6upp4p7lXr14LFy4sLy+3sLCorKykbgMzDmEE&#10;V7B51aZNm8LDwxFC9fX1RLtyAABGoqKi0tLSnfsuJ7upFhQUJCUlIYTs7OwGDBjQ2trKVJKVlJRU&#10;VVU5lgcwgXNlXlVQUEAsGBkZeXt74w0DAGhtbW1qamr/9qKioj4+PpqamgwGY+7cuXQ6PTg4WF1d&#10;3dramn0hEUI9evQwMzOTlJTctm3bDzdwcnKC+bwwgqrMq0JCQvr164cQWrlyJfSAAgC7V69eEZev&#10;2ikkJIRotki4e/cu8a5wTEyMpaUl6/P9S15ePj4+nlyVkJDYsGHD7t27GxoaZGVlPTw84PI1XlCV&#10;eUZpaamDg8OzZ8/mzJkTGBgoLy/v5+eHOxQAACGECgoKXFxc2t5GR0dnxIgRxLKJiYmTk9MPN7Oz&#10;sztx4kQbj0mzlqSkpJ+f3+jRo8+cOePi4jJ+/HjOHBf8DFRlnvH+/fvExESEUE1NDe4sAID/4eDg&#10;8PjxY+qIuro6tVGEurp6QkKChobGz/YgKyurpKT07du3hoYGTlZlgrm5ubm5OSePCH4GnvbiGaKi&#10;ohISErhTAACYRUREPH36lDoydOjQCxcuUEfc3d3bKMkIIUNDw/DwcFVVVVVVVeqVbSBo4FyZZwwd&#10;OnT69Olnz57FHQQA8J+YmJhZs2ZRRwYPHhwTE9OJljAWFhbU9ymuXsqZt04AACAASURBVL1Ko9Es&#10;LCxYkBLwDjhX5iXHjx+vra0NCQnBHQQAgBBCVVVVAQEBTIPOzs49e/ZkGvT29u5Qm/Pw8HBbW9tp&#10;06ZFRUV1NSXgKVCVudq1a9cGDRo0aNCgb9++IYTExMQkJSWh3SkAXGLNmjW3bt0iV0VERExMTBwd&#10;Hb/fkmwb007nz59vaWlpaWlxcXGBK2QCBaoyV9u3b9/Lly9fvnxJtnkBAHCJW7duXb16lVwVExPz&#10;9fW9cePG980hOkFJSYlYqKqqCgsL6/oOAa+A+8oAANBhDx48sLOzKysrI0d0dXW3bt36s+2tra07&#10;1FY1ODiYfI3K1ta20zkBz4GqzNUCAgIMDAxwpwAA/I+UlBRjY2PqRWlNTc3o6Og2vvLHH38QHRLb&#10;SV5e3t3dnVxtamoiHijp0aOHvb19xyMDngFVmes8fvz4y5cvGhoa+vr6urq6Hz58QAhB72QAuERj&#10;Y2NAQADTfeJZs2YRc+39ENEHoisHXbdu3d69exFC3bp1k5KSmjJlSlf2BrgZ3FfmLmlpaVOmTJk6&#10;deqxY8cQQmJiYhoaGhoaGiIiIrijAQBQXV3d2rVrmd5FXrZsWdvdiGk0mpycXFeOSz7jKSwsDD8N&#10;+BucK3OXsrKy0tJS3CkAYLu6ujoGg0EdqaysJGZg7t+/v6urK0JISkoKT7ifaGlpWbt27cGDB6mD&#10;s2bNYhphh82bN2tqaiKEVFRUzMzM2H04gBFUZe6irq6ura2dk5ODOwgAbJSamjp58uSqqqqfbbBm&#10;zRphYeGkpCQTExNOBmtbREQEUwGWl5d3c3PjwKHFxMSo82wnJyenpqYuWrQI7m3xH7iCzV20tbUX&#10;L148c+bMoUOH4s4CAFs0NTWZmpq2UZIJra2t1NZG2L169Wrt2rVMg4cOHRozZswvv1tbW5udnc2q&#10;JA0NDQEBAevWrVu8eDGr9gm4B1Rl/Gpqah4/fvz48ePW1laEkJeX1/nz5+fNm4c7FwBsISoqyvSf&#10;t6ur64MHD+Lj40eOHDly5EhdXV1c2X6GaH78+fNn6qCtrW07LyaXlpbGxcWxKkxFRQXxnvStW7dg&#10;ghH+A1UZvzVr1hgZGRkZGTU0NODOAgDbCQkJrVixQkFBgVi1tbUNDAwcPXq0mZnZo0ePHj16lJyc&#10;bGhoiLjpvnJISMiRI0eoI8bGxqGhoeSfgpOEhYUlJSURQpWVlRs3buR8AMBWUJXxS0tLwx0BAI4a&#10;MGAAUVcQQoMGDWKaRLZHjx7e3t7btm3bsmULjnTMioqKiHciqNzd3Tv0WHV8fDxxMazrlJWVY2Ji&#10;aDQaQgh6V/AfeNoLPyMjoydPnuBOAQAXYerChNGnT5+mTp2amZlJjkhISJw5c8ba2rpD+7l+/TrT&#10;M+ddMWHChGvXrkVEREDPR/4D58r4LVmyZPz48ePHj4fXEAH4/Pnz7du3iXYs2OXn50+fPp1akhFC&#10;w4YNmz59Oq5IpEmTJoWGhuro6Li7uxsaGl68eLG8vBx3KMACUJXxePbs2fTp00NCQlpbW/X19ZOT&#10;k5OTk8XFxXHnAoDTzp8//+bNm0//mjp1qrGx8aNHj3DnQgihI0eOPH/+nDoyZsyY8+fP48rzvc+f&#10;PwcHB2dkZNja2i5evLimpgZ3ItBVcAUbgxcvXlhbWxcUFFy+fNnOzg7eOASC7M2bNwMGDMCd4gcu&#10;XLiwbds26sjQoUMvXryooqLSib1NmzatQ90pOuHChQuTJ0+mvtYMeBGcK2OQk5NTUFCAOwUA3GvV&#10;qlV4A7x79+77JhCLFy/uXElGCP35558d6k7RTlpaWpGRkb///jtCSF9fH24z8wE4V8ZAVVVVUVGx&#10;qqpqz549WN6sAIB79OvX78KFCxISEgihq1evnjhx4uXLlyx8MKoTSktLPTw8qBloNNqePXu48zTU&#10;zs7O1NS0pKREXFxcSEgoJyenpqaGeLUM8CKoyhiMHj06MTGxqqpqwoQJuLMAgJO0tHR8fLyWlhax&#10;6unpOXPmTEdHxzlz5uCKVF5ePm/ePOq0Yt26ddu0aZOHh0en96miomJjY8OKdD8mLy8vLy+PEPr0&#10;6ZO5uXlNTc25c+fGjx/PviMC9oGqzDmFhYVbt26dOHHijBkzhg8fjjsOANgkJSVVVFQghGg0GlmS&#10;CWpqasnJyZhyIYSQra0tUwB9fX0fH5+u7LNbt259+/btWq52+fvvv4lZ9GfOnBkbGztixAgOHBSw&#10;FlRlDvn48aO5uXl2dnZWVtakSZNkZWVxJwIAm/T09NraWtwpfuD27dt3796ljvTr1y8iIgJXnk4T&#10;ERERFRXFnQJ0BjztxSGzZ88mpqe/e/cucZYAAGhubn79+jXuFP+vvr5+//79dDqdHNHR0YmPjyda&#10;KPKEbdu26evrI4SsrKzg1jKPgqrMIZWVlQghISGhYcOGMc0vCMDPdOVeJtdiMBjkOwi1tbVRUVF4&#10;8xBqamrc3d2Jrg8EISGhpUuXMl1g53LKysrx8fH379/fs2cP7iygk6Aqc8iCBQt0dXXDw8OfPn2q&#10;qqqKOw7gDRoaGrgjsF5zc3NwcDC5eunSpdLSUox5CGvWrKFOdi0iIrJ48eKVK1dijNQ5ampqY8eO&#10;lZGRYTAYZWVlZWVl1dXVuEOBDoD7ymyUl5cXFhaGEBo+fPjatWu/b84KAMjIyPD09Dx58mTbm925&#10;c4fpISxNTU1WNTzNyMigniUjhLS0tA4fPsySneNy+vRp4u9HXV09Pj6+f//+uBOBdoGqzEZ5eXlE&#10;0xtxcfHMzEwdHR3ciQDAT0xM7MKFC/Pmzaurq2vnV9zc3I4dO8bU6pRGo3l4eOzcuXPJkiVdyZOR&#10;kTFx4kTq+XrPnj3Dw8O7sk9ukJCQQCzk5ua+efMGqjKvgKrMCY2Njaxq4gYAH7C1tdXV1W1ubiZW&#10;FRUV29g4Pj7+3LlzREkeMmSIjIwMQuj+/fstLS0VFRXbtm3rSlV+/vy5hYUFtST36NEjKirKyMio&#10;0/vkEr6+vsT9e21tbWNjY9xxQHtBVeYEKSkpohkqAIBAPCr8S0lJSU5OTkQLKSsrq5MnTxLT4Xl7&#10;e+/fv7+5ubkrk9e+f//e2tq6uLiYHJGTk7ty5Qp/vOarr69/584d3ClAh8HTXmykrq4+aNAghNCF&#10;Cxe0tbVxxwGA9yxatKikpAQhNHHixIiICHKGWn9/fy8vry7u/OTJk3l5edSR9evX80dJ/l5MTMyV&#10;K1dwpwC/BidwbKSmppaWltba2gqvQgHQFWZmZrGxsUwNyLdu3dqzZ89Xr151bp+enp779++njtjb&#10;269evbrzKbnYuXPnHB0dEUJhYWGsekQOsAmcK7PYq1ev+vfv379/f0dHx6qqKhqNBiUZgM45fvx4&#10;UVERQsjOzo6pJCOEHj58qKWl5e3t3Yk9Hzt2LCgoiNp/QkFBwc3N7fujdJqiouLSpUtZtbcuioyM&#10;pNPpdDp92bJlKSkpuOOAtkBVZrHGxsbs7Ozs7OzTp08TE9ICADqBTqfv2rWLfCKMSXh4uJmZmbm5&#10;ubm5+ZEjRzq058LCwj179rS0tJAjsrKy//zzD9EPkVVERESUlJRYuMOu6N69O7EwcOBAXV1dvGFA&#10;26AqAwC4EYPBePv27c8+Xbp0aU1NDUIoKysrKyurQ7v18/Mjpr8lCAsLnz59esaMGV1Jy+X27t07&#10;ceJEGo22bNmy3377DXcc0Baoyuyip6enrKyMOwUAvIpGo+3atetnn1Jf9enQaz8hISH//PMPudqt&#10;W7f4+HgrK6vOheQVMjIy169fb25udnJywp0F/AJUZRbT19fftm3b9OnTExMT1dTUcMcBgB+8ePGC&#10;aeT8+fPEtDybN2+eNm1aO/cTGBjo6elJHTEyMpo0aRJLQgLAElCVWYPBYKSnp+fm5oqJia1bt+7i&#10;xYtQkgHoopkzZ6qoqCCEjh49Sjz2RZKWliaeoyTflfqlAwcO+Pr6UicI09XV5cUujV304MGD8ePH&#10;jx8/fuXKldzZT1PAQVVmgdbW1n/++WfIkCHGxsZt3AkDAHSImpqanJwcQqi2ttbc3LyoqIisIomJ&#10;iR2aP6ShoWHlypX19fXkiKio6NKlS4mqj1F9fX3VrxB30Fll8+bNd+7cuXPnTmBgYHp6Ogv3DFgC&#10;qjILvH371tXVFSGUm5v79etX3HEA4B+XL1/u27cvQigjI6Nnz54DBgzYunXr1q1brays2t+nvLKy&#10;0sTEhNo4GSE0bdo07I0yi4qKxowZI/crOjo6GRkZrDro5MmTiQU9Pb3evXuzareAVaAqs1KfPn3I&#10;NxAAAF03YMCAjIyMoKAgAwMDhFB+fv7GjRs3btxIvDH1559/tuc9n+XLlz948IBcFRERCQsLI/q5&#10;4fX58+f2nK0WFRUdPXqUVQdduXJlSUlJSUlJampqnz59WLVbwCowtxcLqKure3l5paSkBAcHw7uA&#10;ALCWnJycm5ubra3t1atXT506RY77+PiMGzdOXl6+7a9fuHDh2rVr1JF+/fotWLCALVk7SEpKqnv3&#10;7sSUogR1dfWePXtSt3n27FljY+OpU6cOHDjAkoOKiIiQL0e9ePFCVVUVziW4ClTlLqmrq2tsbFRQ&#10;UGjjFQ4AQNf17NnT1dWVuFXUfsnJyYsWLaJe66bRaOvWrWN1uk7q37+/mZkZ+auGoqLi942QN2zY&#10;8Pfff7Pj6KmpqVZWVgYGBleuXJGWlmbHIUAnQFXuEhsbm5ycnPj4+H79+uHOAgBgFhwczHT7efXq&#10;1cSM0FzI3t7++y7IDg4OUlJS4uLiLD9cfn5+aWnprVu3LCwskpKSunXrxvJDgE6A+8qdl5qaev36&#10;9ffv3/P3rEAA8KKGhobp06dfunSJOrh58+bt27fjivRLEydO/H5QV1fXx8dn1apV7DvuvXv33N3d&#10;2bd/0CFQlTsvMjKytbUVIdTU1IQ7CwDgfzx9+vTy5cvUkd69e7u4uLCw/wRL+Pj4kMvUeUARQm/e&#10;vLlx4wb1BWvWmjx58qxZs4hlDQ0NNh0FdBRcwWYBmFcWAK7y9u1bst4QlJSUYmNje/XqhSvSz6iq&#10;qpLLW7du7d69+4QJExBCJSUls2fPzs3N3bBhg5+fHzsOLSsre/jw4blz5yKEJk+eXFBQoKCgICUl&#10;xY5jgfaDqtx506dPDwwMbG1t3bBhA+4sAID/hIWFFRYWkquKiorXr18n3q3iZg0NDYsXL2Ya7HQD&#10;6faQk5OztLRECD1+/NjS0nLSpEmnT59m3+FAe0BV7rxx48bdvn07KysL5tEFgHssW7YsJCSEOmJp&#10;aTlkyBBceXhCVlZWSUnJtWvX0tLShg4dijuOQIOq3GF5eXlz5sxBCN2/f3/cuHHjxo3DnQgAgBBC&#10;dDp95cqV1JZQCCEXF5fAwEBckTpq4MCBWlpaCKHa2tqbN29y+OgVFRW3bt2CqowXVOUOu3HjRkpK&#10;CjELIACAe3z8+JFpqg0FBYU1a9ZISkriitQh3bt3j4uLI+bbqqurW7Nmzf3791euXMmBQ0+aNElb&#10;WzsnJ4cDxwJtg2ewOwyeuAaAC338+JG4RUoSExOLiIjgoen2xMXFySkwJSUlDx06lJmZyZmrcT16&#10;9HB1dZWSkhIVFeXA4UAboCp32Nq1a3FHAAD8j3fv3pmamjK9WbRhwwZTU1NckXiOp6dnTU2Nh4dH&#10;WlqaADa45B5wBbvDZsyY8cNHJQEAWGRnZ1tYWHz48IE6qKSkxNaZN/iYqalpTU2NsrKysbEx7iyC&#10;CKpyh3FDqxkAAIHBYJiZmeXm5lIHpaWlt2/fzhOv3n769Al3BGbV1dXNzc3+/v5QlbGAK9jtlZGR&#10;MXfu3DNnzjAYDNxZAAD/r6amhqkki4uL79mzhyeuZrW0tOzYsYNcLSsri42NZdqmsbGxpKSktLSU&#10;HGltbS0pKWHfDyKiUwXT3yrgGKjK7fLixQtLS8uzZ886ODjU1NTgjgMAQAih8vJyExMTpsGjR48u&#10;WbIES56OysjIiIqKIlfr6uoCAgLodDp1m+XLlysrKxOvSxGOHz+urKx88eJFNqViU4sq0E5Qldvl&#10;9evXBQUFuFMAAP7H4sWLnzx5Qq7SaLRz5845ODhgjNRFN2/eJGbXJwQFBRG3zKqrq7dt20YMJiUl&#10;kf/LDosWLfL19YWmO7jAfeV2UVZWlpOTq6ur45WbVQDwvdOnTzNVJn19fabpr7mcnp7ew4cPqf2e&#10;p06dSqP992NZVVVVTEyssbGRwWAQ72Smp6cTf2r2dY8VFRUlOmsxGIzbt2+PGTOGHX0kwc9AVW4X&#10;Y2Pjq1ev1tbWmpub484CAEARERHLly+vqqoiRwwNDZmaRHE/CQmJUaNG3bp162cb2Nvbf/r0aePG&#10;jWTnqIKCgoqKCgUFhRUrVrA1W3Nzc0BAwNq1a728vPz8/KD7MsdAVW6vP/74A3cEAMD/W7hwYV1d&#10;Hbk6cODAK1eukFNw8BMvL69r167duXMnKSmpurr67NmzCCFvb292l8kPHz4QczPs3r27ubl5//79&#10;bD0cIMF95baEhISIiIiIiIh8+fIFdxYAAEII1dXVTZ48mVqSEULz58/ny5JMlZqaun//fiw/i6i3&#10;ugG7QVVuS3R0dGtrK/wXCQD3SE1NZbqdPH/+fA8PD1x5OOCvv/6irv75558ceO9LU1OTeL5MVVV1&#10;0aJF7D4cIEFVbgu1ITkAALvk5OS5c+dSR1RVVX18fPh79mYjIyOyXayEhISPj4+CggK7DyoqKurr&#10;65uUlJSQkKCvr8/uwwESVOW2rFu3TlxcHJ4/BIAbPHjwYNasWcXFxeTIb7/9lpSUxEP9JzpHRkaG&#10;7Bw1ZMgQMzMzzhxXSEjI1NR08ODBDAajsbGRMwcFUJXboqen19DQ0NDQoKKigjsLAIJu2rRpX79+&#10;pY5Mnz590KBBuPJw0tixY4mFiRMncv7o+/btk5eXv3//PucPLYCgKv9YVFRUVFQU048AAAAuAQEB&#10;ZWVl1BE3N7egoCBceTgsPT2dWGDqVskZMTExDQ0NgYGB0MeWA6Aq/0BeXp69vb29vf2LFy9wZwEA&#10;oOzs7P3791Ofu1y+fPnOnTv5/iXaL1++WFlZ/f7773Z2dgihyZMnDxgwAFeYCxcuVFdX4zq64ID3&#10;lX9g7969xALT2xcAAM578+aNlZVVXl4esSosLOzg4BAQEECdA4tfnTp1iuxXISEhsXr1aqJ1BIfN&#10;nTv3zp07nD+uYIJz5bZQZ8IDAHBeVlaWubl5Tk4OOdK9e/eTJ08KQklm4uXlRT6JzWFWVlaGhoZY&#10;Di2AoCr/wMiRIxFCvXv3PnHiBO4sAAi08PBwakvB7t27R0RE4IvDafr6+sTE+yYmJr6+vrhiqKqq&#10;pqSkVFRUlJeXx8XF4YohIATu9832mDt3rp6enpycnKamJu4sAAgoBoOxdevWffv2UQePHDny559/&#10;4orEeWZmZqmpqc3NzX369MF7E11SUhIh9Oeff+bk5Fy6dMnU1BRjGP4GVZnZt2/fxMXFhwwZgjsI&#10;AIKrpaUlODh406ZN1EErK6vx48djSoQNV83gUVBQUFtbu2/fPqjK7ANXsP9HTk6OkZGRtbU17iAA&#10;CLSPHz+uXr2aOjJx4sSIiAgOzGkFfikjIwN3BH4GVfk/r1+/NjY2fv/+/c2bNz09PXHHAUBA5efn&#10;z5gxgzoiIyOTkJAgISGBKxIgkO+nAPaBK9j/+fTpU0VFBUJISEjI29sbdxwABFF+fv706dMzMzOp&#10;g+vWrRMREfnld1++fHnixAniVSJnZ2cvLy92pRRU06dPT0lJqa2txR2En0FV/o+5ubm6uvrLly+X&#10;LFmirKyMOw4Aguj48ePPnj2jjhgZGTk4OPzyi0+ePLG1tc3PzydW//rrLwkJiWXLlgkLwxVBlpGV&#10;lf3nn38QQqWlpWVlZerq6mJiYrhD8Ruoyv9j/fr13759GzduHO4gAAiiixcv+vn5UUeGDBkSHR3d&#10;q1evtr+YkZFhY2NTUFBAjjQ1Nbm5uUlISCxcuFBISIgtcQVVZWXl5MmT09LSXr16paenhzsOv4Gq&#10;jD5//nz27FmEkIGBwaxZs3DHAUBAnT592tHRkWnw8uXLvyzJaWlppqamxCzZRkZGxG/V165dy8rK&#10;cnFxqa6uJhsusVVkZCQxAdmyZcuI94h+6Nu3b8ePH0cIubq6Ypmoq+tiY2PT0tJwp+BbUJXRp0+f&#10;iPtPUlJSz5494/uucABglJKSUlJS8v1rDseOHfPw8KCOCAkJBQUF/bIkI4QOHjxIlORdu3YtXrxY&#10;Tk4OIbR48WIdHR2E0JUrVzhQlffs2fPXX38R7Q4NDQ1/1tmpuLh41qxZxOyV7969O3LkCLuDscOV&#10;K1eIhYyMDDhXZjm44/Kf2tra5uZm3CkA4FvR0dFWVla2trZ+fn7Uf2uJiYmrVq2iTjsvLi7+999/&#10;r1ix4pcPeTEYjLCwMGJZQUGBKMkIIXl5eVbHb8vBgwfJDsR79+792fNQ8+fPJyeUvnTpEo/2v1m9&#10;ejXx5E1SUhLuLHwIqvJ/xMTE2vOcJwCgE27evLlw4cLy8vLW1tZNmzaR3SYQQvv376+pqaFurKOj&#10;085Z6M+dO/fDcRkZGSsrK4TQmzdvnj9/3oXg7UKdeCshIeHJkyc/3Oz9+/fkcklJSVVVFbuDscOo&#10;UaPi4uLCwsL279+POwsfgqqM1NTUBg4ciBA6e/Ysxi5pAPC3rKwsahHy8fEhFu7cucPUj0hLSys6&#10;Orqdu3306NEPx7t16zZ48GCEUHFxMfHYMFv5+/tTV8k/Hb8aNmzYggULOHxBQkBAVUa9e/dOTU0t&#10;LS21sbHBnQUAQTF8+HCEUFNTU2BgYENDAzmuo6OTkJDQr1+/Tuzz6dOn5HJDQwN5ffjChQtZWVld&#10;y8t6ffv27d69O+4UXbJ3797+/ftnZ2fjDsJX4GkvhBCSlpbm0YchAeAVTH0mHBwcamtrV69efenS&#10;Jeq4s7OztrZ25w5x9OhR8tng5ubm9PR0Yrm0tDQhIYGtV8KIW9qVlZVtbFNUVET9/WPmzJnE82i8&#10;KywsLDs7+8iRI0z/54KuEPRzZRcXl5kzZz548AB3EAD4Fp1OP3z4MLUho5SUVHNz85o1a5iuLc+d&#10;O3fNmjWdPlBra+uTf5ElmTPGjRtnbGxMrjY3N9fX1zNtM3XqVPKNaikpKaaJvnlXYGAg7gh8RaCr&#10;8q1bt86ePRsZGUnOBwQAYLnCwsKlS5cyGAxiVUREJDY29unTp4cPH6ZuJisr6+bm1sWpuIyNjXfu&#10;3Llz505DQ0NyUEFB4ffff+/KbtuDOv9JWloa0zUAhBD1obPly5erqKiwOxK7Ec/TAdYS6KqckpJC&#10;/D4L58oAcMy4cePGjx/PdE6sqqqalJRkZGTUlT0fOnQoMTHR29vb29v70aNH5Gz2srKyI0aM6Mqe&#10;O2HFihXk5fSamhoefQmqbU5OTn369MGdgt8IdFUmcfhiFwAChfo0kIaGxoULF3x9fQsLC8nBHj16&#10;REZGGhkZvXv3bsuWLQMHDjx27FgnDiQqKioqKkosi4mJkcucmRpIWlqaOudJeXl5XFwcsfzt27dJ&#10;kybR6XQOxOCkAQMG3Lt3jy9/4cBIoKvyrFmzDAwMTExMfvbKIwCgi+rr6/fs2UOulpSUzJs3b+fO&#10;nS0tLeRgZGTkiBEjNmzYYG5uvnnz5tevX69cufLatWvt2f+iRYt+uc3SpUs7kbyjNDQ0Ll68+LNP&#10;i4uLyWVRUdH58+dzIBIH9OnTR09PLywsbN26dd/fSgedINDPYPfr1w/adwPAVqmpqdQZoGpqasgz&#10;SIK5ufnw4cN9fX0DAgLIwdraWurTYW3Q19e3sbEhyiF56xohVF1dnZiYSCxzrDsFMfPBL9nZ2fHT&#10;1AgXLlxwdnZGCFVVVQUHB0MvkC4S6HNlAABbvXr16pdNGBkMhrOzM7UkI4Tk5eWJOUDa448//iAW&#10;VqxYkZKSghAqLi4eP348McHW+PHjp02b1uHo7EQG5g93794lFg4ePEjOfgo6TUCrclRUlIaGhoaG&#10;Rnl5Oe4sAPCt0NDQz58/t71NQkIC0bSNytjYuP1PTS9YsMDCwgIh1NTUNGXKlNOnT58+fZp80mrj&#10;xo0dTA06Rl9fn1jo37//zJkz8YbhAwJ6BfvQoUPE9TH+e/4CAC7x5cuXTkx1qaioaGJiEhIS0v6v&#10;yMrKenl53b17t6amprKyktoO0szMjJNPXwsLC6uoqHz58qWNbcTFxRUVFTkWiQMWL15cUFBw+fJl&#10;b29vmI6p6wT0XFlcXBx3BAB+7fz587gjdBKDwdi/f//PWif9kJCQkLS09KVLlyIjI5WUlDp0uPHj&#10;xwcFBUl/x9PTk5N1QkJCIjExUVZWto1tNDU17ezsOBaJM/z8/DIzM+fOnYs7CD8Q0KrMNJU8ANwp&#10;NTUVd4ROOn/+fEf/lTk5OVVXV3f6nuuCBQuqv/OzPsfsM3jwYGr/qO9NmjSJY2EALxLQK9gDBw4k&#10;rjLx2aUkALhEO99rImhoaERFRZG3J/nblClTcEdgl1u3bn358mXgwIEGBga4s/AwgTtXLioqsrCw&#10;iImJUVZWVlZW7uL0fgCA771+/Zp8K+mX1NTUrly5MmzYMEG4ryQvL9/29W3ede/evenTp8+ZMyci&#10;IgJ3Ft4mWOfKVVVVU6ZMef78eWpqqqKi4p9//ok7EQB8KCQkpLS09Jeb0Wi0nj17xsbGDho0qJ17&#10;bm5urqioIFdFRES48HKXtLT0169ff/jR2LFjuzirKNcqLy+n9s8GnSZYZ4rr168nJogXFxeHft0A&#10;sMOLFy++b8zwQ76+vp8+fWp/Sd6+ffuiRYuUKbS0tB4+fNiFsGxx9erV3r17407Baf3799fU1MSd&#10;gh8I1rmyv7//gQMHEELTpk1r/xwFAOAyatSoT58+4U7RMWFhYdQ5rn/IwMDAxcVl2bJlv9zb+vXr&#10;g4KCiOXa2lrq7F0IoYqKiidPnowePbrTadlh4MCBvXr1+mEnCQoaRQAAIABJREFUul27dnE+D2fo&#10;6OgsXbr0zZs3w4cPx52FtwlWVe7WrRvRA9XV1RV3FgB+bdasWbx1ly40NJT4xbcNenp6CQkJPXr0&#10;+OGnhYWF8+fPJ68AZ2VlNTc3/2xXEhISampqnU7LeWJiYrgjsFFXemMDkmBVZWFh4Vu3buFOAQDf&#10;KikpobadYCIhIbFx48aZM2cyleT8/Pxdu3YVFBQghD5+/NjO2em7deu2bds2GxubLmbmGAsLi5/9&#10;LsI3GhoaZs+ejRDy9/fX0dHBHYcnCVZVBgBgFBQU5OLiQixnZGScOHGCWA4JCWlsbOzQrvz9/bW0&#10;tGxtbVmbkFWmT5/+/bvmmpqaUlJSWPJwTEtLy+XLlxFCurq6O3fuxB2HJwlQVa6oqLC2tr537154&#10;eDjMQQMAy7W0tDx48KCNDfLy8oKDg+l0uqenJ4PBYLpJ3B6pqanEDJpc/k7j2rVr09PTmVrEjhs3&#10;DlcezouIiFi4cCGcLneCAFVlDw+PO3fuIISio6OhKgPAcunp6TExMW1ssHXr1i4e4sGDB+155woX&#10;AwMD8unr7xsacu2ZPQtJSkoeOnRo1apVFRUVRUVFUJU7QYCqMvmPWUVFBW8SAPhPbm7u9OnTmQZ1&#10;dXV9fHy+ffvGqueAVq9ezZL9sImhoWFiYqKysvL3Hy1ZsoTLz+9ZQlhYeOnSpXp6ehISEiNHjsQd&#10;hyfx/38lpFmzZklISJibm+/evRt3FgD4TU1NDfG4FkFISMjGxubFixfz588neh4LgvT09IMHDxLL&#10;oqKi1I90dXW/P3vmV3/++SeU5E4ToKrs6OhYV1cXFxcHvcYAYLnu3btT5wCwt7ePjo5mqkx8T0pK&#10;asuWLcQy9bd/OTk5TjaU5AanTp3KysrCnYInCdAVbAAA+6ioqFy/fn358uUIob59+/r5+ZEf7dmz&#10;h0ajIYSKi4vv3bvX6UNMmzatE+/7Xr9+nZikc8aMGew+WyVeCiIoKSkdPXo0KSkJIdS9e/fff/+d&#10;rYfmKpcvX3Z2dlZXV3/79i3uLLxHUKryq1evGAyGgDSlAQCL7t27R0ZGfj+uqalJjJeXlycnJ7u6&#10;upaUlHRi/25ubqNGjeroy0Xp6elEm+cxY8Zw8hqysLCwi4sL+SaYQKmvr29ubs7NzQ0PD583bx7u&#10;ODxGIKpyTEyMg4MDg8GIjo42NTXFHQcAAaWgoGBjY6OmpkacQhUUFOzZs4f4qLm5+Ze9DSZOnGhu&#10;bq6kpESs+vj49OvX75dnz4aGhl0ODjpGXFycRqM1NzdTHzUA7SQQVXnGjBlNTU0IoezsbKjKAOA1&#10;cuRI8lEgHx8fYiEvL8/CwuLVq1dtfzc+Pp5cPn369NWrV62srNiUE3SajY3NsGHDHj16hDsITxKg&#10;p71kZWUHDBiAOwUA4Af69Onz+PHjiooKZ2fn9v/qTBZ1wG2OHTvm5OTU/oZggCQQ58r79u2LjIx0&#10;c3MzMTHBnQUA8GOSkpIIoWPHjlVVVb1//54YzMzMDAoKSktL++FX6uvrmUby8/M/fvz4y2P17t1b&#10;Q0Oja3lBW/T19Y8ePfrw4UM6nS4iIoI7Di8RiKq8fPly4tFQAAD3k5WVHTJkCLE8ZMgQa2vrmzdv&#10;Equ5ubl79+79/Pkzsbpw4UKm754+fXrdunW/PISOjs7Dhw8VFRVZlxow27t3r6+vb2BgoLu7O+4s&#10;vEQgqjIAgHfJyclRG0MtWbIkJCSEWP5+NrEJEybIyMhUV1e3vc+3b99+f54NWCszMxMhdOzYMXt7&#10;e1VVVdxxeAb/V+WHDx+amJhoa2vHxMT07dsXdxwAQJdISUm1MX+nkZHRjRs3pk2bVlxcjBD69u2b&#10;jIwM0zaRkZEPHjzg+/ZNXOLFixclJSVQlduP/5/2unz5cn19/YsXL375eCcAgA+MHDmSvGcs+iNz&#10;5849ePCgvLw83px8rz23EsD3+L8qAwAA4DwdHZ0VK1bo6uqKi4vjzsJL+P8KtoiIiKioaP/+/QcO&#10;HIg7CwCAo+h0OnW1tbX1wIED79+/DwwMxBVJcIiJiQUHBzc3NxPzrYJ24v9z5e3btzc1NWVmZsJN&#10;ZQAEzaRJk6ize3p7e3t4eBw5cgRjJIFy//59GRmZ4OBg3EF4CfwKAwDgW0+ePDEwMCBbVxUVFeHN&#10;I2ji4+MbGxuPHTtmZ2fXo0cP3HF4Az9X5Zqamnfv3iGEDA0NBaezKQCAingYG2D04sWLJ0+eTJ06&#10;FXcQ3sDPVdnLy+vw4cMIocbGxk40gAMA8DoxMbFNmzb16tWLWN28eXNubi7WRILF1tZ27969jY2N&#10;uIPwEn6uyo8fP8YdAQCA06lTp+zt7cnVMWPGmJmZFRYWYowkUIYOHWppaRkdHY07CC/h56e9hg8f&#10;jjsCAAAnc3Nz6mq/fv2eP39OTtgJOODMmTOlpaVmZma4g/AMfj5XXr58OTFzCNxUBrzo8+fP27dv&#10;Rwh5enrizsJLSktL25hxU1ZWlpNhgLi4OLyv3CH8XJUNDAzu37+POwUAnRQREfHkyROEUO/evXFn&#10;4SU3b958+fIl7hTg/9XV1fn6+hYVFTk5OU2ZMgV3HB7Az1ewAQACLiYmBncEQXfu3LmgoKCoqCji&#10;jRjwS3xblc+cOSMpKamlpYU7CACAc54/f05t20q2gCQMGjRIQ0MjKyuL47kAaC++rcp///13fX09&#10;PJEPgOCor683MzP79u0bOXLx4sXs7GxytbGxMTc318TExN3d/caNG8ePHx84cOChQ4dwhBUUtra2&#10;/fr1w52Cl/DtfWWyj1t0dLStrS3uOAAATiAmvu7WrZuamhpCyMjIiDql1OLFi728vIqKioKDg8lp&#10;IKlTcgKWk5eXP3bsWHV1tZ6eHu4svIFvq7KwsDBCqFu3bmRPNwAAf5OQkEhISHj48KGKigr1NWXS&#10;jBkzQkND37x5Q45ISUkxvT0FWO6PP/5gMBi4U/AMvr2CnZCQsHLlytu3bw8dOhR3FgAAhwwfPtzN&#10;ze2HJRkhpK6u7ujoSB0JCQkZOXIkR6IJrvz8fAMDAxsbG6jN7cG358ojRowYMWIE7hQAAO7i5eX1&#10;6tWrs2fP4g4iQN69e/fy5cuXL1++ePHCwMAAdxxux4fnynQ6fdeuXd7e3vX19bizAAC4i6ioqIyM&#10;DO4UAurYsWO4I/AAPqzK1dXV3t7eu3btSk9Px50FAMBdcnNz79y5Q66eO3euqakJYx5B0L9/f0ND&#10;Q9wpeAYfVmXS2rVrcUcAAHCRnJwcU1NT6tNe8fHxFhYWDQ0NGFPxvZ49e7q4uOBOwTP4sCqLiorq&#10;6+vjTgEA4Dr29vY5OTni4uJfvnwhr6bevHlzzZo1eIPxPVdX1y9fvmzbtg13EB7Ah1VZSkrKw8OD&#10;RuPbB9kAAJ1TU1ODEFq9erWysvL06dOnTp1KjLfRzQKwhIiIiLKyMtzRbw/+LF0uLi4KCgpycnK4&#10;gwAAuMi+ffuqq6uJtzMUFRWPHz+emJiIEIJZDdiNTqcTc64pKSmJiIjgjsPV+LMqI4RgPi8AABNL&#10;S0vqqqKi4uzZs3GFESj5+fnErz6BgYHu7u6443A1PryC3dTUFBoaevfuXdxBAAAAIER59tbT0zM5&#10;ORlvGC7Hh1V506ZNLi4u1tbW0BkGAAC4Qd++fYkFeXl5WVlZvGG4HB9W5c+fPyOEysvLYRYRwNOm&#10;Tp2qrKyMOwUALODh4aGurq6urn7ixIlhw4bhjsPV+Pa+MgC8TktLS0JCAncKAFhATU3t48ePuFPw&#10;Bj6syqampnJyciNGjIC+FAAAAHgLH17BdnBwCAoKYuoMAwDP+fDhA9yFAfwkPDxcW1vbzMwMdxCu&#10;xm/nyg0NDVu3blVSUvLw8IC34gBPu3LlytevX3GnAIBlduzY8f79e3FxcdxBuBq/nSu/fv16+/bt&#10;np6eZWVluLMAAAD4z9u3bxFCRUVF9+7dw52Fe/FbVSbBxLYAAMCFRERE4HS5DfxWlRUUFNTV1XGn&#10;AAAAwOzcuXP29vaXL18eOXIk7izci9+qsoaGhoODA+4UAAAAmNnb20dERIwdOxZ3EK7Gb1UZIbRh&#10;w4ZTp04tWbIEdxAAWOP06dO4IwDAAklJSY6Ojj4+PriDcDU+rMpiYmIODg5jxozBHQSAzmMwGAkJ&#10;CcRySkrKpk2bamtr8UYCoIsCAgJOnz4dExODOwhX47eqHBcXd/z48fT0dNxBAOiYuro6GxsbuX/J&#10;y8snJSURHzU1Nfn5+fXo0YP89MiRI0QLQgB4CPEfbUVFRXZ2Nu4s3Iuv3lcuKSnx9fXNzMzcvHmz&#10;oaEh7jgAtMuXL18WLVr04cOHV69etbFZdXU1uezq6iotLR0YGLhw4UL2BwSAlSoqKt6+faurq4s7&#10;CJfiq3PlO3fuZGZmIoSqqqpaW1txxwHgF8rKyo4ePWppaRkTE9N2Sf5eTU2Nu7u7ra1teXk5m+IB&#10;wFru7u69e/fetWuXlZUV7izci6+qMmnfvn1VVVW4UwDwC6tWrVq8ePHTp0879/Xa2tqLFy9OnDjx&#10;27dvrA0GADvs378/Ly9v+fLluINwNb6qylpaWj169BAXF4+JiZGXl8cdB4C2BAcHs+Th6rS0NBMT&#10;k4KCgq7vCgCAHV9V5SFDhjx69OjVq1eWlpa4swDQloCA/2vvzgNqyv//gb9alRYUKpU0dsZalEJG&#10;SZu1kpFdYbJkN5Zs2XeNLGMbZBmKyJIsGaRJlEiWCKWylXbt9/fH+fzutzGGqO773HOfj7/OPZ3u&#10;fWaMZ+/3Wd6b586dW13nWeLi4rp167Z06dJqeTeAmvPXX3/hcZtfJqhWJiKRSCQSiVinAPhPIpFo&#10;+/bt8+bNq971oF69euXr67tv375qfE+A6rV7924HBwcHB4fz58+zzsJfgmrl2NhYc3PzLl26sA4C&#10;8J8OHz7s5eVVWFhY7e9cVla2devWjIwM/GIK/DRhwoSCgoK8vLyUlBTWWfhLUHdG7dq1Kz09HWeU&#10;gbcyMzP9/f1r7v1jYmLq169/8+bNbt261dynAFSFtrZ2+/btGQY4fvz4y5cvxS9VVVU/uQBt48aN&#10;Fc8utWjRon///hKLJ6hWPn36NBGVlJQ8fPiwdevWrOMAfOrSpUuRkZE1/SmLFy8WP4EEgD8CAgKC&#10;goKmTp1qbm7OKsOlS5dGjBhRVFQk3iMvL19aWurt7S3eM3fu3NLSUvFLZ2dnSbayoGawfXx81NXV&#10;CwsLcTUB8FBUVNTEiRMl8EFpaWlYXxx46Oeffw4MDOzZsyfDDJ07d7a3t6+4R11dfdCgQZ89WE5O&#10;rlOnTjNnzpRItP8R1Fh5woQJjRs3zsrK+vnnn1lnAfhUZmamZJ748eDBgxMnTnh4eEjgswC+CfeI&#10;Og0NDVYBtLS09u3bV1RUJL7iTElJqXHjxuIDxNd8yMvLe3p67tixQ8IJBTVWJiJ7e3tUMvCTJJ9c&#10;PW/ePIl9FkAl3bp1y8jIqGnTpjExMQxj1K1bNygoSPyyoKDg2rVr3HZOTo61tTU3fT158mTJVzIJ&#10;r5UvXLiQlJTEOgXApx4/fvznn3+yTgHAUlRU1IcPH4qLi7Ozs9kmUVFRWbRoEbf98eNHOzu7K1eu&#10;ENGkSZNu3rxJRL/++uv69euZZBNUK1++fNnFxaVfv37JycmsswD8w6VLl16/fs06BQB7+vr6P/30&#10;E9sMcnJyv/zyi/g22o8fPw4ZMsTU1PTs2bNEpKen5+XlpaSkxCQbL84rl5eXv3nzpuIeNTU1TU3N&#10;yr9DdnZ2QUHB+vXr8/LyEhIS/Pz8Fi5c+IVbpDIyMoqLiyvu0dDQUFdX/9bk3yE/P1/8jG51dXWG&#10;51dAwMrLy/Py8iTzVxrgm5SWlhYUFNSuXZttDF1d3aCgoD59+nDLSmZkZHDPk9fU1Dx9+rShoSGr&#10;YOxbOTk5ed26dVu3bq2408TExMbGpvJvEhYWFhsbK365YcOGCxcuODo6/tfxR44c+WQ8bWVlJZmL&#10;9aOjo7mpEiKysLDo0aOHBD5U8vr06WNtbc06BY9IeKX3zMxMBweHsLAwFRWV6n3nI0eOxMXFVe97&#10;goAtW7ZMWVn5wIEDCQkJd+7cIaInT54MHjy4WhbbnTFjRsOGDb/72w0NDUePHv3JRRiLFi0yNTWt&#10;crTvJzdu3Ljdu3czTGBpacnN44OQKCoqKigosE7BIxXvj5SYWrVqVft7lpaWlpWVVfvbglBxfwlL&#10;SkpqYnVdZWXl4ODgT+50+ibl5eXDhw8/cuSIeM/69eslfCtURR4eHuzHyiYmJklJSa9fv9bX12/T&#10;ps33vcnDhw9fvXqlo6NTc4+MycnJiYqK+vIxFQOEh4dXvA9d1pSWlsryj88TTH4VAKioRv8SFhcX&#10;V7Hs5eXl+TZ+YN/Kfn5+Y8aMSUtLMzQ0/O5OjY+Pf/nypZ6eXufOnas3nlhWVlZERMSXj6kYICws&#10;rKSkpIbCSLslS5ZkZWVV5shJkyY1b96ciBYuXJiXlzdy5Mgv/ydetGjRNy2t3bdvX3t7+6SkJD8/&#10;PyKysLAYMmRIxQPS0tLWrl375TdZuHBh/fr1v3BAcHDwqVOn3r17V/lg1WLo0KHDhw+X8IeCFElJ&#10;SdmwYcM3fcuMGTMq3t1beSdPnjx16tT79+/Fe9TV1XV1dbntpKSk8vJyXV3db7oYomXLllVc+CAy&#10;MjI8PLzinj179gwfPlxHR6cqb1sV7Gewq5FIJNqyZUu3bt3MzMxYZwH4B39//8mTJ0vyE52cnIKC&#10;gpSVlSX5oQBfsHXr1ilTphDR0KFDLSwsmjdvbmdnx33p999/LyoqcnBwaNq0qcTy3Llzp1+/funp&#10;6fLy8hXXG2zfvn1YWBiTYubFDHY1CgoKmj59et26dSXzBCUA3qpfv76Ery8D+KrJkyfn5OQoKirO&#10;mTPnky+NHz9ewmGio6NtbGxycnK0tbXfv39/69YtJycnbkLr3r17Y8aMOXfunIQjcQR1vzInJydn&#10;y5YtrFMAAMCn5s+f/+9KlrzCwkJbW1vubBf3OJGuXbuKB+5EdPXq1U/uDJIYQbVynTp11NTUysvL&#10;K3nOEkBiBg4caGBgwDoFAGOPHj26d+8e29VTCgsLly1bxtXEb7/95ubmxu338/MT36r68ePHDRs2&#10;cHcwS5igWrlPnz4MFwgD+AJ9ff2xY8dK7OOGDh0qsc8CqKTLly937dq1Q4cOgYGBrDIUFBQsW7Zs&#10;1apV3MvOnTuLzx/XrVu3QYMG4iNfvHgREBDwyfOmJEBQrUxEBw4cWLhwIduVwgA+y93dXTJXsjRq&#10;1AgLRgEPJSQkcGtGsRIdHW1oaCiu5K+aNm2atbX18uXLJfkUZ6G1cqNGjXx9fZk/ZBXg31q0aMHd&#10;5VXTDAwMOnToIIEPAvgmLVq0YPsU2MjIyE8mzxcsWPDlb7lx48bvv/9eUFBQk7n+QVDXYGdmZk6e&#10;PLl79+5eXl6sswB8hpGRUU1/hImJiY+PT01/CsB36Nu3b9++fVNTU6vymMyqGDJkyCf3zaqpqVV8&#10;uXr16n9fjKalpSWZ36c5gmrl0aNHh4SEBAUFqaurjxgxQk5OjnUigH9Yu3bt27dvT548WUPvX7t2&#10;7XPnzrH6Jw/gqxieUSYiXV1d8XNLPkuS7ftfBDWDza2kXVxcPGrUKObrdwL8m6am5vHjxyvegFG9&#10;pk6dikoGkGqCamXxBdgLFiyoU6cO2zAAn6WgoHD69GlnZ+dqf+fevXsvXbq02t8WoLo8ePDAyMio&#10;WbNmjx49Yp2FvwQ1g71nz5569eqlp6dPnToV09fAW0pKSnv27FFSUjp69Gh1vae9vX1AQACerwm8&#10;lZiYyJ1UVlNTe/r0aatWrVgn4ilBtXKdOnV27drFOgXA19WpU2fHjh0lJSVBQUFVf7e+ffvu379f&#10;S0ur6m8FUEOOHj2amppKREZGRk5OTqzj8JegZrCJyM/PLzo6mnUKgK+rU6fOoUOHqn6OedOmTX/+&#10;+WfFpx8A8JCPj4+8vNAapyYI6s8oMDDQ29u7b9++rIMAVEqtWrXOnz//66+/ft8lWpqamuHh4dOm&#10;TcNVFCAVwsPD8Xf1qwTVypzs7GxurVwAqbBq1ao7d+7ExMQ4OTm1a9fuywfXqlVrx44dT58+ffr0&#10;6f3793v16iWRjADVoGfPnvfu3QsNDWUdhNcEdV5ZU1Ozdu3aBQUFWMkRpIuBgYGBgUFISMirV6+c&#10;nZ1v3br172NatmypoKDg6ek5YcIEyScEqBaNGzdmHYHvBNXKtra25ubmV65cYR0E4DsZGBgEBQWd&#10;P3+eiC5dunTs2DEiUlFR8fPzGzFihIqKCuuAAN/vypUrR48ebdSo0ZIlS1hn4S9BtTIRHThwYOvW&#10;rd27d2cdBOA7GRgYeHp6ElFeXh7Xyvb29tweAKm2ZcuW06dPt2nTBq38BUJrZX19/cqvBwIgFXAb&#10;CQjDmTNniCgnJ+fZs2eSWT9NGgntaq/Hjx9bWlpaWlpOnz5dkqt8AABAZWRkZNy7d491Cv4SWivn&#10;5+ffvHnz5s2bmzdvxkPdAAD4w8PDQ1tb29fXd9CgQayz8JfQZrABAICfdu7cuXPnTtYp+E5oY2Wx&#10;Zs2aaWtrs04BAACUl5c3YMCAfv365ebmss7Cd0Jr5datW8+aNcvKyiokJEQCK8wDAMBXvX///vTp&#10;02fOnImMjGSdhe+ENoOtqqq6bt061ikAAOAzfvvtN1tbW9YpeE1oY2UAAOAbLS2tnj17sk4hHQTY&#10;yllZWUpKSkpKSrGxsayzAAAAaWpqYtn7ShLaDDYRrVixorS0lIhEIhHrLAAAQETk7Oz86NEjNTU1&#10;1kH4ToBj5bdv33IbO3bsYJsEAACIqKSk5PHjxy1atNDX12edhe8E2MqKiopEJC8v3759e9ZZAACA&#10;Nm/e3KpVq8OHD2MK86sEOIO9detWbW1tExMTNzc31lkAAGRdcnLy/v37icjd3d3MzAxPwP4yAY6V&#10;VVVV165dq6qqmpWVxToLAICse/r06YMHD1inkBoCHCsT0b59+8aPHz9w4MBdu3bVrVuXdRyocTdu&#10;3FiwYMG/9y9durRXr14SjwMAn9GgQYNatWqxTsF3AmzlgoKCLVu2lJaWBgYGurm5ubi4sE4ENSsy&#10;MnLIkCHp6en//tLChQvDw8OVlJQknwoAOG3atLG0tIyIiBgzZoyBgQHrOHwnwFYuLi6Oi4tjnQIk&#10;Z+TIkVwlW1pa2tjYcDuvXr36119/RUREhISEDB48mGlAAJmmq6t75syZzZs3L168mHUWKSDAVhZr&#10;2LAhHoUteLt27UpKSuK2u3fvvmTJEm77xIkTkZGRxcXF8+fPRysDsFW3bl3x/5vwZQK82ktDQ8PX&#10;11dRUdHOzq5Lly6s40DNWrFiRXl5+b/3Dx48uG3btkT0/PnzgIAAiecCgP85duyYqanpihUrWAeR&#10;DgJsZQUFhYULFwYGBm7evJl1FqhxOTk54u28vLyysjLxy5MnTzZp0qS4uPj169dEVFhYuGjRIldX&#10;1+3bt4sPy83NHTVqlKura2hoqPgbMzIyUlNTs7OziaikpCQ1NfWPP/5wdXW9ffu2hH4qAKG4cuXK&#10;+PHj79y5s3Dhws/+Ag2fEOwM9oABA1hHAElYunTp1KlTuW1/f3+RSDRnzhzuzIWRkdHIkSP9/Pys&#10;rKyIKDw83NfXl4gCAwOJ6JdffiksLHRwcLhx4wYRhYaGhoSE9OrVKzEx0d7e/tmzZ6ampr179373&#10;7t2+ffu497958+bZs2c7duzI5CcFkEbPnz/nfsGFShLgWJnj5eXVtm1b8RlHECovL6+KDyXYtm2b&#10;tbX1H3/8wb1cvHjx69ev/30iY9euXenp6UVFRVwlE1FeXp6fn19ZWdmLFy+ePXtGRLdv3167dq24&#10;kokoLS3N0dGxRn8cAIFp1aqVlpaWhoZGaGiovLxgG6caCfbP6MiRIwkJCUeOHGEdBGqWgoLCxo0b&#10;tbW1xXuePXvm4eExc+bMBw8eyMvLi++PrF+/fv369bnt2NjYxMREDQ2NyZMni7/x5MmTpaWlFhYW&#10;3Nj6s7iFTwCgkiwtLaOjo2NiYvr27cs6i3QQbCtztm/fzjoC1Lj+/fvv3bu3WbNm4j1lZWUbN260&#10;s7OLiooS7+zSpYupqWnFb5SXl/f29lZXV6+4U01NreKeVatWnT179uzZs3Xq1KmxnwBAsJ49e2Zg&#10;YFDxf0/4MsG2Mh4eIlP69+//8OHDgQMHVtz56tWrwYMHf3mZ7WbNmikrK//XV+Xk5MzNzR0cHBwc&#10;HMSH4fH6AJUUEhLSunXrlStXsg4iTQTbyhMmTGjYsCHrFCA5ioqKJ0+eXLJkSaNGjcQ709LSqnLd&#10;34ABAz55YOfbt29XrVr13W8IIFP+/vvvkpKSw4cPc9dqQGUItpVNTU3v3r37999/sw4CNSspKani&#10;f+XFixefPHnSwcGhkt/u5+eHVUwAalRiYiJWp6g8wbYyEWlqaq5fv37jxo2YchQwe3v7OXPm5Obm&#10;ivd07do1ODh45MiRlfn2rKysL9xDmZ2dnZeXVw0pAWSSh4eHqqoq6xRSRsitHBsbu2XLlpkzZ1b8&#10;JxsE5unTp9evX694VRcRKSkpNWnSpOpvHh4eHh0dXfX3AZBNxsbGY8aM0dDQUFQU7LMxqp2QW1ls&#10;7ty5rCNAzQoLC/uO7yoqKrp27Vq1hwEAMX9//5ycnMqfVAIht3KDBg0aN27MOgVIwsaNGydPnnz3&#10;7l3uZVFRUXx8/L8P69y5s3h7wIABBgYGly9frnjAZxdpJqLNmzdnZGRw2ytXrrx+/Xr15AYA+Cch&#10;t3LLli2HDBnCOgVIQllZmb+/v6Ojo7m5ubm5uaWl5YkTJ4hIU1OTe8omp+LJ5qysrPfv33/yPuLH&#10;jHyioKBAfPo5Pz//wIED1fwDAAhOSUmJj4+Pubn5J7/7wpcJfK5/2bJlpqamFZ/ICALzyy+/cM+1&#10;zsnJSUtLS0tLE3+pYcOG69evHzFihHhPo0aNnJ2dxU91WkUeAAAgAElEQVTZ/ES/fv1mz55NRHXr&#10;1tXR0eF2crcpDxw4cO/eveIrv0aPHl0jPwyAgGzevHn58uVEtHLlSmtra9ZxpIbAW1lVVdXNzY11&#10;CqhBW7du3bp1KxGdP39ePIPNmTFjhvhxmxwNDQ2uwr/s3ys/tmnT5unTp1UOCyBDvvwAH/gvAm9l&#10;Irp161afPn38/PxGjRrFOgvUIHt7e3t7e9YpAOB/zM3Njxw50rJly927d7POIk2EfF6ZExQUlJOT&#10;s3XrVvHVOgAAUNO8vLzu3bt3+fJlY2Nj1lmkifBbmXP79u1PbmkFAIAaUlRUlJaW1q5dO319fdZZ&#10;pIzwW7lfv364gR0AQJIWLVrUunXrixcvsg4ifYTfyt27d//pp59YpwAAkCF//fVXQUHBli1bSkpK&#10;WGeRMjIxiAwMDHz37p2enh7rIAAAMuTs2bNFRUVKSkqsg0gT4Y+ViUhTU7O8vLysrIx1EAAAmeDl&#10;5cU6grSSiVa+ePFi165dJ02aVFpayjoLAIDw2dnZde/evXbt2qyDSB+ZmMF2cnIqLi4+ePBgTk5O&#10;cHAw6zgAAALXsGFDPC7++8jEWFksNTWVdQQAAID/JBOtvHLlShUVFRUVlTlz5rDOAgAgZPv377ew&#10;sPD09GQdRFrJxAz2zJkzW7RoIRKJ+vfvzzoLAIBgFRYWbtq0KS4uTiQSsc4irWSilYmoX79+rCMA&#10;AAhcaWlpXFwcEaWkpNy/f79du3asE0kfWWllIsrJyQkKCiIiIyOj3r17s44DACBYxcXFBQUFrFNI&#10;JRlq5Tdv3owdO5aI6tSpc+nSJVNTU9aJAAAEpXbt2uvWrTt79uyCBQvMzMxYx5FKMtTKYtnZ2eLl&#10;6wEAoFqUlJSkp6d7eHjMmjWLdRYpJhPXYAMAQE17+PChkZGRnZ0dhj1VIUOtXLduXe7Sg/Xr11tZ&#10;WbGOAwAgHM+fP3dzcyOiqKgonFGuChmawW7QoMHly5ezsrKMjY3l5ORYxwEAEI779+8/evSIdQoh&#10;kKGxMhE1aNCgefPmISEhY8eOzc7OZh0HAEAg1NXVuadea2trKygosI4jxWSrlYmorKzM29t73759&#10;Q4cOZZ0FAEAgevfu3b17d2Vl5UmTJmlra7OOI8VkaAabs3nz5pSUFCKKiIhgnQUAQDguXLjAOoIQ&#10;yNxYGQAAqldiYmJgYOC7d+9YBxECmWtlHR0dZWVlIpo6dSrrLAAAUk8kEtnZ2bm6usbHx7POIgQy&#10;N4M9fPjwxMTEoKCg0aNHs84CACD1AgICkpKSWKcQDpkbKxPR0qVL4+PjExISwsPDWWcBAJBu0dHR&#10;3EZoaCjbJMIgi61MRPHx8a6urg4ODvhrBABQFatXr+7SpQsRZWRksM4iBDI3g81Zs2ZNcXExEQUE&#10;BNjZ2bGOAwAgrWrXrn3mzJlXr141b96cdRYhkNFWfvXqFesIAABSLyMjo6ioqFGjRg0bNmSdRSBk&#10;dAZbrF+/fqwjAABIpcTERDMzM0NDQ9ZBBEVGx8r79u2zt7evXbu2o6Mj6ywAAFLp8OHDz549k5eX&#10;9dFd9ZLRP80mTZpcuXIlNDQ0Nzc3KiqKdRwAAOlz7NgxIhKJRFiXohrJaCsTkZ6eXoMGDYYOHWpv&#10;b3/t2jXWcQAApMz06dPV1NREItGJEydYZxEOGZ3BFktISPjw4cNvv/3Ws2dP1lkAAKSJh4eHrq7u&#10;y5cvJ02axDqLcMh6K3OuX7/OOgIAgDTx8/Nzd3d3cnJiHURoZHcGm7N48WLWEQAApMzq1aunTZvm&#10;4uLy+vVr1lmERtZb2dXVtV+/fm3btmUdBABAOmRkZGzfvl0kEl29evXOnTus4wiNrM9g6+jonD59&#10;mnUKAACpUVxcnJyczDqFYMl6K4uFh4dHREQYGxu7u7uzzgIAIAWMjY2bNWvGOoXQyPoMNqewsHDT&#10;pk0+Pj779u1jnQUAgNd0dHT27t2roKDg5ubWsmVL1nGEBmNlIqLs7OyQkBBu48OHD/Xq1WOdCACA&#10;j3Jzc588eTJmzJh27drhipyagLHyP9y7d0+8VigAAHxi1qxZPXr0OHTokImJiaqqKus4AoRWJiJS&#10;V1e3srIiojVr1tja2rKOAwDAR3fv3g0JCfn48ePw4cMLCwtZxxEmzGATEampqV28eLGkpERFRYV1&#10;FgAAnoqPj09PT2edQuDQyv+jpKSkpKSUmZkZGxtLRNbW1qwTAQDwVLNmzRQUFFinECbMYP/DpUuX&#10;bGxs+vTpwzoIAADv9OrVy8zMTEFBYdasWcrKyqzjCBPGyv/g6+vLOgIAAE8ZGBicPHny7NmzHh4e&#10;rLMIFsbKnyESiaZNm8Y6BQAAX4wePVpOTu7EiRN6enqo5BqFVv4H7va7H3/80cfHh3UWACIiTU3N&#10;xo0bs04BMu3YsWNBQUFEdPLkSdZZhA8z2P+wbds2T0/PFi1aaGtrs84CQETUpEkTGxsb1ilApm3b&#10;ti0vL491ClmBsfI/aGlpWVtbGxoanj9/3s/Pr6ysjHUiAADGlJSUPtmAmoNW/gyRSOTg4ODt7X31&#10;6lXWWUDWvX379t69e6xTgExbt27dJxtQc9DKX4Kzy8Dc69evb9++zToFyLQff/zx9evXr1+/xhoB&#10;EoBW/jzu+prc3FzWQQAA2BCJRGvWrJk4ceLHjx91dHR0dHTk5VEZNQ5/xJ8hJyc3f/58PLkGAGTZ&#10;vn37fv311507d06dOrWoqIh1HFmBa7A/b8KECaWlpbi0AQBk1p07d7iNP/74o1evXqNGjWKbR0Zg&#10;rPyfJk2a5Orq2rdvX2dn548fP7KOAwAgUWZmZtxG+/bthw0bxjaM7MBY+UtSU1PDwsKIKCYmxtLS&#10;knUcAADJGTFiRGZm5qlTp2bPno2JQ4nBWLlSfvvtN9YRAAAkpLCwMD09XU5Obtq0aeHh4Q4ODqwT&#10;yRC08pfo6emJ53AAAGTEtGnT2rZtGxERwTqILEIrf4m2traXlxfrFAAAknP//v3g4OAPHz5gmXkm&#10;cF75K4YPH96tWzcNDQ3WQQAAJOH69etv3rwhovLyctZZZBHGyl8hLy/fvHlzXV3dwsLC+fPn+/n5&#10;4W8qAMgCHR0d1hFkEcbKleXj47N+/XoiUlVV9fDwkJOTY50IAKD6WVlZ6evrp6WlLVy4kHUWWYSx&#10;cmWJL3wYP348VgsAAKFq27bt5cuX165dO2HCBNZZZBFaubI6duzIbbi5ubVp04ZtGACA6hUVFWVg&#10;YGBgYFBSUtKyZctZs2axTiSjMINdWWvWrCktLb1z586CBQtwQz0ACMy6detSU1NZpwCMlStNQ0Pj&#10;999/v3PnTsuWLefPn487+QBASJKSkriNQ4cOsU0i49DK3ywgIGDVqlXu7u6sgwAAVD9tbW3WEWQa&#10;Wvk7paSkbNu2jXUKAIDqsXfv3pEjRwYFBfXr1491FpmGVv5murq6ampq5eXlWHAUAKRdbGysiYlJ&#10;XFxcx44d9+/fP3jwYNaJZB1a+Zs5ODiYmJiwTgEAUFUlJSXLly+PiYkZMGDA8+fPWccBIlyD/X0C&#10;AgKOHj3ao0cP1kEAAL7fvXv3Tpw4QUQvX77MyspiHQeIMFb+PoaGhrNnzzY1NR0+fHinTp1SUlJY&#10;JwIAACFAK1fJ0aNH7969y/2yCQAgXTQ1NfX09Iho4MCBrVu3Zh0HiNDK1WLHjh2sIwAAfIMPHz68&#10;fv26efPmgYGBzZs3//XXX1VUVFiHAiK0chW5uLiwjgAA8G1KSkocHR179OiRmJhoYWHx5MkTMzMz&#10;1qHgf9DKVTJlypR69eqxTgEA8A0uXboUGRn59OnTn3/+mXUW+BSuwa4SS0vL+Ph4blXHxMTEDx8+&#10;dO3alXUoAIAvCQ4OZh0B/hNauaoaNWpERMXFxXZ2drm5uZcvX27Xrh3rUAAAX6evr886AnwKM9jV&#10;QyQSJSUlvXv3bvv27ayzAAB8ybBhw1RUVJSUlObNm8c6C3wKY+VqFhUVxToCAMBnREdHh4aGuru7&#10;W1lZhYWFpaWlmZubsw4Fn8JYuXooKysvWrSIdQoQoDZt2gwbNox1ChACf3//RYsWDR06lIh69Ojh&#10;5ubGOhF8BsbK1UNOTm7ixIm3bt3S1dVlnQUERVFRETeSQtVt2rRp//79RJSXl8c6C3wJxsrVRk9P&#10;7/z58/v27UtPT3dzc0tPT2edCADgf5KTk1lHgEpBK1e/uXPnHjt2zNbWNjU1lXUWAAAiIicnJ+4e&#10;TiyfzHOYwa4p8fHxtra2Z86cMTY2Zp0FAGSdtbW1p6enSCQaNWoU6yzwJWjl6teiRQtuIyEhISYm&#10;Bq0MAKykpaU9fPiwffv2DRo02LlzJ+s48HVo5eo3d+7c9PT0Cxcu/PDDDxYWFqzjAICMyszMHDhw&#10;YHR0tIODw9mzZ1nHgUrBeeXqp6Sk5O/v//Tp07CwMFVVVW9v79LSUtahAEDmbNiwITo6mogePHjA&#10;OgtUFsbKNcvDwyMoKKi4uBjP/AIAVqysrFhHgMrCWFkSDh8+/OzZM9YpAEC2zJo1y8XFZcaMGRgV&#10;SBG0cs3S09MjopycnJKSEtZZAEAmHDp0yNra+sqVK/Xq1Tt+/PiGDRtq167NOhRUFlq5Zv36669K&#10;SkqsUwCArAgODvb09Lxy5crmzZtZZ4HvgfPKNUtfX//06dPXrl3T1tZmnQUABC4/P3/QoEHc9t9/&#10;/802DHwftHKNs7Ozs7OzI6Lc3NyxY8cqKiru2bMHE0oAUHO0tbUHDhzIOgV8D7Sy5KSnpwcGBhLR&#10;pEmTunfvzjoOAAiNqqrq0qVL09PTvby82rVrxzoOfA+0MgMbN25EKwNANcrMzCwrK9PQ0MCSstIO&#10;V3tJTv369c3MzFinAAABMjExadiwYUBAAOsgUFVoZcnR0tKaNGkS6xQAIDT+/v5YqFEw0MoSNXz4&#10;8Lt3727cuJGI7t6927Fjx9u3b7MOBQDSraSkpLy8nIjWrl3LOgtUFVpZouTk5Dp06NCkSZPnz58P&#10;GDAgLi5u0KBBt27dYp0LAKRMXl7emzdvuG0NDQ1FRUUlJSVXV1e2qaDqcLUXG9nZ2dyM06tXr6ZP&#10;nx4REcE6EQBIkyFDhjx48OD8+fNt2rQZN24cESkpKY0cOZJ1LqgqjJXZqF+/fuvWrbntTZs2sQ0D&#10;AFLn6tWrycnJ+/fv516OGzcOlSwMaGU2DAwMzp8/7+Dg4OPj0759+9jY2HPnzpWVlbHOBQDSJCgo&#10;iHUEqGZoZWaMjIzOnj27bNkykUg0f/58R0dHPLcWACrpl19+YR0BagRamb3Y2NjQ0FAi2rNnT0pK&#10;Cus4ACAFPDw8jIyMlJWVWQeBaoZW5pGHDx+OHTuWdQoAkAKtW7d+8eJFQkIC6yBQzdDK7Jmamvr4&#10;+HDbHTt2ZBsGAHhr0aJFBgYGvr6+rINADUIrs6esrLxw4cK5c+eamJjgXBEAfNa+fftWrVqVmpq6&#10;bds21lmgBuF+ZV5QVlZevXo1t/3ixYtFixZZWVm5ubmpq6uzDQYAPJGSklJaWkpEWAdW2DBW5p0p&#10;U6YcPHjQw8PD1NT0+fPnrOMAAC9YWVmpqqoaGhqePn2adRaoQRgr89fjx4+HDh0aFRXFOggAMBMY&#10;GKiiouLk5GRlZZWeni4vL6+hocE6FNQgjJV5x8fHp0ePHtw21pgCkFkikWjp0qXu7u5Dhgzhxsd1&#10;6tRBJQseWpl3unbteu3atcDAwMDAQHt7+zdv3ri4uLx8+ZJ1LgCQqLKysiVLlhQXF3/8+DEjI4N1&#10;HJAQzGDzlLOzM7fh6ekZFBT04MGDCxcuNG7cmG0qAJC8Ro0adenShXUKkBCMlaXDo0ePrK2tExMT&#10;WQcBAAlRVFQ8f/78xIkTL1269OOPP7KOAxKCVua7Vq1acRtPnz6Njo5mGwYAatS6detatWo1aNCg&#10;9+/fE5Gdnd327dvF68uBLMAMNt9NmzYtLS3tzJkzRkZGvXr1Yh0HAGrK+/fvt2/f/vz588ePH4tE&#10;ouDgYNaJgAGMlflOQUFhw4YNjx8/DgsLa9SoERHNnDlz8+bNIpGIdTQAqE5FRUXi6zofP37MNgyw&#10;glaWMhEREf7+/tOnTz916hTrLABQnfT19WfOnElETZo0OXnyJOs4wAZaWcqEhoYWFRUR0Zw5c54+&#10;fco6DgBU1cOHD0+cOJGVlUVE8+fPT05OvnXrlviCEpA1aGUpo6urKy8vT0SJiYkhISGs4wBAlTx6&#10;9Mje3t7Z2fnGjRtEVLduXUNDwwYNGrDOBcyglaXMpEmTvLy8FBQUtLW1bW1tWccBgO/34sULJycn&#10;7lzyunXrWMcBXsA12NLnt99+a9WqVVFRUdu2bVlngZoiEonCwsJYp4CalZGR8ezZM9YpgF/QylKJ&#10;ez52TEyMvb19eXm5jo7OyZMnmzdvzjoXVJvy8vLQ0FAiWrFiBessUFO0tLSMjY01NDTGjRs3atQo&#10;1nGAF9DKUiwgIODt27dE9P79+ytXrqCVBUlNTY11BKhOHz9+nDdv3s2bN/39/bt06XL58uVatWpx&#10;Nz0CEM4rS7WRI0c2atRIV1e3Y8eONjY2rONAddq/fz/rCFAjlixZsmXLlujoaO5EsrGxMSoZKsJY&#10;WYp17NgxNTW14p5Vq1ZpaGhMnjyZVSSoLrGxsawjQI3Af1n4MoyVhWPTpk0LFizw9vZu0KBBTEwM&#10;6zhQJd26dWMdAWqEhYUFEXXo0MHf3591FuAjtLJwlJSUiESi8vLy9+/f29nZ5ebmsk4E38/NzY11&#10;BKgeHz58GDp0aNu2bR8+fEhE8+bN4xZmxU3J8FloZeFwdnbu1KmTiooKEfXp04fbAACGcnNzPT09&#10;//zzz4SEBAcHh/T09Fq1arVp00ZHR4d1NOApnFcWjqZNm8bExAQGBqalpZmZmSkpKRHR3r17jYyM&#10;rK2tWacDkEXHjx8PCgritl+8eJGfn882D/AfWlloXFxcxNvLly/38fEhoosXL+IibQDJa9u2bf36&#10;9bnFkjt06FC3bl3WiYDv0MpCduLECW5j8ODBd+/e/eGHH9jmgcpbtmwZ6wjw/a5fv56fn29nZ2dm&#10;ZhYYGLhx40YicnR0rF+/PutowHdoZSHT09PjbsP46aefdHV1WceBb5CZmck6AnynQ4cOeXl5ffz4&#10;ce/evcOHD7eysrKysmIdCqQGrvYSsj179lhYWKipqc2aNat27dqs4wDIhBkzZuTk5JSUlLx48YJ1&#10;FpA+GCsLma6ubkREhPhlZmbmzp07iahly5aDBw9mlwtA+GrXrm1pack6BUgfjJVlyMSJE+fPnz9/&#10;/vxhw4ZFRkayjgNfsnz5ctYRoLIeP37cunXrjh07cgtAHTx48Oeffz5x4sRPP/3EOhpIH4yVZYi2&#10;tja3oaamhruZeU5dXZ11BKiUFy9e2NnZcZPV/fv3f/Dgga2tLdY+h++GVpYha9eu7dGjBxEZGhp2&#10;6tSJiAoKCsrKyjQ0NFhHA5BWmzZtEp8/fvnyJdMsIARoZRmioaExbNgw8cuioiIHB4fMzMzz58/r&#10;6+szDAYgvRwcHPz8/MTbbMOAAKCVZZe3t/dff/1FRLa2tmfOnDE2NmadCEA63L59Oy4uztnZuW7d&#10;un379j1z5szJkyeJaNSoUayjgdRDK8uu4uJibiMhIcHFxeXOnTts8wBIhcjIyIEDB759+3bt2rW/&#10;//67lZWVo6Ojo6Mj61wgEGhl2eXh4XHlyhVuu+JzOgHgvzx69MjV1fXt27dE9OTJE6zMBtUOrSy7&#10;LCwsPnnKQWRk5PHjx4lo0KBB3HVhAFBRZmZmamoqtz1nzpw2bdqwzQPCg1aG/2NjY1NQUEBEW7Zs&#10;KSsrYx0HgBdOnDiRmprapUsXc3NzCwuLvXv3xsbGduvW7eeff2YdDQQIrQz/p3Xr1tzZ5datW3N7&#10;cnNzIyIi7OzsmOYCYOb169eLFy+Oj4+vV6/e6dOnu3fvPmbMmDFjxrDOBYKFZ3vB/wkODg4LCwsL&#10;Czt37hwR5ebmTpkyxcnJaf369aWlpazTATAQGRkZHx9PRB8+fNixYwfrOCB8GCvD/zEwMDAwMBC/&#10;DA8P379/PxHNnj1bSUlpypQp8vL4NQ6E7969e9u2bXNxcbGxsenYsWPz5s0TExMVFRWHDBnCOhoI&#10;H1oZKmXatGlmZmbm5uasgwDUrNjY2L59+757927Xrl0XL17s3bv3zJkznz9/bm1t3adPH9bpQPjQ&#10;yvCfbG1tFyxY8OTJEyLq3Llz586diSg+Pr5fv36NGzc+fPgwnggGwsNVMhGVl5efO3eud+/eEyZM&#10;YB0KZAhaGf6TiorKJysX3b9/38HB4dWrVy9evBgxYoT4dmcAwdDU1ORaWU5OruIJHQDJwGlC+Aar&#10;V69+9eoVt52UlMQ2DEDV5efnZ2ZmTpgwYcmSJdzT7s6dO9eqVSstLa369etPmzaNdUCQORgrwzew&#10;t7c/fPiweJttGIAqSktLs7e3v3fvHveyXbt2zs7OLVq0ePjwIdtgIMvQyvAN3N3d5eXlw8LCiMjT&#10;05OIHj58eOvWLSLq1q1bixYtGOcD+Jrs7Ozg4OAff/zRxMQkPT1dXMk6OjpGRkZsswEQWhm+iZyc&#10;3LBhwyouB2lnZ5ecnExEzZo1S0xMZBcN4OsyMzM9PDxOnjypo6MTHBzcvn37GzduzJ8/n4gWL15s&#10;amrKOiAAWhmqJi8v75MNAN6aMGECt+TimzdvNmzYcPz4cUtLS249UwCeQCtDlVy8ePHy5ctEZGtr&#10;yzoLwFfExcWxjgDwFbgGG6qkc+fOs2fPnj17docOHbg9fn5+ysrKysrK3bt3f//+Pdt4IOO0tbWV&#10;lZXnzJnDvQwMDDQ0NOS2N2zYwC4XwH/CWBmq2bFjx0pKSogoIiIiJSVFXV396tWrjRs3xpp3IGFb&#10;tmzJysoqLy/fvHlzmzZtRo8e3b59+5s3b+bn5xNRo0aNWAcE+Ay0MlQzb29v7iEMXbt2bdq06YoV&#10;K5YvX964cWNnZ2dfX181NTXWAUFWiESif2/jwSDAc5jBhmrm6ur6+PHjx48fHzx4UFNTk7v1Mzk5&#10;edOmTVOnTmWdDgSrrKysoKBg8uTJe/bs4Tp42rRpderUUVRU9Pb2xtqLIC0wVoaa9dNPPwUFBXHb&#10;SkpKbMOAUD179sze3l58b16bNm26detGRJmZmUxzAXwzjJWhZk2cODE5OdnV1XXw4MHcU/4TExPb&#10;t2/fuHHjli1b4iFKUC0SEhLElWxgYKClpcU2D8B3w1gZapaCgoKhoeGxY8fEe06dOnX//n1u++jR&#10;o0uXLmUUDaRYRkZGSkrKrl27Hjx4cOjQIQsLi6NHj65evZqIdu7c2bJlS9YBAb4TxsogaXZ2dkZG&#10;Rpqamjo6OgMHDuR2vn79euzYsbm5uWyzgbRwcXHp1KnTtm3b/vrrr3Xr1mlra7u5ucXGxsbGxnbt&#10;2pV1OoDvh7EySNqPP/744sWLintSUlLs7e0fPHhw//79c+fONWjQgFE04Kni4mJuHOzh4cHd0cQ9&#10;fZ3Tt29fZskAqhtaGdhLSUl58OABEd2+fdvJyenEiRP6+vpEFBwcrKSk5OjoyDogMBYREbF48WIi&#10;OnHiRHBwcJMmTVJSUlavXp2enj548GAsXwZCghlsYE9DQ0NbW5vbfvLkycuXL4lo5cqVQ4cOdXV1&#10;3bJlC9N0wMC1a9e6du06Z86coqIiIgoICOD2x8XFRUVFEZGWltbatWsPHjw4aNAglkEBqhvGysBe&#10;u3btQkJCUlJSiEhHR8fCwmLfvn0LFizgvrpw4UJvb29uOysrS1FRUV1dnVlWqHk3btwYOnRoenp6&#10;dHS0hoaGj4/PqFGj9u7dS0SmpqbcLU8AQoVWBl7o1q1bxX9tY2Nj/31McnKynZ1dgwYNLl68qKys&#10;LMF0IFGenp7p6encNvc3wdzcnDuvPHLkSD09PZbhAGoYZrCBj9avXy8u6XXr1nEb7u7uDx8+vHbt&#10;Wt++ffF0CGEoKioaNGhQ7dq1a9euPXv2bG6nhYWF+ABuW1lZee7cuXPnzkUlg+BhrAx8pKysHBIS&#10;8ubNG6qwigC36AURXb16dcqUKYcOHSKiS5cuEZGamhomNqVCfn5+ZGSkkZFR8+bNiejjx4/BwcHc&#10;l7g1JMaMGbNlyxZ1dfWEhAQiGjlyJMu4ABKHVgae0tbWFl8CxpkyZYp4aUhnZ2ci2r179/jx40Ui&#10;kYaGxrFjx+zs7IioqKgoPT29SZMmEo8MX1FQUDBr1qwdO3Y0bdr03LlzLVq0+OSA0tJSIlJXV8cl&#10;fiCzMIMNUsPd3f3p/zd48GAiSkhI4NYhyM3N5S4WE4lEixcvbt269fnz5xnHhX+ZMmXKjh07iOjZ&#10;s2fc1XyqqqoODg7cV3V1dT09PVnmA+ABjJVBim3cuJGIRCKR+B/0wMDANWvWEJGDg0NwcPCAAQMY&#10;R5Rt/v7+JSUlTk5OzZo1I6Lr169/ckCtWrXOnj27YMGCgoKC0aNHM4gIwDNoZZBuXDF/1vDhw6Oi&#10;ooyNjSdPnnzlyhUimjhxopubGya3a0hcXNzLly/79u1bq1atDx8+dO7cOTk5uby8fMeOHWfPnm3a&#10;tKm/v//w4cPfvn1LRIsWLRJ/44oVK9ilBuAXtDIIipWVVf/+/Z8/f05EXbt2bdy48fv377lbXYno&#10;119/PXjwYHx8fHZ2dnJyMhE1bNhQR0eHZWKhuHnzpqura1paWvfu3Xfu3NmwYUPxc1WTkpIiIiKa&#10;Nm3ap0+fCxcucNfP//ukMgAQWhkEpmHDhqdOnaq4R05Orl+/fmFhYdxTorgHh3l4eAQGBhJRp06d&#10;xo8fP378eHl5eSIKCws7duzYhAkTunTpwiK+1MjLy+M2atWqpaSkFBcXx1UyEd24cSM7O/uHH37Y&#10;vXs3d4y6urqbmxu33bFjRyaBAaQFWhkETk1N7fTp01FRUadPnyai/v37E9Hff//NfTU2NvaXX37p&#10;0qWLiYlJeHi4o6NjaWlpcHBwaGioqakpy9x8lQE16HcAAAa3SURBVJ+fv2XLliVLlnA3qm3evNnb&#10;2zs5OZmrZCLy9vbW19dXUVEZN24c06QAUgmtDDLBzMzMzMxM/PKPP/5Yv359aGgoETVp0qRevXpv&#10;3rxxcnLi7szJyMiIjIzkWvnKlSvcbdODBw+uVasWo/jMvHr16vr160eOHImKijp06JCNjU1eXp74&#10;Yajq6urcRLStre3ixYufPHliY2MzevRobuIBAL4DWhlkkbW1tbm5+f3794mofv36P/zww/v37+vW&#10;rVtQUEBEKioqurq6RHTt2rVBgwbl5OQQ0bx581auXFlSUuLr63vx4kUi8vDwcHR05I6sOdyUuwQU&#10;FxfHxsbOmjWL+9Vk5syZLi4u7u7u165d4w74448/bGxstLS0FixYwD28pVGjRtx6TbVq1VqyZIlk&#10;cgIIG1oZZJSampq5ubn4Zf369c+dO+fg4FBaWmpsbOzq6kpE+fn5hYWF3AEZGRlE9OHDB19fX27P&#10;33//3blz5zt37hBRVlZWcXEx9z5fGClW8jAiOnDgALexadOmarlliLvymYg0NDRUVVWLiop8fX2T&#10;kpKIaOPGjbq6uu/evRP/gSgoKHC/i+Tl5SkrKxcXF6upqXExlJSUli9fvnz58qpHAoB/QysD/E+H&#10;Dh1SU1Mr7rG3t9+7dy83Wp02bRoRqamp9erV6+rVq9wBMTExIpHo8ePHDg4O3IXfu3fvFp9P9fX1&#10;LSwsrFOnzpw5c4joyZMn9vb2XBFOmTJlxowZX7hHKyYm5quBP3z4sH79eiJq1arViBEjuJ2rV6/O&#10;zc1VU1ObP3+++Mjz5887OTmVl5cT0fbt2ydOnHjmzBnx/UiKiooHDhzQ1NTs0aMHd0vxDz/8MHbs&#10;WCK6c+dOQEBAcnKypaWllZXVVyMBQFWNGzdOBACVVlRUdPHixXHjxo0bN+7MmTMikSgkJET8P9SQ&#10;IUO4w3x9feXk5IhITk7Oz89PJBKdO3eu4v965ubmIpFo5cqV6v/fsGHDSktLRSLRhQsXevfuzR3W&#10;vn17kUjEXZWmrq6up6d39+5d7iNcXFy4YxQVFcPDw0Ui0fr168Ufqq6uHhYWxh05c+ZM8edu375d&#10;JBLdvn1bfEuYv7+/+EfLzc3Nzc3Nz8+X3B8oAPx/48aNw1gZ4NsoKyvb2NjY2NiI9/Ts2XPixImP&#10;Hz8mIh8fH26nvr6+goJCaWmpsrIyd+65e/fuXl5ep06d4kbkjRs3JqLi4mLxXUZRUVFlZWW3bt1y&#10;cXHJzc2t+KFnzpzZvn07EeXl5dnZ2SUlJamqqnLvQER16tTR1NQkIj09PSUlpeLiYpFIlJeXd+TI&#10;kT59+ojfZPTo0dOnT9fX1yciExOTiIiI/Px8Imrbtq34R8MSmQBsoZUBqkpTU5OrzIrGjBmjo6NT&#10;WlqqoqJia2tLRBoaGv7+/hMmTOAer2FpaUlEQ4cOLS0tDQgIGD16tLu7u7KycrNmzXr27Hn9+nXu&#10;zC6nbt264uluJycnrjt9fX25WWUdHZ3OnTsT0bBhw7S1tdesWcNNp4sfKz1mzJiePXv27t1bXV1d&#10;/J5NmzatmT8PAPh+cuPGjRPf7A8APDFlypStW7cS0eLFi3F5M4CM8PDwwG2FAHy0adMmbgPXWAHI&#10;FLQyAB9xF20BgKxBKwMAAPAFWhkAAIAv0MoAAAB8gVYGAADgC7QyAAAAX6CVAQAA+AKtDAAAwBdo&#10;ZQAAAL5AKwMAAPAFWhkAAIAv0MoAAAB8gVYGAADgC7QyAAAAX6CVAQAA+AKtDMBrx48fZx0BACQH&#10;rQzAaxEREawjAIDkoJUBAAD4Aq0MAADAF2hlAD76+PEj6wgAwABaGYCP5s2bxzoCADCAVgbgI1NT&#10;U9YRAIABtDIAH40YMcLY2JiIZs6cyToLAEiOIusAAPAZ8vLyoaGhcXFxVlZWrLMAgOSglQF4qkWL&#10;Fi1atGCdAgAkCjPYAAAAfIFWBgAA4Au0MgAAAF+glQEAAPgCrQwAAMAXaGUAAAC+QCsDAADwBVoZ&#10;AACAL9DKAAAAfIFWBgAA4Au0MgAAAF+glQEAAPgCrQwAAMAXaGUAAAC+QCsDAADwBVoZAACAL9DK&#10;AAAAfIFWBgAA4Au0MgAAAF+glQEAAPgCrQwAAMAXaGUAAAC+QCsDAADwBVoZAACAL9DKAAAAfIFW&#10;BgAA4Au0MgAAAF+glQEAAPgCrQwAAMAXaGUAAAC+QCsDAADwBVoZAACAL9DKAAAAfIFWBgAA4Au0&#10;MgAAAF+glQEAAPgCrQwAAMAXaGUAAAC+QCsDAADwhdy4ceNYZwAAAAAiov8HzXfDhDCbMQUAAAAA&#10;SUVORK5CYII=&#10;"
       id="image1"
       x="413.72711"
       y="51.274242"
       inkscape:export-filename="01-earth-sun-trig.png"
       inkscape:export-xdpi="96"
       inkscape:export-ydpi="96" /></g><g
     inkscape:groupmode="layer"
     inkscape:label="Chart-Layer: apples:3,bananas:5,oranges:10,pears:4"
     id="g152"
     transform="translate(-295.75)" /></svg>
