{
  "images" : [
    {
      "idiom" : "universal",
      "filename" : "3c7118a4398e3f250d4bd5e3505a12fe.jpg",
      "scale" : "1x"
    },
    {
      "idiom" : "universal",
      "scale" : "2x"
    },
    {
      "idiom" : "universal",
      "scale" : "3x"
    }
  ],
  "info" : {
    "version" : 1,
    "author" : "xcode"
  }
}