Merge branch 'master' of gitlab.com:procps-ng/procps

2 jobs for master in 3 minutes and 8 seconds (queued for 2 seconds)
Status Job ID Name Coverage
  Test
failed #18688612
MakeCheck

00:03:08

failed #18682391
MakeCheck

00:02:33

 
Name Stage Failure
failed
MakeCheck Test There is an unknown failure, please try again
Makefile:576: recipe for target 'check-am' failed
make[2]: *** [check-am] Error 2
make[2]: Leaving directory '/builds/wporter82/procps/testsuite'
make[1]: *** [check-recursive] Error 1
Makefile:1815: recipe for target 'check-recursive' failed
make[1]: Leaving directory '/builds/wporter82/procps'
Makefile:2271: recipe for target 'check' failed
make: *** [check] Error 2
ERROR: Job failed: exit code 1