Removed cygwin specific site and build file

1 job for master in 2 minutes and 9 seconds (queued for 60 minutes and 43 seconds)
Status Job ID Name Coverage
  Test
failed #4303288
MakeCheck

00:02:09

 
Name Stage Failure
failed
MakeCheck Test There is an unknown failure, please try again
Makefile:576: recipe for target 'check-am' failed
make[2]: Leaving directory '/builds/wporter82/procps/testsuite'
make[2]: *** [check-am] Error 2
make[1]: *** [check-recursive] Error 1
Makefile:1810: recipe for target 'check-recursive' failed
make[1]: Leaving directory '/builds/wporter82/procps'
Makefile:2266: recipe for target 'check' failed
make: *** [check] Error 2
ERROR: Build failed: exit code 1