Division,WeightClassKg,Place,Name,Team,BodyweightKg,Best3SquatKg,Best3BenchKg,Best3DeadliftKg,TotalKg,Equipment,Event,Sex
Boys,51.71,1,Jacory Bellnamy,Houston Madison,51.26,147.42,70.31,158.76,376.48,Single-ply,SBD,M
Boys,51.71,2,Nathan Acosta,Pearland Dawson,51.44,113.4,52.16,113.4,278.96,Single-ply,SBD,M
Boys,51.71,3,Luke Longoria,Bay City,46.45,79.38,36.29,70.31,185.97,Single-ply,SBD,M
Boys,51.71,DQ,Christian Cordova #2,Channelview,51.71,,,,,Single-ply,SBD,M
Boys,51.71,DQ,Latodrick Lute,Port Arthur Memorial,51.71,,,,,Single-ply,SBD,M
Boys,51.71,DQ,David Owens,La Marque,51.71,120.2,56.7,,,Single-ply,SBD,M
Boys,55.79,1,Romello Hoyle,Houston Madison,55.7,147.42,90.72,149.69,387.82,Single-ply,SBD,M
Boys,55.79,2,Jaycob Warchesik,Manvel,54.88,136.08,83.91,158.76,378.75,Single-ply,SBD,M
Boys,55.79,3,Angel Medrano,Manvel,55.25,127.01,86.18,142.88,356.07,Single-ply,SBD,M
Boys,55.79,4,Javier Chavarria,Conroe Oak Ridge,54.61,106.59,88.45,113.4,308.44,Single-ply,SBD,M
Boys,55.79,5,Marcus Mayorga,Pearland,54.98,122.47,74.84,108.86,306.17,Single-ply,SBD,M
Boys,55.79,6,Wyatt Dudley,Santa Fe,51.98,124.74,45.36,124.74,294.84,Single-ply,SBD,M
Boys,55.79,7,Timothy Wilson,Conroe Caney Creek,52.98,102.06,61.23,129.27,292.57,Single-ply,SBD,M
Boys,55.79,8,Gage Franklin,Friendswood Clear Brook,52.34,81.65,43.09,79.38,204.12,Single-ply,SBD,M
Boys,55.79,DQ,Stephan Hayes,Houston Madison,53.07,99.79,,,,Single-ply,SBD,M
Boys,55.79,DQ,Je'Kalon Williams,Channelview,55.79,,,,,Single-ply,SBD,M
Boys,55.79,DQ,Jordan Trevino,Bay City,55.79,,,,,Single-ply,SBD,M
Boys,55.79,DQ,Blake Gamez,La Porte,55.79,,,,,Single-ply,SBD,M
Boys,59.87,1,Chien Phan,Dickinson,59.87,195.04,95.25,208.65,498.95,Single-ply,SBD,M
Boys,59.87,2,Kaleb Wolfe,Bay City,59.87,165.56,81.65,167.83,415.04,Single-ply,SBD,M
Boys,59.87,3,Tommy Phan,Dickinson,59.15,142.88,90.72,154.22,387.82,Single-ply,SBD,M
Boys,59.87,4,Jessie Yanez,Channelview,59.33,129.27,74.84,145.15,349.27,Single-ply,SBD,M
Boys,59.87,5,Zane Havel,Bay City,55.88,136.08,65.77,138.35,340.19,Single-ply,SBD,M
Boys,59.87,6,Orlando Moreno,Bay City,59.78,136.08,68.04,131.54,335.66,Single-ply,SBD,M
Boys,59.87,7,Colby Vauter,Dayton,57.88,92.99,58.97,117.93,269.89,Single-ply,SBD,M
Boys,59.87,DQ,Taylor Kemp #2,La Marque,59.6,104.33,63.5,,,Single-ply,SBD,M
Boys,59.87,DQ,Tommy Nguyen,Galveston Ball,59.87,,,,,Single-ply,SBD,M
Boys,67.13,1,Jim Tran,Dickinson,66.22,208.65,120.2,208.65,537.51,Single-ply,SBD,M
Boys,67.13,2,Garet Stuckey,Conroe Caney Creek,67.13,190.51,115.67,192.78,498.95,Single-ply,SBD,M
Boys,67.13,3,Gin Ivey,Conroe Oak Ridge,64.77,165.56,106.59,185.97,458.13,Single-ply,SBD,M
Boys,67.13,4,Tyvarian Lane,Stafford,62.41,163.29,108.86,172.37,444.52,Single-ply,SBD,M
Boys,67.13,5,Keith Chesson,Manvel,65.32,158.76,97.52,161.03,417.3,Single-ply,SBD,M
Boys,67.13,6,Jonathan Pesina,Bay City,65.14,161.03,88.45,158.76,408.23,Single-ply,SBD,M
Boys,67.13,7,Victor Torres,Galveston Ball,60.69,136.08,79.38,151.95,367.41,Single-ply,SBD,M
Boys,67.13,8,Adrian Williams,Port Arthur Memorial,65.59,131.54,81.65,142.88,356.07,Single-ply,SBD,M
Boys,67.13,9,Zach Pike,Dayton,64.5,133.81,68.04,142.88,344.73,Single-ply,SBD,M
Boys,67.13,10,Andrew Fernandez,Pasadena Memorial,64.95,122.47,77.11,136.08,335.66,Single-ply,SBD,M
Boys,67.13,11,Domink Mayberry,Galveston Ball,65.86,111.13,77.11,145.15,333.39,Single-ply,SBD,M
Boys,67.13,DQ,Pablo Cavazos,Dickinson,61.33,167.83,,,,Single-ply,SBD,M
Boys,67.13,DQ,Russell Pickney,La Marque,63.32,,,,,Single-ply,SBD,M
Boys,67.13,DQ,Jose Escolero,Katy Taylor,67.13,,,,,Single-ply,SBD,M
Boys,67.13,DQ,Trevin Chandler,Pearland,67.13,,,,,Single-ply,SBD,M
Boys,67.13,DQ,Michael Grossmen,Santa Fe,67.13,,,,,Single-ply,SBD,M
Boys,74.84,1,Jimmie Moore,Conroe Oak Ridge,74.84,208.65,115.67,208.65,532.97,Single-ply,SBD,M
Boys,74.84,2,Dawson Nobriga,Channelview,73.39,183.7,127.01,188.24,498.95,Single-ply,SBD,M
Boys,74.84,3,Luis Garza,La Porte,73.57,199.58,83.91,213.19,496.68,Single-ply,SBD,M
Boys,74.84,4,Alex Palacios,Conroe Caney Creek,74.84,174.63,113.4,206.38,494.42,Single-ply,SBD,M
Boys,74.84,5,Tuciano Pope,Channelview,68.04,183.7,113.4,192.78,489.88,Single-ply,SBD,M
Boys,74.84,6,Randy Cornejo,Conroe Caney Creek,69.85,174.63,102.06,210.92,487.61,Single-ply,SBD,M
Boys,74.84,7,Thomas Bauer,Katy Taylor,71.12,183.7,95.25,197.31,476.27,Single-ply,SBD,M
Boys,74.84,8,Dalton Reichardt,Friendswood Clear Brook,74.3,172.37,99.79,192.78,464.93,Single-ply,SBD,M
Boys,74.84,9,Yuki Namae,Manvel,74.48,163.29,113.4,172.37,449.06,Single-ply,SBD,M
Boys,74.84,10,Jose Estupinan,Beaumont Ozen,67.86,174.63,88.45,181.44,444.52,Single-ply,SBD,M
Boys,74.84,11,Jeffrey Sanders,Pearland,71.85,156.49,102.06,163.29,421.84,Single-ply,SBD,M
Boys,74.84,12,Zach Brooks,Stafford,70.94,113.4,95.25,185.97,394.63,Single-ply,SBD,M
Boys,74.84,13,Ryan Halderman,Manvel,74.39,133.81,90.72,158.76,383.29,Single-ply,SBD,M
Boys,74.84,14,Chris Lavende,Friendswood Clear Brook,72.85,86.18,72.57,104.33,263.08,Single-ply,SBD,M
Boys,74.84,DQ,Cristian Ramirez #4,Channelview,74.84,,,,,Single-ply,SBD,M
Boys,74.84,DQ,Shawn Anderson,Pearland,74.84,,,,,Single-ply,SBD,M
Boys,74.84,DQ,TJ Walker,La Marque,74.84,,,,,Single-ply,SBD,M
Boys,74.84,DQ,Keandre Owens,La Marque,69.49,131.54,,,,Single-ply,SBD,M
Boys,74.84,DQ,Avery Srebalus,East Bernard,74.66,,,,,Single-ply,SBD,M
Boys,74.84,DQ,Lawrence Smith,Bay City,74.84,,,,,Single-ply,SBD,M
Boys,74.84,DQ,JJ Ramos,Bay City,74.84,,,,,Single-ply,SBD,M
Boys,74.84,DQ,Alfredo Arenas,Manvel,73.03,181.44,88.45,,,Single-ply,SBD,M
Boys,82.1,1,Cournelious Vaughans,Dickinson,81.47,258.55,165.56,231.33,655.44,Single-ply,SBD,M
Boys,82.1,2,Raymond Castillo,Manvel,81.65,235.87,154.22,219.99,610.08,Single-ply,SBD,M
Boys,82.1,3,Kris Narcisse,Beaumont Ozen,80.83,231.33,149.69,199.58,580.6,Single-ply,SBD,M
Boys,82.1,4,Sterling Winzor,Beaumont Ozen,82.1,195.04,127.01,222.26,544.31,Single-ply,SBD,M
Boys,82.1,5,Demontre Tuggle,Channelview,76.29,204.12,111.13,210.92,526.17,Single-ply,SBD,M
Boys,82.1,6,Richard Kiffer,La Porte,80.47,181.44,129.27,208.65,519.36,Single-ply,SBD,M
Boys,82.1,7,Sam Smith #4,Manvel,80.1,174.63,115.67,215.46,505.76,Single-ply,SBD,M
Boys,82.1,8,Brett Patton,Conroe Caney Creek,82.01,192.78,117.93,174.63,485.34,Single-ply,SBD,M
Boys,82.1,9,Davian Smith,Beaumont Central,75.02,165.56,129.27,183.7,478.54,Single-ply,SBD,M
Boys,82.1,10,Cameron Simms,Houston Madison,82.1,183.7,124.74,170.1,478.54,Single-ply,SBD,M
Boys,82.1,11,Cedric Lee,Port Arthur Memorial,80.65,174.63,104.33,181.44,460.4,Single-ply,SBD,M
Boys,82.1,12,Eric Singleton,Pearland,76.93,167.83,83.91,174.63,426.38,Single-ply,SBD,M
Boys,82.1,13,Jamal Franklin,Houston Madison,82.1,142.88,102.06,181.44,426.38,Single-ply,SBD,M
Boys,82.1,14,John Michael Wilson,Santa Fe,81.83,151.95,115.67,142.88,410.5,Single-ply,SBD,M
Boys,82.1,15,Seth Nance,Galveston Ball,80.2,149.69,102.06,151.95,403.7,Single-ply,SBD,M
Boys,82.1,16,Tristan McCollum,Galveston Ball,75.39,163.29,83.91,154.22,401.43,Single-ply,SBD,M
Boys,82.1,17,Lorenzo Munoz-Nieves,Pearland Dawson,77.56,174.63,102.06,124.74,401.43,Single-ply,SBD,M
Boys,82.1,18,Tomas Garcia,Houston Milby,80.92,113.4,72.57,138.35,324.32,Single-ply,SBD,M
Boys,82.1,19,Josh Green,Friendswood Clear Brook,75.3,104.33,68.04,122.47,294.84,Single-ply,SBD,M
Boys,82.1,DQ,Bennet Ruby,Friendswood Clear Brook,77.75,167.83,,,,Single-ply,SBD,M
Boys,82.1,DQ,Will Anderson,East Bernard,78.02,161.03,,,,Single-ply,SBD,M
Boys,82.1,DQ,Blake Jackson,Conroe Oak Ridge,82.1,170.1,,,,Single-ply,SBD,M
Boys,82.1,DQ,Diego Vela,Dickinson,82.1,,,,,Single-ply,SBD,M
Boys,82.1,DQ,Zyon McCollum,Galveston Ball,82.1,,,,,Single-ply,SBD,M
Boys,82.1,DQ,Alvin Robinson,Houston Madison,82.1,,,,,Single-ply,SBD,M
Boys,82.1,DQ,Malik Holmes,La Marque,82.1,,,,,Single-ply,SBD,M
Boys,82.1,DQ,Jaylin Walker,La Marque,82.1,,,,,Single-ply,SBD,M
Boys,82.1,DQ,Marcus Mathews,La Marque,82.1,,,,,Single-ply,SBD,M
Boys,82.1,DQ,Josh Troupe,La Porte,82.1,,,,,Single-ply,SBD,M
Boys,82.1,DQ,Noah Abbott,Santa Fe,82.1,,,,,Single-ply,SBD,M
Boys,82.1,DQ,Reggie Allison,Beaumont Central,78.11,183.7,,,,Single-ply,SBD,M
Boys,89.81,1,Dylan Bates,Conroe Oak Ridge,87.54,240.4,154.22,240.4,635.03,Single-ply,SBD,M
Boys,89.81,2,Charles Hester,Stafford,89.18,204.12,147.42,229.06,580.6,Single-ply,SBD,M
Boys,89.81,3,Jorge Carli,Bay City,83.73,229.06,122.47,204.12,555.65,Single-ply,SBD,M
Boys,89.81,4,Stephen Rowe,Friendswood Clear Brook,87.72,204.12,111.13,226.8,542.04,Single-ply,SBD,M
Boys,89.81,5,Antonio Ruff,Bay City,85.18,188.24,156.49,185.97,530.7,Single-ply,SBD,M
Boys,89.81,6,Cristian Reza,Beaumont Ozen,87.82,183.7,115.67,195.04,494.42,Single-ply,SBD,M
Boys,89.81,7,Isaac Guinn,Friendswood Clear Brook,85.46,195.04,102.06,170.1,467.2,Single-ply,SBD,M
Boys,89.81,8,Octavio Galicia,Dickinson,85,163.29,102.06,192.78,458.13,Single-ply,SBD,M
Boys,89.81,9,Locke Rowley,East Bernard,84.46,163.29,102.06,172.37,437.72,Single-ply,SBD,M
Boys,89.81,10,David Alsip,Conroe Caney Creek,89.27,165.56,86.18,172.37,424.11,Single-ply,SBD,M
Boys,89.81,11,Ethan George,Stafford,89.27,161.03,92.99,158.76,412.77,Single-ply,SBD,M
Boys,89.81,12,Gejuan Morris,Houston Madison,84.73,142.88,70.31,183.7,396.89,Single-ply,SBD,M
Boys,89.81,13,Darian Jackson,Houston Madison,88.18,145.15,92.99,158.76,396.89,Single-ply,SBD,M
Boys,89.81,14,Calan Taylor,Houston Milby,89.81,142.88,83.91,165.56,392.36,Single-ply,SBD,M
Boys,89.81,15,Tevor Hughes,Manvel,85.09,145.15,79.38,147.42,371.95,Single-ply,SBD,M
Boys,89.81,16,Gage Slaughter,Santa Fe,87.54,145.15,79.38,147.42,371.95,Single-ply,SBD,M
Boys,89.81,17,Jake Allison #2,Friendswood Clear Brook,86.36,136.08,77.11,140.61,353.8,Single-ply,SBD,M
Boys,89.81,18,Michael McVay,Santa Fe,83.91,124.74,79.38,142.88,347,Single-ply,SBD,M
Boys,89.81,19,Marcus Fowler,Bay City,87.63,142.88,79.38,113.4,335.66,Single-ply,SBD,M
Boys,89.81,20,Eduardo Maury,Beaumont Ozen,84.82,88.45,65.77,140.61,294.84,Single-ply,SBD,M
Boys,89.81,21,Dalton Hill,Manvel,83.28,111.13,45.36,131.54,288.03,Single-ply,SBD,M
Boys,89.81,22,DeAndre Kindred,Conroe Oak Ridge,82.83,113.4,56.7,97.52,267.62,Single-ply,SBD,M
Boys,89.81,DQ,Grant Stuard,Conroe Oak Ridge,86.27,219.99,,,,Single-ply,SBD,M
Boys,89.81,DQ,Anthony Garzoria,Channelview,89.81,,,,,Single-ply,SBD,M
Boys,89.81,DQ,Steven Solis,Bay City,89.81,,,,,Single-ply,SBD,M
Boys,89.81,DQ,Reese Thompson,La Porte,89.81,,,,,Single-ply,SBD,M
Boys,89.81,DQ,Kenneth Savanah,Stafford,89.81,,,,,Single-ply,SBD,M
Boys,99.79,1,Richy Ortiz,Bay City,99.79,260.82,176.9,272.16,709.87,Single-ply,SBD,M
Boys,99.79,2,Joe Thomas,Beaumont Ozen,98.43,272.16,129.27,272.16,673.58,Single-ply,SBD,M
Boys,99.79,3,Tristan Anderson,Dickinson,98.07,229.06,124.74,260.82,614.62,Single-ply,SBD,M
Boys,99.79,4,Gavin Franklin,Conroe Oak Ridge,97.79,222.26,147.42,238.14,607.81,Single-ply,SBD,M
Boys,99.79,5,Ty Jalowy,East Bernard,92.71,226.8,149.69,229.06,605.55,Single-ply,SBD,M
Boys,99.79,6,Adrian Carter,Houston Madison,98.7,204.12,138.35,233.6,576.06,Single-ply,SBD,M
Boys,99.79,7,Trevor Anderson,Dickinson,91.35,204.12,129.27,226.8,560.19,Single-ply,SBD,M
Boys,99.79,8,Zane Gonzales,Pearland,90.36,215.46,138.35,204.12,557.92,Single-ply,SBD,M
Boys,99.79,9,James Mower,Friendswood Clear Brook,98.43,222.26,113.4,222.26,557.92,Single-ply,SBD,M
Boys,99.79,10,Fabian Luna,Pasadena Memorial,92.53,208.65,122.47,222.26,553.38,Single-ply,SBD,M
Boys,99.79,11,Nick Tucci,Katy Taylor,92.8,197.31,106.59,231.33,535.24,Single-ply,SBD,M
Boys,99.79,12,Gil Bernal,Channelview,97.52,213.19,117.93,190.51,521.63,Single-ply,SBD,M
Boys,99.79,13,Michael Hoy,Dayton,91.53,174.63,124.74,219.99,519.36,Single-ply,SBD,M
Boys,99.79,14,Presley Viltz,Port Arthur Memorial,94.17,190.51,111.13,204.12,505.76,Single-ply,SBD,M
Boys,99.79,15,Alex Murillo,Dayton,92.8,195.04,113.4,183.7,492.15,Single-ply,SBD,M
Boys,99.79,16,Tyler Ray,Santa Fe,92.71,183.7,102.06,183.7,469.47,Single-ply,SBD,M
Boys,99.79,17,Seath Hearen,Dickinson,94.17,192.78,92.99,183.7,469.47,Single-ply,SBD,M
Boys,99.79,18,Adain Humphrey,Dayton,92.35,190.51,117.93,158.76,467.2,Single-ply,SBD,M
Boys,99.79,19,Ellis Muldrow,Dickinson,92.44,174.63,95.25,183.7,453.59,Single-ply,SBD,M
Boys,99.79,20,Adrian Saenz,Pasadena Memorial,90.72,172.37,95.25,183.7,451.32,Single-ply,SBD,M
Boys,99.79,21,Claude Conner,Beaumont Ozen,94.08,142.88,104.33,192.78,439.98,Single-ply,SBD,M
Boys,99.79,22,Angel Limon,Dayton,94.71,124.74,83.91,158.76,367.41,Single-ply,SBD,M
Boys,99.79,23,Zachary Scabora,Friendswood Clear Brook,95.25,90.72,52.16,104.33,247.21,Single-ply,SBD,M
Boys,99.79,DQ,Michael Dean #2,Galveston Ball,99.79,,,,,Single-ply,SBD,M
Boys,99.79,DQ,Allen Haynes,La Marque,97.52,97.52,74.84,,,Single-ply,SBD,M
Boys,99.79,DQ,Camran Cantu,Katy Taylor,94.35,156.49,70.31,,,Single-ply,SBD,M
Boys,99.79,DQ,Roger Wells,Houston Westbury,99.79,,,,,Single-ply,SBD,M
Boys,99.79,DQ,Spencer Wells,Pearland Dawson,99.79,,,,,Single-ply,SBD,M
Boys,99.79,DQ,Alejandro Corrizalez,Galveston Ball,99.79,,,,,Single-ply,SBD,M
Boys,99.79,DQ,Kiree Williams,Galveston Ball,99.79,,,,,Single-ply,SBD,M
Boys,99.79,DQ,Bralan Spriggins,Dickinson,99.79,,,,,Single-ply,SBD,M
Boys,99.79,DQ,JT Greer,Dickinson,99.79,,,,,Single-ply,SBD,M
Boys,99.79,DQ,Christopher Sutphin,Dayton,99.79,,,,,Single-ply,SBD,M
Boys,99.79,DQ,Jhair Romero,Friendswood Clear Brook,93.53,158.76,,,,Single-ply,SBD,M
Boys,109.77,1,Kaylond North,Dickinson,109.77,340.19,195.04,285.76,821,Single-ply,SBD,M
Boys,109.77,2,Prince Flye,Bay City,108.14,251.74,145.15,238.14,635.03,Single-ply,SBD,M
Boys,109.77,3,Marcus Garza,Conroe Caney Creek,107.59,258.55,136.08,219.99,614.62,Single-ply,SBD,M
Boys,109.77,4,Cedric Duncan,Manvel,107.86,242.67,142.88,215.46,601.01,Single-ply,SBD,M
Boys,109.77,5,Brad Neal,Dayton,102.97,210.92,156.49,204.12,571.53,Single-ply,SBD,M
Boys,109.77,6,Miguel Reyes,Pasadena Memorial,106.32,201.85,117.93,235.87,555.65,Single-ply,SBD,M
Boys,109.77,7,Andrew Hlavinka,East Bernard,108.23,204.12,124.74,208.65,537.51,Single-ply,SBD,M
Boys,109.77,8,Tyler Vasut,East Bernard,108.77,215.46,115.67,199.58,530.7,Single-ply,SBD,M
Boys,109.77,9,Fidel Rodriguez,Bay City,109.77,210.92,117.93,201.85,530.7,Single-ply,SBD,M
Boys,109.77,10,Roberto Varvelo,Channelview,103.51,215.46,97.52,201.85,514.83,Single-ply,SBD,M
Boys,109.77,11,David Williams #4,Stafford,105.41,197.31,122.47,195.04,514.83,Single-ply,SBD,M
Boys,109.77,12,Elton Woodard,Stafford,106.05,195.04,113.4,195.04,503.49,Single-ply,SBD,M
Boys,109.77,13,Lautaro Putallaz,Katy Taylor,103.51,197.31,104.33,188.24,489.88,Single-ply,SBD,M
Boys,109.77,14,Daniel Parr,Dickinson,100.43,208.65,90.72,183.7,483.08,Single-ply,SBD,M
Boys,109.77,15,Pierce Tupa,Pearland,100.7,179.17,138.35,165.56,483.08,Single-ply,SBD,M
Boys,109.77,16,Armando Alaniz Jr,Dickinson,108.95,185.97,111.13,183.7,480.81,Single-ply,SBD,M
Boys,109.77,17,Tyler Williams,Pearland Dawson,109.77,197.31,88.45,188.24,474,Single-ply,SBD,M
Boys,109.77,18,Zach Battle,Bay City,100.06,197.31,97.52,172.37,467.2,Single-ply,SBD,M
Boys,109.77,19,Dustin Powell,Santa Fe,101.6,179.17,102.06,183.7,464.93,Single-ply,SBD,M
Boys,109.77,20,Antoine Newman,Houston Madison,104.78,188.24,97.52,174.63,460.4,Single-ply,SBD,M
Boys,109.77,21,Jamaal Edwards,Beaumont Ozen,100.61,154.22,95.25,181.44,430.91,Single-ply,SBD,M
Boys,109.77,22,Tyler Puffer,Friendswood Clear Brook,100.79,163.29,81.65,163.29,408.23,Single-ply,SBD,M
Boys,109.77,23,Orlando Zamarripa,Bay City,103.78,161.03,72.57,170.1,403.7,Single-ply,SBD,M
Boys,109.77,24,Richard Lewis #2,Friendswood Clear Brook,103.96,149.69,90.72,145.15,385.55,Single-ply,SBD,M
Boys,109.77,25,Johnny Hoy,Dayton,103.24,151.95,86.18,142.88,381.02,Single-ply,SBD,M
Boys,109.77,26,Albert Rodas,Pasadena Memorial,104.33,136.08,68.04,145.15,349.27,Single-ply,SBD,M
Boys,109.77,DQ,Izaah Washington,La Porte,106.14,181.44,,,,Single-ply,SBD,M
Boys,109.77,DQ,Logan Nichols,La Porte,103.15,195.04,111.13,,,Single-ply,SBD,M
Boys,109.77,DQ,Kevin Sumlin,La Marque,109.77,,,,,Single-ply,SBD,M
Boys,109.77,DQ,Hershel Wafer,La Marque,109.77,,,,,Single-ply,SBD,M
Boys,109.77,DQ,Payne Herbert,Pearland Dawson,106.59,44.45,,,,Single-ply,SBD,M
Boys,109.77,DQ,Jonathan Burditt,Dayton,108.68,210.92,,,,Single-ply,SBD,M
Boys,109.77,DQ,Caleb Chute,Conroe Caney Creek,101.29,226.8,120.2,,,Single-ply,SBD,M
Boys,109.77,DQ,Eric Taylor #4,Beaumont Ozen,103.42,183.7,92.99,,,Single-ply,SBD,M
Boys,109.77,DQ,Contrell Green,Conroe Oak Ridge,107.77,224.53,131.54,,,Single-ply,SBD,M
Boys,109.77,DQ,Jakob Legg,Conroe Caney Creek,109.77,,,,,Single-ply,SBD,M
Boys,109.77,DQ,Kevin Nguyen #9,Friendswood Clear Brook,109.77,,,,,Single-ply,SBD,M
Boys,109.77,DQ,Alex Rosen,Houston Westbury,109.77,,,,,Single-ply,SBD,M
Boys,109.77,DQ,Shawn Callis,Houston Westbury,109.77,,,,,Single-ply,SBD,M
Boys,109.77,DQ,Jonathan Alfonso,Katy Taylor,109.77,,,,,Single-ply,SBD,M
Boys,109.77,DQ,Neeairus Withers,Beaumont Ozen,106.59,163.29,108.86,,,Single-ply,SBD,M
Boys,124.74,1,Chase Kellar,Conroe Caney Creek,121.74,306.17,172.37,272.16,750.7,Single-ply,SBD,M
Boys,124.74,2,Diundre Washington,Beaumont Ozen,110.68,281.23,183.7,226.8,691.73,Single-ply,SBD,M
Boys,124.74,3,Kyler Gentry,Santa Fe,122.74,272.16,158.76,226.8,657.71,Single-ply,SBD,M
Boys,124.74,4,Gino Cortez,Pearland,120.47,249.48,156.49,244.94,650.91,Single-ply,SBD,M
Boys,124.74,5,Colby Thomas,Manvel,122.02,235.87,163.29,226.8,625.96,Single-ply,SBD,M
Boys,124.74,6,D'vante Mills,Pasadena Memorial,112.22,249.48,136.08,226.8,612.35,Single-ply,SBD,M
Boys,124.74,7,Kainen Collins,Port Arthur Memorial,114.12,240.4,129.27,226.8,596.47,Single-ply,SBD,M
Boys,124.74,8,Luke MacLennan,Bay City,115.39,233.6,145.15,215.46,594.21,Single-ply,SBD,M
Boys,124.74,9,Cameron Townsend,Friendswood Clear Brook,113.76,235.87,140.61,208.65,585.13,Single-ply,SBD,M
Boys,124.74,10,Lloyd Allums,Beaumont Central,121.56,215.46,154.22,204.12,573.79,Single-ply,SBD,M
Boys,124.74,11,Joseph Mayfield,Stafford,111.95,215.46,156.49,190.51,562.45,Single-ply,SBD,M
Boys,124.74,12,Andrew Cassity,Friendswood Clear Brook,120.56,213.19,99.79,244.94,557.92,Single-ply,SBD,M
Boys,124.74,13,Cobin Estorffe,Katy Taylor,122.83,231.33,124.74,199.58,555.65,Single-ply,SBD,M
Boys,124.74,14,Lathan Chambers,Pearland,122.29,183.7,156.49,199.58,539.77,Single-ply,SBD,M
Boys,124.74,15,Jerome Harmon,Beaumont Ozen,119.84,208.65,106.59,199.58,514.83,Single-ply,SBD,M
Boys,124.74,16,Ruben Gonzalez #5,Manvel,124.65,170.1,111.13,208.65,489.88,Single-ply,SBD,M
Boys,124.74,17,Luis Miranda,Houston Milby,118.21,158.76,131.54,176.9,467.2,Single-ply,SBD,M
Boys,124.74,18,Terrell Bernard,La Porte,116.57,188.24,111.13,165.56,464.93,Single-ply,SBD,M
Boys,124.74,19,Travis Cudworth,Friendswood Clear Brook,115.3,183.7,92.99,181.44,458.13,Single-ply,SBD,M
Boys,124.74,20,Tyler Johnson,Conroe Oak Ridge,121.47,161.03,99.79,192.78,453.59,Single-ply,SBD,M
Boys,124.74,21,Eric Reid,Stafford,122.29,136.08,129.27,183.7,449.06,Single-ply,SBD,M
Boys,124.74,22,Rudy Wilkins,Katy Taylor,120.93,151.95,97.52,181.44,430.91,Single-ply,SBD,M
Boys,124.74,23,Casey Duhon,Conroe Oak Ridge,118.75,174.63,97.52,145.15,417.3,Single-ply,SBD,M
Boys,124.74,24,Bradley Solis,Katy Taylor,122.83,151.95,90.72,151.95,394.63,Single-ply,SBD,M
Boys,124.74,DQ,Justin Parker,Pearland Dawson,118.75,165.56,,,,Single-ply,SBD,M
Boys,124.74,DQ,Dewayne Robertson,Beaumont Central,122.02,,,,,Single-ply,SBD,M
Boys,124.74,DQ,Joel Otero,Dickinson,115.12,195.04,,,,Single-ply,SBD,M
Boys,124.74,DQ,Javien Times,Bay City,124.74,,,,,Single-ply,SBD,M
Boys,124.74,DQ,John Legg,Conroe Caney Creek,124.74,,,,,Single-ply,SBD,M
Boys,124.74,DQ,Caleb Speasmaker,Pearland Dawson,111.67,179.17,97.52,,,Single-ply,SBD,M
Boys,124.74,DQ,Frank Vargas,Manvel,111.13,151.95,120.2,,,Single-ply,SBD,M
Boys,124.74,DQ,Joey Williams,Pearland,124.74,,,,,Single-ply,SBD,M
Boys,124.74,DQ,Otito Obgonnia,Katy Taylor,113.85,,,,,Single-ply,SBD,M
Boys,124.74,DQ,Peyton Evans,Pearland Dawson,117.03,183.7,106.59,,,Single-ply,SBD,M
Boys,124.74,DQ,Ruben Gamboa,Pearland Dawson,117.84,161.03,,,,Single-ply,SBD,M
Boys,124.74,DQ,Brandon Rangel,Dickinson,112.31,,,,,Single-ply,SBD,M
Boys,124.74+,1,Chance Harmanson,Dickinson,148.42,331.12,206.38,263.08,800.59,Single-ply,SBD,M
Boys,124.74+,2,Chris Rogers,Katy Taylor,131.72,299.37,149.69,265.35,714.41,Single-ply,SBD,M
Boys,124.74+,3,Brandon Jackson #8,Port Arthur Memorial,131.72,285.76,167.83,251.74,705.34,Single-ply,SBD,M
Boys,124.74+,4,Brandon Artis,Port Arthur Memorial,143.52,272.16,149.69,258.55,680.39,Single-ply,SBD,M
Boys,124.74+,5,Parker Correia,Pearland Dawson,152.86,260.82,124.74,226.8,612.35,Single-ply,SBD,M
Boys,124.74+,6,Logan Tonini,Manvel,143.24,215.46,167.83,204.12,587.4,Single-ply,SBD,M
Boys,124.74+,7,Moses Horn,Stafford,138.25,258.55,142.88,183.7,585.13,Single-ply,SBD,M
Boys,124.74+,8,Colton Lowe,Conroe Caney Creek,156.22,249.48,145.15,185.97,580.6,Single-ply,SBD,M
Boys,124.74+,9,Kevin Maddox,Houston Madison,154.49,208.65,136.08,226.8,571.53,Single-ply,SBD,M
Boys,124.74+,10,Bryan Hayes,La Porte,159.76,226.8,151.95,192.78,571.53,Single-ply,SBD,M
Boys,124.74+,11,Tevin Martin,Pearland,129.82,208.65,138.35,210.92,557.92,Single-ply,SBD,M
Boys,124.74+,12,Keleen Oatis,Dickinson,157.49,226.8,136.08,163.29,526.17,Single-ply,SBD,M
Boys,124.74+,13,Lane Morris,Santa Fe,130.45,195.04,92.99,181.44,469.47,Single-ply,SBD,M
Boys,124.74+,14,Lorenzo Lerma,Houston Madison,147.15,170.1,120.2,163.29,453.59,Single-ply,SBD,M
Boys,124.74+,15,Derrick Williams,Bay City,161.93,149.69,90.72,181.44,421.84,Single-ply,SBD,M
Boys,124.74+,16,Charles Forney,Houston Madison,125.74,149.69,102.06,156.49,408.23,Single-ply,SBD,M
Boys,124.74+,17,Torrey Lastice,Dickinson,140.34,174.63,90.72,127.01,392.36,Single-ply,SBD,M
Boys,124.74+,DQ,Terrance Manning,Dayton,148.78,317.51,167.83,,,Single-ply,SBD,M
Boys,124.74+,DQ,Alvaro Alanis,Houston Chavez,146.96,154.22,117.93,,,Single-ply,SBD,M
Boys,124.74+,DQ,Tyrese Henderson,Beaumont Ozen,125.19,142.88,,,,Single-ply,SBD,M
Boys,124.74+,DQ,Max Casas,Pearland Dawson,132.18,215.46,102.06,,,Single-ply,SBD,M
Boys,124.74+,DQ,Coy Combs,La Porte,128.09,260.82,124.74,,,Single-ply,SBD,M
Boys,124.74+,DQ,Brycen Boudreaux,La Porte,144.51,192.78,,,,Single-ply,SBD,M
Boys,124.74+,DQ,William Tinner,La Marque,136.08,,,,,Single-ply,SBD,M
Boys,124.74+,DQ,Sterling Ofoh,Houston Westbury,136.08,,,,,Single-ply,SBD,M
Boys,124.74+,DQ,Brent Holmes,Conroe Caney Creek,136.08,,,,,Single-ply,SBD,M
Boys,124.74+,DQ,Bernard Childs,Channelview,145.42,256.28,136.08,,,Single-ply,SBD,M
Boys,124.74+,DQ,Anthonie Thomas,Houston Madison,158.94,195.04,158.76,,,Single-ply,SBD,M
Boys,,NS,Madontrist Dickerson,Port Arthur Memorial,,,,,,Single-ply,SBD,M
