Division,WeightClassKg,Place,Name,Team,BodyweightKg,Best3SquatKg,Best3BenchKg,Best3DeadliftKg,TotalKg,Equipment,Event,Sex
Boys,55.79,1,Bobby Sanchez,Centerville,51.94,106.59,52.16,92.99,251.74,Single-ply,SBD,M
Boys,51.71,2,Corbin Feauato,Normangee,51.71,90.72,47.63,92.99,231.33,Single-ply,SBD,M
Boys,55.79,1,Hector Jaramillo,Franklin,55.79,179.17,95.25,158.76,433.18,Single-ply,SBD,M
Boys,55.79,2,Layton Noey,Normangee,53.52,95.25,63.5,115.67,274.42,Single-ply,SBD,M
Boys,55.79,3,Patrick Evans,Normangee,55.79,90.72,54.43,106.59,251.74,Single-ply,SBD,M
Boys,55.79,4,Jason Zarate,Centerville,52.62,83.91,52.16,83.91,219.99,Single-ply,SBD,M
Boys,59.87,1,Zan Baer,Normangee,56.7,120.2,68.04,124.74,312.98,Single-ply,SBD,M
Boys,59.87,NS,Bradley Berryhill,Jewett Leon,,,,,,Single-ply,SBD,M
Boys,59.87,DQ,Cristian Zarate,Centerville,59.87,102.06,61.23,,,Single-ply,SBD,M
Boys,67.13,1,Sergio Villareal,Centerville,66.22,142.88,90.72,149.69,383.29,Single-ply,SBD,M
Boys,67.13,2,Nick Piper,Normangee,67.13,120.2,70.31,151.95,342.46,Single-ply,SBD,M
Boys,67.13,3,Jarid Teran,Normangee,63.96,122.47,70.31,145.15,337.93,Single-ply,SBD,M
Boys,67.13,4,Brandon Walker,Normangee,61.23,102.06,70.31,108.86,281.23,Single-ply,SBD,M
Boys,67.13,5,Chon Cunningham,Jewett Leon,62.6,86.18,65.77,106.59,258.55,Single-ply,SBD,M
Boys,67.13,DQ,Bryce Boyd,Centerville,63.05,,,,,Single-ply,SBD,M
Boys,74.84,1,Abraham Sanchez,Centerville,72.57,151.95,113.4,185.97,451.32,Single-ply,SBD,M
Boys,74.84,2,Zant Tatum,Jewett Leon,69.76,158.76,77.11,158.76,394.63,Single-ply,SBD,M
Boys,74.84,3,Tristan Moore,Franklin,71.49,151.95,97.52,145.15,394.63,Single-ply,SBD,M
Boys,74.84,4,Billy Richards,Centerville,70.31,120.2,70.31,142.88,333.39,Single-ply,SBD,M
Boys,74.84,5,Calem Earley,Centerville,74.84,124.74,74.84,129.27,328.85,Single-ply,SBD,M
Boys,82.1,1,Rodney Rogers,Franklin,80.65,204.12,127.01,188.24,519.36,Single-ply,SBD,M
Boys,82.1,2,Tyler Parker,Centerville,80.74,142.88,102.06,151.95,396.89,Single-ply,SBD,M
Boys,82.1,3,Madison Mason,Jewett Leon,77.93,147.42,97.52,145.15,390.09,Single-ply,SBD,M
Boys,82.1,4,Jared Theis,Jewett Leon,79.11,158.76,77.11,136.08,371.95,Single-ply,SBD,M
Boys,89.81,5,Clayton Swonke,Franklin,82.19,124.74,86.18,136.08,347,Single-ply,SBD,M
Boys,82.1,6,Jose Hernandez #7,Centerville,81.19,133.81,70.31,117.93,322.05,Single-ply,SBD,M
Boys,82.1,DQ,Brandon Madison,Centerville,80.29,136.08,,,,Single-ply,SBD,M
Boys,82.1,DQ,Haiden Zarate,Centerville,76.2,181.44,120.2,,,Single-ply,SBD,M
Boys,82.1,DQ,Cameron Williams #6,Centerville,81.65,,,,,Single-ply,SBD,M
Boys,89.81,1,Bobby Graham,Franklin,87.91,195.04,129.27,185.97,510.29,Single-ply,SBD,M
Boys,89.81,2,Trey Williams #3,Centerville,82.55,163.29,124.74,172.37,460.4,Single-ply,SBD,M
Boys,89.81,3,Kyle Roach,Jewett Leon,89.54,197.31,92.99,158.76,449.06,Single-ply,SBD,M
Boys,89.81,4,Anthony Stokley,Franklin,85.18,145.15,97.52,140.61,383.29,Single-ply,SBD,M
Boys,89.81,5,Diego Contreras,Franklin,89.72,127.01,61.23,115.67,303.91,Single-ply,SBD,M
Boys,89.81,NS,Robin Hewitt,Normangee,,,,,,Single-ply,SBD,M
Boys,89.81,DQ,Devin Anding,Jewett Leon,87.45,170.1,,,,Single-ply,SBD,M
Boys,99.79,1,Tracer Largent,Centerville,98.43,154.22,99.79,154.22,408.23,Single-ply,SBD,M
Boys,99.79,2,Kavan Dooley,Franklin,95.71,147.42,72.57,147.42,367.41,Single-ply,SBD,M
Boys,99.79,DQ,Carson Wakefield,Centerville,98.43,165.56,102.06,,,Single-ply,SBD,M
Boys,124.74,DQ,Blake Johnson,Franklin,122.65,290.3,,,,Single-ply,SBD,M
Boys,124.74+,1,Sergio Sanchez #11,Jewett Leon,130.54,165.56,115.67,181.44,462.66,Single-ply,SBD,M
