<svg xmlns="http://www.w3.org/2000/svg" width="20" height="20" style=""><rect id="backgroundrect" width="100%" height="100%" x="0" y="0" fill="none" stroke="none"/>


<g class="currentLayer" style=""><title>Layer 1</title><rect x="0" fill="none" width="20" height="20" id="svg_1" class="" y="0"/><rect fill="" stroke-dashoffset="" fill-rule="nonzero" id="svg_2" x="3.91836778819561" y="5.040816358753635" width="12.163264521393756" height="9.918367143328851" style="color: rgb(0, 0, 0);" class=""/><rect fill="" stroke-dashoffset="" fill-rule="nonzero" id="svg_6" x="-15" y="7" width="22" height="0" style="color: rgb(0, 0, 0);"/></g></svg>