{
  "id": "wp-translations.org/plugins/wp-translations",
  "slug": "wp-translations-pro",
  "plugin": "wp-translations-pro/wp-translations-pro.php",
  "new_version": "1.2.10",
  "url": "https://wp-translations.org",
  "tested": "5.9.2",
  "last_updated": "2022-04-07T16:40:59.107Z",
  "package": "https://gitlab.com/wp-translations-repo/plugins/wp-translations-pro/raw/master/builds/1.2.10/wp-translations-pro.zip",
  "icons": {
    "1x": "https://gitlab.com/wp-translations-repo/plugins/wp-translations-pro/raw/master/builds/assets/icon-128x128.png",
    "default": "https://gitlab.com/wp-translations-repo/plugins/wp-translations-pro/raw/master/builds/assets/icon-128x128.png"
  }
}
