{
    "$schema": "https://json.schemastore.org/block.json",
    "apiVersion": 2,
    "name": "antique-sibling-pages/block",
    "textdomain": "antique-sibling-pages",
    "title": "Antique Sibling Pages",
    "icon": "list-view",
    "category": "widgets",
    "editorScript": "antique-sibling-pages-block-script",
    "editorStyle": [
        "file:./style.css",
        "file:./editor.css",
        "antique-plugins-blocks",
        "antique-plugins-blocks-theme",
        "antique-font-awesome"
    ],
    "style": [
        "file:./style.css",
        "antique-plugins-blocks",
        "antique-plugins-blocks-theme",
        "antique-font-awesome"
    ],
    "viewScript": "antique-plugins-collapse"
}
