<?xml version="1.0" encoding="UTF-8" standalone="no"?><svg xmlns="http://www.w3.org/2000/svg" xmlns:xlink="http://www.w3.org/1999/xlink" contentStyleType="text/css" height="203px" preserveAspectRatio="none" style="width:189px;height:203px;background:#FFFFFF;" version="1.1" viewBox="0 0 189 203" width="189px" zoomAndPan="magnify"><defs/><g><!--MD5=[74169cec63ec828658c29127ab8f9447]
class Prybar--><g id="elem_Prybar"><rect codeLine="8" fill="#FFFFFF" height="81.5999" id="Prybar" rx="2.5" ry="2.5" style="stroke:#555555;stroke-width:0.5;" width="175" x="7" y="115"/><rect fill="#808080" height="32" rx="2.5" ry="2.5" style="stroke:#808080;stroke-width:0.5;" width="175" x="7" y="115"/><rect fill="#808080" height="2.5" style="stroke:#808080;stroke-width:0.5;" width="175" x="7" y="144.5"/><rect codeLine="8" fill="none" height="81.5999" id="Prybar" rx="2.5" ry="2.5" style="stroke:#555555;stroke-width:0.5;" width="175" x="7" y="115"/><ellipse cx="69.25" cy="131" fill="#ADD1B2" rx="11" ry="11" style="stroke:#181818;stroke-width:1.0;"/><path d="M68.6094,134.7813 Q69.4063,134.7813 69.9688,134.5938 Q70.5469,134.3906 70.7813,134.1719 Q71.0313,133.9375 71.2656,133.75 Q71.5156,133.5469 71.7344,133.5469 Q72.0781,133.5469 72.3281,133.8125 Q72.5938,134.0625 72.5938,134.3906 Q72.5938,135.125 71.4219,135.8125 Q70.2656,136.4844 68.5625,136.4844 Q66.4063,136.4844 64.9844,135.2188 Q63.5625,133.9531 63.5625,132.0156 L63.5625,130.8906 Q63.5625,128.8594 64.8906,127.4844 Q66.2188,126.0938 68.1875,126.0938 Q69.375,126.0938 70.5938,126.6719 L70.7656,126.75 Q71.0625,126.3438 71.4844,126.3438 Q71.9688,126.3438 72.1406,126.6406 Q72.3281,126.9219 72.3281,127.4688 L72.3281,128.8906 Q72.3281,130.0156 71.4844,130.0156 Q71.1719,130.0156 70.9688,129.8438 Q70.7813,129.6719 70.7344,129.5313 Q70.7031,129.375 70.6563,129.1094 Q70.5469,128.5938 70.0313,128.2813 Q69.5156,127.9688 69.0625,127.8906 Q68.625,127.7969 68.25,127.7969 Q66.9688,127.7969 66.1094,128.6719 Q65.2656,129.5469 65.2656,130.8906 L65.2656,131.9844 Q65.2656,133.2656 66.1719,134.0313 Q67.0781,134.7813 68.6094,134.7813 Z " fill="#000000"/><text fill="#000000" font-family="sans-serif" font-size="14" lengthAdjust="spacing" textLength="42" x="89.75" y="136.6">Prybar</text><line style="stroke:#555555;stroke-width:0.5;" x1="8" x2="181" y1="147" y2="147"/><rect fill="none" height="6" style="stroke:#C82930;stroke-width:1.0;" width="6" x="15" y="155"/><text fill="#000000" font-family="sans-serif" font-size="14" lengthAdjust="spacing" textLength="149" x="27" y="164.9999">length cm : Double Float</text><line style="stroke:#555555;stroke-width:0.5;" x1="8" x2="181" y1="171.7999" y2="171.7999"/><ellipse cx="18" cy="182.7999" fill="#84BE84" rx="3" ry="3" style="stroke:#038048;stroke-width:1.0;"/><text fill="#000000" font-family="sans-serif" font-size="14" lengthAdjust="spacing" textLength="96" x="27" y="189.7999">Multiply Force()</text></g><!--MD5=[68e10493585304499a8c4f578c89d5b8]
class Prying Tool--><g id="elem_Prying Tool"><rect fill="#FFFFFF" height="48" id="Prying Tool" rx="2.5" ry="2.5" style="stroke:#555555;stroke-width:0.5;" width="102" x="43.5" y="7"/><rect fill="#808080" height="32" rx="2.5" ry="2.5" style="stroke:#808080;stroke-width:0.5;" width="102" x="43.5" y="7"/><rect fill="#808080" height="2.5" style="stroke:#808080;stroke-width:0.5;" width="102" x="43.5" y="36.5"/><rect fill="none" height="48" id="Prying Tool" rx="2.5" ry="2.5" style="stroke:#555555;stroke-width:0.5;" width="102" x="43.5" y="7"/><ellipse cx="58.5" cy="23" fill="#ADD1B2" rx="11" ry="11" style="stroke:#181818;stroke-width:1.0;"/><path d="M57.8594,26.7813 Q58.6563,26.7813 59.2188,26.5938 Q59.7969,26.3906 60.0313,26.1719 Q60.2813,25.9375 60.5156,25.75 Q60.7656,25.5469 60.9844,25.5469 Q61.3281,25.5469 61.5781,25.8125 Q61.8438,26.0625 61.8438,26.3906 Q61.8438,27.125 60.6719,27.8125 Q59.5156,28.4844 57.8125,28.4844 Q55.6563,28.4844 54.2344,27.2188 Q52.8125,25.9531 52.8125,24.0156 L52.8125,22.8906 Q52.8125,20.8594 54.1406,19.4844 Q55.4688,18.0938 57.4375,18.0938 Q58.625,18.0938 59.8438,18.6719 L60.0156,18.75 Q60.3125,18.3438 60.7344,18.3438 Q61.2188,18.3438 61.3906,18.6406 Q61.5781,18.9219 61.5781,19.4688 L61.5781,20.8906 Q61.5781,22.0156 60.7344,22.0156 Q60.4219,22.0156 60.2188,21.8438 Q60.0313,21.6719 59.9844,21.5313 Q59.9531,21.375 59.9063,21.1094 Q59.7969,20.5938 59.2813,20.2813 Q58.7656,19.9688 58.3125,19.8906 Q57.875,19.7969 57.5,19.7969 Q56.2188,19.7969 55.3594,20.6719 Q54.5156,21.5469 54.5156,22.8906 L54.5156,23.9844 Q54.5156,25.2656 55.4219,26.0313 Q56.3281,26.7813 57.8594,26.7813 Z " fill="#000000"/><text fill="#000000" font-family="sans-serif" font-size="14" lengthAdjust="spacing" textLength="70" x="72.5" y="28.6">Prying Tool</text><line style="stroke:#555555;stroke-width:0.5;" x1="44.5" x2="144.5" y1="39" y2="39"/><line style="stroke:#555555;stroke-width:0.5;" x1="44.5" x2="144.5" y1="47" y2="47"/></g><!--MD5=[071ba256ae55346af5346b7ae2772068]
reverse link Prying Tool to Prybar--><g id="link_Prying Tool_Prybar"><path codeLine="13" d="M94.5,75.6 C94.5,88.28 94.5,102.06 94.5,114.53 " fill="none" id="Prying Tool-backto-Prybar" style="stroke:#181818;stroke-width:1.0;"/><polygon fill="none" points="87.5,75.14,94.5,55.14,101.5,75.14,87.5,75.14" style="stroke:#181818;stroke-width:1.0;"/></g><!--MD5=[e23051984062fbd78501c0b957189299]
@startuml
set namespaceSeparator :
skinparam ClassBackgroundColor #FFFFFF
skinparam ClassBorderColor #555555
skinparam ClassFontColor #000000
skinparam ClassHeaderBackgroundColor #808080

skinparam top to bottom direction
class "Prybar" {
{field} -length cm : Double Float
{method} +Multiply Force()

}
"Prying Tool" <|- - "Prybar"



@enduml

PlantUML version 1.2022.5(Sat Apr 30 10:55:52 GMT 2022)
(GPL source distribution)
Java Runtime: OpenJDK Runtime Environment
JVM: OpenJDK 64-Bit Server VM
Default Encoding: UTF-8
Language: en
Country: US
--></g></svg>