<?xml version="1.0" encoding="UTF-8" standalone="no"?><svg xmlns="http://www.w3.org/2000/svg" xmlns:xlink="http://www.w3.org/1999/xlink" contentStyleType="text/css" height="186px" preserveAspectRatio="none" style="width:136px;height:186px;background:#FFFFFF;" version="1.1" viewBox="0 0 136 186" width="136px" zoomAndPan="magnify"><defs/><g><!--MD5=[58082975007dddcebaac605233a867fc]
class House Key--><g id="elem_House Key"><rect codeLine="8" fill="#FFFFFF" height="64.7999" id="House Key" rx="2.5" ry="2.5" style="stroke:#555555;stroke-width:0.5;" width="122" x="7" y="115"/><rect fill="#808080" height="32" rx="2.5" ry="2.5" style="stroke:#808080;stroke-width:0.5;" width="122" x="7" y="115"/><rect fill="#808080" height="2.5" style="stroke:#808080;stroke-width:0.5;" width="122" x="7" y="144.5"/><rect codeLine="8" fill="none" height="64.7999" id="House Key" rx="2.5" ry="2.5" style="stroke:#555555;stroke-width:0.5;" width="122" x="7" y="115"/><ellipse cx="32.8" cy="131" fill="#ADD1B2" rx="11" ry="11" style="stroke:#181818;stroke-width:1.0;"/><path d="M32.1594,134.7813 Q32.9563,134.7813 33.5188,134.5938 Q34.0969,134.3906 34.3313,134.1719 Q34.5813,133.9375 34.8156,133.75 Q35.0656,133.5469 35.2844,133.5469 Q35.6281,133.5469 35.8781,133.8125 Q36.1438,134.0625 36.1438,134.3906 Q36.1438,135.125 34.9719,135.8125 Q33.8156,136.4844 32.1125,136.4844 Q29.9562,136.4844 28.5344,135.2188 Q27.1125,133.9531 27.1125,132.0156 L27.1125,130.8906 Q27.1125,128.8594 28.4406,127.4844 Q29.7687,126.0938 31.7375,126.0938 Q32.925,126.0938 34.1438,126.6719 L34.3156,126.75 Q34.6125,126.3438 35.0344,126.3438 Q35.5188,126.3438 35.6906,126.6406 Q35.8781,126.9219 35.8781,127.4688 L35.8781,128.8906 Q35.8781,130.0156 35.0344,130.0156 Q34.7219,130.0156 34.5188,129.8438 Q34.3313,129.6719 34.2844,129.5313 Q34.2531,129.375 34.2063,129.1094 Q34.0969,128.5938 33.5813,128.2813 Q33.0656,127.9688 32.6125,127.8906 Q32.175,127.7969 31.8,127.7969 Q30.5187,127.7969 29.6594,128.6719 Q28.8156,129.5469 28.8156,130.8906 L28.8156,131.9844 Q28.8156,133.2656 29.7219,134.0313 Q30.6281,134.7813 32.1594,134.7813 Z " fill="#000000"/><text fill="#000000" font-family="sans-serif" font-size="14" lengthAdjust="spacing" textLength="66" x="49.2" y="136.6">House Key</text><line style="stroke:#555555;stroke-width:0.5;" x1="8" x2="128" y1="147" y2="147"/><line style="stroke:#555555;stroke-width:0.5;" x1="8" x2="128" y1="155" y2="155"/><ellipse cx="18" cy="166" fill="#84BE84" rx="3" ry="3" style="stroke:#038048;stroke-width:1.0;"/><text fill="#000000" font-family="sans-serif" font-size="14" lengthAdjust="spacing" textLength="96" x="27" y="172.9999">Multiply Force()</text></g><!--MD5=[9478973e59e49a7530f7d1dca50e2374]
class Lever--><g id="elem_Lever"><rect codeLine="13" fill="#FFFFFF" height="48" id="Lever" rx="2.5" ry="2.5" style="stroke:#555555;stroke-width:0.5;" width="68" x="34" y="7"/><rect fill="#808080" height="32" rx="2.5" ry="2.5" style="stroke:#808080;stroke-width:0.5;" width="68" x="34" y="7"/><rect fill="#808080" height="2.5" style="stroke:#808080;stroke-width:0.5;" width="68" x="34" y="36.5"/><rect codeLine="13" fill="none" height="48" id="Lever" rx="2.5" ry="2.5" style="stroke:#555555;stroke-width:0.5;" width="68" x="34" y="7"/><ellipse cx="49" cy="23" fill="#B4A7E5" rx="11" ry="11" style="stroke:#181818;stroke-width:1.0;"/><path d="M51.6719,26.2969 Q52.2188,26.2969 52.5,26.4844 Q52.7813,26.6563 52.7813,27.1563 Q52.7813,28 51.6719,28 L46.5313,28 Q45.4063,28 45.4063,27.1563 Q45.4063,26.6563 45.6875,26.4844 Q45.9844,26.2969 46.5313,26.2969 L48.25,26.2969 L48.25,19.7813 L46.5313,19.7813 Q45.4063,19.7813 45.4063,18.9375 Q45.4063,18.4531 45.6875,18.2813 Q45.9844,18.0938 46.5313,18.0938 L51.6719,18.0938 Q52.2188,18.0938 52.5,18.2813 Q52.7813,18.4531 52.7813,18.9375 Q52.7813,19.7813 51.6719,19.7813 L49.9531,19.7813 L49.9531,26.2969 L51.6719,26.2969 Z " fill="#000000"/><text fill="#000000" font-family="sans-serif" font-size="14" font-style="italic" lengthAdjust="spacing" textLength="36" x="63" y="28.6">Lever</text><line style="stroke:#555555;stroke-width:0.5;" x1="35" x2="101" y1="39" y2="39"/><line style="stroke:#555555;stroke-width:0.5;" x1="35" x2="101" y1="47" y2="47"/></g><!--MD5=[9474b7cf27cb896dd1d9459487d60105]
reverse link Lever to House Key--><g id="link_Lever_House Key"><path codeLine="12" d="M68,75.59 C68,88.59 68,102.59 68,114.69 " fill="none" id="Lever-backto-House Key" style="stroke:#181818;stroke-width:1.0;stroke-dasharray:7.0,7.0;"/><polygon fill="none" points="61,75.17,68,55.17,75,75.17,61,75.17" style="stroke:#181818;stroke-width:1.0;"/></g><!--MD5=[aeff355d387e35dcf66eee2140a683e7]
@startuml
set namespaceSeparator :
skinparam ClassBackgroundColor #FFFFFF
skinparam ClassBorderColor #555555
skinparam ClassFontColor #000000
skinparam ClassHeaderBackgroundColor #808080

skinparam top to bottom direction
class "House Key" {
{method} +Multiply Force()

}
"Lever" <|.. "House Key"
interface "Lever" {}




@enduml

PlantUML version 1.2022.5(Sat Apr 30 10:55:52 GMT 2022)
(GPL source distribution)
Java Runtime: OpenJDK Runtime Environment
JVM: OpenJDK 64-Bit Server VM
Default Encoding: UTF-8
Language: en
Country: US
--></g></svg>