C:\Users\Wouter\IdeaProjects\jdbc\LeChat\src\main\java\com\lechat\users\domain\PasswordValidator.java
C:\Users\Wouter\IdeaProjects\jdbc\LeChat\src\main\java\com\lechat\chatmessages\domain\ChatMessage.java
C:\Users\Wouter\IdeaProjects\jdbc\LeChat\src\main\java\com\lechat\menu\Menu.java
C:\Users\Wouter\IdeaProjects\jdbc\LeChat\src\main\java\com\lechat\users\domain\saveUser.java
C:\Users\Wouter\IdeaProjects\jdbc\LeChat\src\main\java\com\lechat\input\KeyboardHelper.java
C:\Users\Wouter\IdeaProjects\jdbc\LeChat\src\main\java\com\lechat\lechatapp\LeChatApp.java
C:\Users\Wouter\IdeaProjects\jdbc\LeChat\src\main\java\com\lechat\users\domain\EmailAddressValidator.java
C:\Users\Wouter\IdeaProjects\jdbc\LeChat\src\main\java\com\lechat\users\service\UserService.java
C:\Users\Wouter\IdeaProjects\jdbc\LeChat\src\main\java\module-info.java
C:\Users\Wouter\IdeaProjects\jdbc\LeChat\src\main\java\com\lechat\users\domain\UserName.java
C:\Users\Wouter\IdeaProjects\jdbc\LeChat\src\main\java\com\lechat\users\domain\UserNameValidator.java
C:\Users\Wouter\IdeaProjects\jdbc\LeChat\src\main\java\com\lechat\chatmessages\service\ChatMessageService.java
C:\Users\Wouter\IdeaProjects\jdbc\LeChat\src\main\java\com\lechat\users\domain\Password.java
C:\Users\Wouter\IdeaProjects\jdbc\LeChat\src\main\java\com\lechat\users\domain\EmailAddress.java
C:\Users\Wouter\IdeaProjects\jdbc\LeChat\src\main\java\com\lechat\output\MenuOutput.java
C:\Users\Wouter\IdeaProjects\jdbc\LeChat\src\main\java\com\lechat\users\domain\User.java
C:\Users\Wouter\IdeaProjects\jdbc\LeChat\src\main\java\com\lechat\jdbchelper\JpaHelper.java
