<svg width="24" height="24" viewBox="0 0 24 24" fill="none" xmlns="http://www.w3.org/2000/svg">
<path fill-rule="evenodd" clip-rule="evenodd" d="M9.3 9.3001C9.46568 9.13441 9.73431 9.13441 9.9 9.3001L14.7 14.1001C14.8657 14.2658 14.8657 14.5344 14.7 14.7001C14.5343 14.8658 14.2657 14.8658 14.1 14.7001L9.3 9.9001C9.13431 9.73441 9.13431 9.46578 9.3 9.3001Z" fill="#9CA3AF"/>
<path fill-rule="evenodd" clip-rule="evenodd" d="M9.3001 14.7C9.13441 14.5343 9.13441 14.2657 9.3001 14.1L14.1001 9.30001C14.2658 9.13432 14.5344 9.13432 14.7001 9.30001C14.8658 9.46569 14.8658 9.73432 14.7001 9.90001L9.9001 14.7C9.73441 14.8657 9.46578 14.8657 9.3001 14.7Z" fill="#9CA3AF"/>
</svg>
