<svg width="32" height="32" viewBox="0 0 32 32" fill="none" xmlns="http://www.w3.org/2000/svg">
<path fill-rule="evenodd" clip-rule="evenodd" d="M9 10H26V11H9V10ZM6 15H26V16H6V15ZM26 20H9V21H26V20Z" fill="#DFDFDF"/>
</svg>
