<svg width="42" height="42" viewBox="0 0 42 42" fill="none" xmlns="http://www.w3.org/2000/svg">
<g filter="url(#filter0_dd_424_125)">
<path fill-rule="evenodd" clip-rule="evenodd" d="M21 31C28.1797 31 34 25.1797 34 18C34 10.8203 28.1797 5 21 5C13.8203 5 8 10.8203 8 18C8 25.1797 13.8203 31 21 31Z" fill="#F4CC72"/>
</g>
<circle cx="17" cy="18" r="2" fill="white"/>
<circle cx="25" cy="18" r="2" fill="white"/>
<defs>
<filter id="filter0_dd_424_125" x="0" y="0" width="42" height="42" filterUnits="userSpaceOnUse" color-interpolation-filters="sRGB">
<feFlood flood-opacity="0" result="BackgroundImageFix"/>
<feColorMatrix in="SourceAlpha" type="matrix" values="0 0 0 0 0 0 0 0 0 0 0 0 0 0 0 0 0 0 127 0" result="hardAlpha"/>
<feOffset dy="3"/>
<feGaussianBlur stdDeviation="0.5"/>
<feColorMatrix type="matrix" values="0 0 0 0 0 0 0 0 0 0 0 0 0 0 0 0 0 0 0.06 0"/>
<feBlend mode="normal" in2="BackgroundImageFix" result="effect1_dropShadow_424_125"/>
<feColorMatrix in="SourceAlpha" type="matrix" values="0 0 0 0 0 0 0 0 0 0 0 0 0 0 0 0 0 0 127 0" result="hardAlpha"/>
<feOffset dy="3"/>
<feGaussianBlur stdDeviation="4"/>
<feColorMatrix type="matrix" values="0 0 0 0 0 0 0 0 0 0 0 0 0 0 0 0 0 0 0.15 0"/>
<feBlend mode="normal" in2="effect1_dropShadow_424_125" result="effect2_dropShadow_424_125"/>
<feBlend mode="normal" in="SourceGraphic" in2="effect2_dropShadow_424_125" result="shape"/>
</filter>
</defs>
</svg>
