<svg width="7" height="12" viewBox="0 0 7 12" fill="none" xmlns="http://www.w3.org/2000/svg">
<path d="M5.625 10.5L1.30178 6.17678C1.20415 6.07915 1.20415 5.92085 1.30178 5.82322L5.625 1.5" stroke="#464646" stroke-width="1.5" stroke-linecap="round"/>
</svg>
