module caddy

go 1.22.2

require (
	github.com/RussellLuo/caddy-ext/dynamichandler v0.0.0-20230419004738-ab1e18cfe426
	github.com/RussellLuo/caddy-ext/flagr v0.0.0-20230419004738-ab1e18cfe426
	github.com/RussellLuo/caddy-ext/layer4 v0.0.0-20230419004738-ab1e18cfe426
	github.com/RussellLuo/caddy-ext/ratelimit v0.3.0
	github.com/RussellLuo/caddy-ext/requestbodyvar v0.1.0
	github.com/abiosoft/caddy-json-parse v0.0.0-20210522205405-c57039f26567
	github.com/caddy-dns/cloudflare v0.0.0-20240405130444-44030f9306f4
	github.com/caddyserver/caddy/v2 v2.7.6
	github.com/enum-gg/caddy-discord v1.2.0
	github.com/greenpau/caddy-security v1.1.29
	github.com/lucaslorentz/caddy-docker-proxy/v2 v2.8.11
	github.com/pberkel/caddy-storage-redis v1.2.0
	github.com/pteich/caddy-tlsconsul v1.4.1
	github.com/tailscale/caddy-tailscale v0.0.0-20240324222951-7b5a952a5b8b
)

require (
	cloud.google.com/go v0.113.0 // indirect
	cloud.google.com/go/compute v1.23.3 // indirect
	cloud.google.com/go/compute/metadata v0.2.3 // indirect
	cloud.google.com/go/iam v1.1.5 // indirect
	cloud.google.com/go/pubsub v1.33.0 // indirect
	filippo.io/edwards25519 v1.1.0 // indirect
	github.com/AndreasBriese/bbloom v0.0.0-20190825152654-46b345b51c96 // indirect
	github.com/Azure/go-ansiterm v0.0.0-20230124172434-306776ec8161 // indirect
	github.com/Azure/go-ntlmssp v0.0.0-20221128193559-754e69321358 // indirect
	github.com/BurntSushi/toml v1.3.2 // indirect
	github.com/DataDog/datadog-go v3.2.0+incompatible // indirect
	github.com/Masterminds/goutils v1.1.1 // indirect
	github.com/Masterminds/semver/v3 v3.2.1 // indirect
	github.com/Masterminds/sprig/v3 v3.2.3 // indirect
	github.com/Microsoft/go-winio v0.6.1 // indirect
	github.com/RussellLuo/slidingwindow v0.0.0-20200528002341-535bb99d338b // indirect
	github.com/Shopify/sarama v1.19.0 // indirect
	github.com/a8m/kinesis-producer v0.0.0-20180723062609-03228a9f79b3 // indirect
	github.com/akutz/memconn v0.1.0 // indirect
	github.com/alecthomas/chroma/v2 v2.9.1 // indirect
	github.com/alexbrainman/sspi v0.0.0-20231016080023-1a75b4708caa // indirect
	github.com/antihax/optional v1.0.0 // indirect
	github.com/antlr/antlr4/runtime/Go/antlr/v4 v4.0.0-20230305170008-8188dc5388df // indirect
	github.com/armon/go-metrics v0.4.0 // indirect
	github.com/aryann/difflib v0.0.0-20210328193216-ff5ff6dc229b // indirect
	github.com/asaskevich/govalidator v0.0.0-20200907205600-7a23bdc65eef // indirect
	github.com/auth0/go-jwt-middleware v0.0.0-20170425171159-5493cabe49f7 // indirect
	github.com/avast/retry-go v2.2.0+incompatible // indirect
	github.com/aws/aws-sdk-go v1.48.7 // indirect
	github.com/aws/aws-sdk-go-v2 v1.24.1 // indirect
	github.com/aws/aws-sdk-go-v2/config v1.26.5 // indirect
	github.com/aws/aws-sdk-go-v2/credentials v1.16.16 // indirect
	github.com/aws/aws-sdk-go-v2/feature/ec2/imds v1.14.11 // indirect
	github.com/aws/aws-sdk-go-v2/internal/configsources v1.2.10 // indirect
	github.com/aws/aws-sdk-go-v2/internal/endpoints/v2 v2.5.10 // indirect
	github.com/aws/aws-sdk-go-v2/internal/ini v1.7.2 // indirect
	github.com/aws/aws-sdk-go-v2/service/internal/accept-encoding v1.10.4 // indirect
	github.com/aws/aws-sdk-go-v2/service/internal/presigned-url v1.10.10 // indirect
	github.com/aws/aws-sdk-go-v2/service/ssm v1.44.7 // indirect
	github.com/aws/aws-sdk-go-v2/service/sso v1.18.7 // indirect
	github.com/aws/aws-sdk-go-v2/service/ssooidc v1.21.7 // indirect
	github.com/aws/aws-sdk-go-v2/service/sts v1.26.7 // indirect
	github.com/aws/smithy-go v1.19.0 // indirect
	github.com/basgys/goxml2json v1.1.0 // indirect
	github.com/beevik/etree v1.3.0 // indirect
	github.com/beorn7/perks v1.0.1 // indirect
	github.com/brandur/simplebox v0.0.0-20150921201729-84e9865bb03a // indirect
	github.com/bsm/ratelimit v2.0.0+incompatible // indirect
	github.com/bsm/redislock v0.9.4 // indirect
	github.com/caarlos0/env v3.3.0+incompatible // indirect
	github.com/caddyserver/certmagic v0.20.0 // indirect
	github.com/cenkalti/backoff/v4 v4.2.1 // indirect
	github.com/certifi/gocertifi v0.0.0-20200922220541-2c3bb06c6054 // indirect
	github.com/cespare/xxhash v1.1.0 // indirect
	github.com/cespare/xxhash/v2 v2.2.0 // indirect
	github.com/checkr/flagr v0.0.0-20210503185549-d4b7b279061d // indirect
	github.com/checkr/goflagr v0.0.0-20210326170947-e97f63ad2c23 // indirect
	github.com/chzyer/readline v1.5.1 // indirect
	github.com/coreos/go-iptables v0.7.0 // indirect
	github.com/coreos/go-systemd/v22 v22.5.0 // indirect
	github.com/cpuguy83/go-md2man/v2 v2.0.4 // indirect
	github.com/crewjam/httperr v0.2.0 // indirect
	github.com/crewjam/saml v0.4.14 // indirect
	github.com/davecgh/go-spew v1.1.1 // indirect
	github.com/dblohm7/wingoes v0.0.0-20240119213807-a09d6be7affa // indirect
	github.com/dchest/uniuri v1.2.0 // indirect
	github.com/dgraph-io/badger v1.6.2 // indirect
	github.com/dgraph-io/badger/v2 v2.2007.4 // indirect
	github.com/dgraph-io/ristretto v0.1.1 // indirect
	github.com/dgrijalva/jwt-go v3.2.0+incompatible // indirect
	github.com/dgryski/go-farm v0.0.0-20200201041132-a6ae2369ad13 // indirect
	github.com/dgryski/go-rendezvous v0.0.0-20200823014737-9f7001d12a5f // indirect
	github.com/digitalocean/go-smbios v0.0.0-20180907143718-390a4f403a8e // indirect
	github.com/distribution/reference v0.5.0 // indirect
	github.com/dlclark/regexp2 v1.10.0 // indirect
	github.com/docker/docker v25.0.4+incompatible // indirect
	github.com/docker/go-connections v0.4.0 // indirect
	github.com/docker/go-units v0.5.0 // indirect
	github.com/dustin/go-humanize v1.0.1 // indirect
	github.com/eapache/go-resiliency v1.1.0 // indirect
	github.com/eapache/go-xerial-snappy v0.0.0-20180814174437-776d5712da21 // indirect
	github.com/eapache/queue v1.1.0 // indirect
	github.com/emersion/go-sasl v0.0.0-20231106173351-e73c9f7bad43 // indirect
	github.com/emersion/go-smtp v0.21.0 // indirect
	github.com/evalphobia/logrus_sentry v0.8.2 // indirect
	github.com/fatih/color v1.15.0 // indirect
	github.com/felixge/httpsnoop v1.0.3 // indirect
	github.com/fxamacker/cbor/v2 v2.5.0 // indirect
	github.com/getsentry/raven-go v0.2.0 // indirect
	github.com/go-asn1-ber/asn1-ber v1.5.5 // indirect
	github.com/go-chi/chi/v5 v5.0.10 // indirect
	github.com/go-kit/kit v0.13.0 // indirect
	github.com/go-kit/log v0.2.1 // indirect
	github.com/go-ldap/ldap/v3 v3.4.7 // indirect
	github.com/go-logfmt/logfmt v0.6.0 // indirect
	github.com/go-logr/logr v1.4.1 // indirect
	github.com/go-logr/stdr v1.2.2 // indirect
	github.com/go-ole/go-ole v1.3.0 // indirect
	github.com/go-openapi/analysis v0.19.16 // indirect
	github.com/go-openapi/errors v0.19.9 // indirect
	github.com/go-openapi/jsonpointer v0.20.2 // indirect
	github.com/go-openapi/jsonreference v0.20.4 // indirect
	github.com/go-openapi/loads v0.20.1 // indirect
	github.com/go-openapi/runtime v0.19.26 // indirect
	github.com/go-openapi/spec v0.20.2 // indirect
	github.com/go-openapi/strfmt v0.20.0 // indirect
	github.com/go-openapi/swag v0.22.7 // indirect
	github.com/go-openapi/validate v0.20.1 // indirect
	github.com/go-sql-driver/mysql v1.7.1 // indirect
	github.com/go-stack/stack v1.8.0 // indirect
	github.com/go-task/slim-sprig v0.0.0-20230315185526-52ccab3ef572 // indirect
	github.com/godbus/dbus/v5 v5.1.1-0.20230522191255-76236955d466 // indirect
	github.com/gogo/protobuf v1.3.2 // indirect
	github.com/gohttp/pprof v0.0.0-20141119085724-c9d246cbb3ba // indirect
	github.com/golang-jwt/jwt/v4 v4.5.0 // indirect
	github.com/golang/glog v1.2.0 // indirect
	github.com/golang/groupcache v0.0.0-20210331224755-41bb18bfe9da // indirect
	github.com/golang/protobuf v1.5.3 // indirect
	github.com/golang/snappy v0.0.4 // indirect
	github.com/google/btree v1.1.2 // indirect
	github.com/google/cel-go v0.15.1 // indirect
	github.com/google/certificate-transparency-go v1.1.6 // indirect
	github.com/google/go-cmp v0.6.0 // indirect
	github.com/google/go-tpm v0.9.0 // indirect
	github.com/google/go-tspi v0.3.0 // indirect
	github.com/google/nftables v0.1.1-0.20230115205135-9aa6fdf5a28c // indirect
	github.com/google/pprof v0.0.0-20231127191134-f3a68a39ae15 // indirect
	github.com/google/s2a-go v0.1.7 // indirect
	github.com/google/uuid v1.6.0 // indirect
	github.com/googleapis/enterprise-certificate-proxy v0.3.2 // indirect
	github.com/googleapis/gax-go/v2 v2.12.0 // indirect
	github.com/gorilla/csrf v1.7.2 // indirect
	github.com/gorilla/securecookie v1.1.2 // indirect
	github.com/greenpau/go-authcrunch v1.1.4 // indirect
	github.com/greenpau/versioned v1.0.30 // indirect
	github.com/grpc-ecosystem/grpc-gateway/v2 v2.18.0 // indirect
	github.com/hashicorp/consul/api v1.18.2 // indirect
	github.com/hashicorp/go-cleanhttp v0.5.2 // indirect
	github.com/hashicorp/go-hclog v1.2.2 // indirect
	github.com/hashicorp/go-immutable-radix v1.3.1 // indirect
	github.com/hashicorp/go-rootcerts v1.0.2 // indirect
	github.com/hashicorp/golang-lru v0.5.4 // indirect
	github.com/hashicorp/serf v0.10.0 // indirect
	github.com/hdevalence/ed25519consensus v0.2.0 // indirect
	github.com/huandu/xstrings v1.4.0 // indirect
	github.com/illarion/gonotify v1.0.1 // indirect
	github.com/imdario/mergo v0.3.16 // indirect
	github.com/inconshreveable/mousetrap v1.1.0 // indirect
	github.com/insomniacslk/dhcp v0.0.0-20231206064809-8c70d406f6d2 // indirect
	github.com/jackc/chunkreader/v2 v2.0.1 // indirect
	github.com/jackc/pgconn v1.14.3 // indirect
	github.com/jackc/pgio v1.0.0 // indirect
	github.com/jackc/pgpassfile v1.0.0 // indirect
	github.com/jackc/pgproto3/v2 v2.3.3 // indirect
	github.com/jackc/pgservicefile v0.0.0-20231201235250-de7065d80cb9 // indirect
	github.com/jackc/pgtype v1.14.0 // indirect
	github.com/jackc/pgx/v4 v4.18.2 // indirect
	github.com/jinzhu/gorm v1.9.16 // indirect
	github.com/jinzhu/inflection v1.0.0 // indirect
	github.com/jmespath/go-jmespath v0.4.0 // indirect
	github.com/joho/godotenv v1.5.1 // indirect
	github.com/jonboulle/clockwork v0.4.0 // indirect
	github.com/josharian/intern v1.0.0 // indirect
	github.com/josharian/native v1.1.1-0.20230202152459-5c7d0dd6ab86 // indirect
	github.com/jpillora/backoff v1.0.0 // indirect
	github.com/jsimonetti/rtnetlink v1.4.0 // indirect
	github.com/klauspost/compress v1.17.4 // indirect
	github.com/klauspost/cpuid/v2 v2.2.6 // indirect
	github.com/kortschak/wol v0.0.0-20200729010619-da482cc4850a // indirect
	github.com/lib/pq v1.10.9 // indirect
	github.com/libdns/cloudflare v0.1.1 // indirect
	github.com/libdns/libdns v0.2.2 // indirect
	github.com/mailru/easyjson v0.7.7 // indirect
	github.com/manifoldco/promptui v0.9.0 // indirect
	github.com/mastercactapus/proxyprotocol v0.0.4 // indirect
	github.com/mattermost/xml-roundtrip-validator v0.1.0 // indirect
	github.com/mattn/go-colorable v0.1.13 // indirect
	github.com/mattn/go-isatty v0.0.20 // indirect
	github.com/mattn/go-sqlite3 v1.14.16 // indirect
	github.com/mdlayher/genetlink v1.3.2 // indirect
	github.com/mdlayher/netlink v1.7.2 // indirect
	github.com/mdlayher/sdnotify v1.0.0 // indirect
	github.com/mdlayher/socket v0.5.0 // indirect
	github.com/meatballhat/negroni-logrus v0.0.0-20170801195057-31067281800f // indirect
	github.com/mgutz/ansi v0.0.0-20200706080929-d51e80ef957d // indirect
	github.com/mholt/acmez v1.2.0 // indirect
	github.com/mholt/caddy-l4 v0.0.0-20220125094439-07bd718906ce // indirect
	github.com/miekg/dns v1.1.58 // indirect
	github.com/mitchellh/copystructure v1.2.0 // indirect
	github.com/mitchellh/go-homedir v1.1.0 // indirect
	github.com/mitchellh/go-ps v1.0.0 // indirect
	github.com/mitchellh/mapstructure v1.5.0 // indirect
	github.com/mitchellh/reflectwalk v1.0.2 // indirect
	github.com/newrelic/go-agent v2.15.0+incompatible // indirect
	github.com/onsi/ginkgo/v2 v2.13.2 // indirect
	github.com/opencontainers/go-digest v1.0.0 // indirect
	github.com/opencontainers/image-spec v1.1.0-rc6 // indirect
	github.com/philhofer/fwd v1.0.0 // indirect
	github.com/phyber/negroni-gzip v0.0.0-20180113114010-ef6356a5d029 // indirect
	github.com/pierrec/lz4 v2.5.2+incompatible // indirect
	github.com/pierrec/lz4/v4 v4.1.21 // indirect
	github.com/pkg/errors v0.9.1 // indirect
	github.com/prometheus/client_golang v1.18.0 // indirect
	github.com/prometheus/client_model v0.5.0 // indirect
	github.com/prometheus/common v0.46.0 // indirect
	github.com/prometheus/procfs v0.12.0 // indirect
	github.com/pteich/errors v1.0.1 // indirect
	github.com/quic-go/qpack v0.4.0 // indirect
	github.com/quic-go/qtls-go1-20 v0.4.1 // indirect
	github.com/quic-go/quic-go v0.40.1 // indirect
	github.com/rcrowley/go-metrics v0.0.0-20201227073835-cf1acfcdf475 // indirect
	github.com/redis/go-redis/v9 v9.3.0 // indirect
	github.com/rs/cors v1.9.0 // indirect
	github.com/rs/xid v1.5.0 // indirect
	github.com/russellhaering/goxmldsig v1.4.0 // indirect
	github.com/russross/blackfriday/v2 v2.1.0 // indirect
	github.com/safchain/ethtool v0.3.0 // indirect
	github.com/shopspring/decimal v1.3.1 // indirect
	github.com/shurcooL/sanitized_anchor_name v1.0.0 // indirect
	github.com/sirupsen/logrus v1.9.3 // indirect
	github.com/skip2/go-qrcode v0.0.0-20200617195104-da1b6568686e // indirect
	github.com/slackhq/nebula v1.7.2 // indirect
	github.com/smallstep/certificates v0.25.2 // indirect
	github.com/smallstep/go-attestation v0.4.4-0.20230627102604-cf579e53cbd2 // indirect
	github.com/smallstep/nosql v0.6.0 // indirect
	github.com/smallstep/pkcs7 v0.0.0-20231107075624-be1870d87d13 // indirect
	github.com/smallstep/scep v0.0.0-20231024192529-aee96d7ad34d // indirect
	github.com/smallstep/truststore v0.13.0 // indirect
	github.com/spf13/cast v1.6.0 // indirect
	github.com/spf13/cobra v1.8.0 // indirect
	github.com/spf13/pflag v1.0.5 // indirect
	github.com/stoewer/go-strcase v1.3.0 // indirect
	github.com/tailscale/certstore v0.1.1-0.20231202035212-d3fa0460f47e // indirect
	github.com/tailscale/go-winio v0.0.0-20231025203758-c4f33415bf55 // indirect
	github.com/tailscale/golang-x-crypto v0.0.0-20240108194725-7ce1f622c780 // indirect
	github.com/tailscale/goupnp v1.0.1-0.20210804011211-c64d0f06ea05 // indirect
	github.com/tailscale/hujson v0.0.0-20221223112325-20486734a56a // indirect
	github.com/tailscale/netlink v1.1.1-0.20211101221916-cabfb018fe85 // indirect
	github.com/tailscale/peercred v0.0.0-20240214030740-b535050b2aa4 // indirect
	github.com/tailscale/tscert v0.0.0-20230806124524-28a91b69a046 // indirect
	github.com/tailscale/web-client-prebuilt v0.0.0-20240226180453-5db17b287bf1 // indirect
	github.com/tailscale/wireguard-go v0.0.0-20231121184858-cc193a0b3272 // indirect
	github.com/tcnksm/go-httpstat v0.2.0 // indirect
	github.com/tidwall/gjson v1.17.1 // indirect
	github.com/tidwall/match v1.1.1 // indirect
	github.com/tidwall/pretty v1.2.0 // indirect
	github.com/tinylib/msgp v1.1.0 // indirect
	github.com/traefik/yaegi v0.13.0 // indirect
	github.com/u-root/uio v0.0.0-20240118234441-a3c409a6018e // indirect
	github.com/urfave/cli v1.22.14 // indirect
	github.com/urfave/negroni v0.3.0 // indirect
	github.com/vishvananda/netlink v1.2.1-beta.2 // indirect
	github.com/vishvananda/netns v0.0.4 // indirect
	github.com/x448/float16 v0.8.4 // indirect
	github.com/yadvendar/negroni-newrelic-go-agent v0.0.0-20160803090806-3dc58758cb67 // indirect
	github.com/yuin/goldmark v1.5.6 // indirect
	github.com/yuin/goldmark-highlighting/v2 v2.0.0-20230729083705-37449abec8cc // indirect
	github.com/zeebo/blake3 v0.2.3 // indirect
	github.com/zhouzhuojie/conditions v0.2.3 // indirect
	github.com/zhouzhuojie/withtimeout v0.0.0-20190405051827-12b39eb2edd5 // indirect
	go.etcd.io/bbolt v1.3.8 // indirect
	go.mongodb.org/mongo-driver v1.15.0 // indirect
	go.opencensus.io v0.24.0 // indirect
	go.opentelemetry.io/contrib/instrumentation/net/http/otelhttp v0.45.0 // indirect
	go.opentelemetry.io/contrib/propagators/autoprop v0.42.0 // indirect
	go.opentelemetry.io/contrib/propagators/aws v1.17.0 // indirect
	go.opentelemetry.io/contrib/propagators/b3 v1.17.0 // indirect
	go.opentelemetry.io/contrib/propagators/jaeger v1.17.0 // indirect
	go.opentelemetry.io/contrib/propagators/ot v1.17.0 // indirect
	go.opentelemetry.io/otel v1.22.0 // indirect
	go.opentelemetry.io/otel/exporters/otlp/otlptrace v1.22.0 // indirect
	go.opentelemetry.io/otel/exporters/otlp/otlptrace/otlptracegrpc v1.21.0 // indirect
	go.opentelemetry.io/otel/metric v1.22.0 // indirect
	go.opentelemetry.io/otel/sdk v1.22.0 // indirect
	go.opentelemetry.io/otel/trace v1.22.0 // indirect
	go.opentelemetry.io/proto/otlp v1.0.0 // indirect
	go.step.sm/cli-utils v0.8.0 // indirect
	go.step.sm/crypto v0.38.0 // indirect
	go.step.sm/linkedca v0.20.1 // indirect
	go.uber.org/mock v0.4.0 // indirect
	go.uber.org/multierr v1.11.0 // indirect
	go.uber.org/zap v1.27.0 // indirect
	go4.org/mem v0.0.0-20220726221520-4f986261bf13 // indirect
	go4.org/netipx v0.0.0-20231129151722-fdeea329fbba // indirect
	golang.org/x/crypto v0.22.0 // indirect
	golang.org/x/exp v0.0.0-20240119083558-1b970713d09a // indirect
	golang.org/x/mod v0.14.0 // indirect
	golang.org/x/net v0.24.0 // indirect
	golang.org/x/oauth2 v0.16.0 // indirect
	golang.org/x/sync v0.6.0 // indirect
	golang.org/x/sys v0.19.0 // indirect
	golang.org/x/term v0.19.0 // indirect
	golang.org/x/text v0.14.0 // indirect
	golang.org/x/time v0.5.0 // indirect
	golang.org/x/tools v0.17.0 // indirect
	golang.zx2c4.com/wintun v0.0.0-20230126152724-0fa3db229ce2 // indirect
	golang.zx2c4.com/wireguard/windows v0.5.3 // indirect
	google.golang.org/api v0.152.0 // indirect
	google.golang.org/appengine v1.6.8 // indirect
	google.golang.org/genproto v0.0.0-20231120223509-83a465c0220f // indirect
	google.golang.org/genproto/googleapis/api v0.0.0-20231127180814-3a041ad873d4 // indirect
	google.golang.org/genproto/googleapis/rpc v0.0.0-20231127180814-3a041ad873d4 // indirect
	google.golang.org/grpc v1.60.1 // indirect
	google.golang.org/protobuf v1.34.1 // indirect
	gopkg.in/DataDog/dd-trace-go.v1 v1.9.0 // indirect
	gopkg.in/natefinch/lumberjack.v2 v2.2.1 // indirect
	gopkg.in/square/go-jose.v2 v2.6.0 // indirect
	gopkg.in/yaml.v3 v3.0.1 // indirect
	gvisor.dev/gvisor v0.0.0-20240306221502-ee1e1f6070e3 // indirect
	howett.net/plist v1.0.1 // indirect
	nhooyr.io/websocket v1.8.10 // indirect
	tailscale.com v1.66.2 // indirect
)
