<mxfile host="app.diagrams.net" modified="2020-12-16T08:01:08.333Z" agent="5.0 (Windows NT 10.0; Win64; x64) AppleWebKit/537.36 (KHTML, like Gecko) Chrome/87.0.4280.88 Safari/537.36" etag="IpupM_M3QCwP9s7Q3l7E" version="14.0.3" type="gitlab">
  <diagram id="pEvcKjvnEQaJHYZZ-vlF" name="Page-1">
    <mxGraphModel dx="1422" dy="772" grid="1" gridSize="10" guides="1" tooltips="1" connect="1" arrows="1" fold="1" page="1" pageScale="1" pageWidth="850" pageHeight="1100" math="0" shadow="0">
      <root>
        <mxCell id="0" />
        <mxCell id="1" parent="0" />
        <mxCell id="9TW_L_tKnXNK0CNASQuZ-10" style="edgeStyle=orthogonalEdgeStyle;rounded=0;orthogonalLoop=1;jettySize=auto;html=1;" edge="1" parent="1" source="9TW_L_tKnXNK0CNASQuZ-1">
          <mxGeometry relative="1" as="geometry">
            <mxPoint x="160" y="340" as="targetPoint" />
          </mxGeometry>
        </mxCell>
        <mxCell id="9TW_L_tKnXNK0CNASQuZ-1" value="h1&lt;br&gt;.h1-title" style="whiteSpace=wrap;html=1;aspect=fixed;" vertex="1" parent="1">
          <mxGeometry x="120" y="40" width="80" height="80" as="geometry" />
        </mxCell>
        <mxCell id="9TW_L_tKnXNK0CNASQuZ-14" style="edgeStyle=orthogonalEdgeStyle;rounded=0;orthogonalLoop=1;jettySize=auto;html=1;" edge="1" parent="1" source="9TW_L_tKnXNK0CNASQuZ-2">
          <mxGeometry relative="1" as="geometry">
            <mxPoint x="440" y="340" as="targetPoint" />
            <Array as="points">
              <mxPoint x="280" y="140" />
              <mxPoint x="440" y="140" />
            </Array>
          </mxGeometry>
        </mxCell>
        <mxCell id="9TW_L_tKnXNK0CNASQuZ-2" value="H2&lt;br&gt;.h2-title" style="whiteSpace=wrap;html=1;aspect=fixed;" vertex="1" parent="1">
          <mxGeometry x="240" y="40" width="80" height="80" as="geometry" />
        </mxCell>
        <mxCell id="9TW_L_tKnXNK0CNASQuZ-3" value="H3&lt;br&gt;.h3-title" style="whiteSpace=wrap;html=1;aspect=fixed;" vertex="1" parent="1">
          <mxGeometry x="360" y="40" width="80" height="80" as="geometry" />
        </mxCell>
        <mxCell id="9TW_L_tKnXNK0CNASQuZ-4" value="H4&lt;br&gt;.h4.title" style="whiteSpace=wrap;html=1;aspect=fixed;" vertex="1" parent="1">
          <mxGeometry x="480" y="40" width="80" height="80" as="geometry" />
        </mxCell>
        <mxCell id="9TW_L_tKnXNK0CNASQuZ-5" value="H5&lt;br&gt;.h5-title" style="whiteSpace=wrap;html=1;aspect=fixed;" vertex="1" parent="1">
          <mxGeometry x="600" y="40" width="80" height="80" as="geometry" />
        </mxCell>
        <mxCell id="9TW_L_tKnXNK0CNASQuZ-11" style="edgeStyle=orthogonalEdgeStyle;rounded=0;orthogonalLoop=1;jettySize=auto;html=1;exitX=0.5;exitY=1;exitDx=0;exitDy=0;" edge="1" parent="1" source="9TW_L_tKnXNK0CNASQuZ-6">
          <mxGeometry relative="1" as="geometry">
            <mxPoint x="239" y="340" as="targetPoint" />
            <Array as="points">
              <mxPoint x="239" y="240" />
            </Array>
          </mxGeometry>
        </mxCell>
        <mxCell id="9TW_L_tKnXNK0CNASQuZ-15" style="edgeStyle=orthogonalEdgeStyle;rounded=0;orthogonalLoop=1;jettySize=auto;html=1;" edge="1" parent="1" source="9TW_L_tKnXNK0CNASQuZ-6">
          <mxGeometry relative="1" as="geometry">
            <mxPoint x="400" y="340" as="targetPoint" />
          </mxGeometry>
        </mxCell>
        <mxCell id="9TW_L_tKnXNK0CNASQuZ-6" value="p.text" style="whiteSpace=wrap;html=1;aspect=fixed;" vertex="1" parent="1">
          <mxGeometry x="200" y="160" width="80" height="80" as="geometry" />
        </mxCell>
        <mxCell id="9TW_L_tKnXNK0CNASQuZ-17" style="edgeStyle=orthogonalEdgeStyle;rounded=0;orthogonalLoop=1;jettySize=auto;html=1;" edge="1" parent="1" source="9TW_L_tKnXNK0CNASQuZ-9">
          <mxGeometry relative="1" as="geometry">
            <mxPoint x="319" y="520" as="targetPoint" />
          </mxGeometry>
        </mxCell>
        <mxCell id="9TW_L_tKnXNK0CNASQuZ-9" value=".heading-primary" style="rounded=0;whiteSpace=wrap;html=1;" vertex="1" parent="1">
          <mxGeometry x="80" y="360" width="240" height="60" as="geometry" />
        </mxCell>
        <mxCell id="9TW_L_tKnXNK0CNASQuZ-18" style="edgeStyle=orthogonalEdgeStyle;rounded=0;orthogonalLoop=1;jettySize=auto;html=1;" edge="1" parent="1" source="9TW_L_tKnXNK0CNASQuZ-12">
          <mxGeometry relative="1" as="geometry">
            <mxPoint x="410" y="520" as="targetPoint" />
          </mxGeometry>
        </mxCell>
        <mxCell id="9TW_L_tKnXNK0CNASQuZ-12" value=".heading-primary" style="rounded=0;whiteSpace=wrap;html=1;" vertex="1" parent="1">
          <mxGeometry x="360" y="360" width="240" height="60" as="geometry" />
        </mxCell>
        <mxCell id="9TW_L_tKnXNK0CNASQuZ-16" value="PAGE" style="rounded=0;whiteSpace=wrap;html=1;" vertex="1" parent="1">
          <mxGeometry x="200" y="530" width="400" height="180" as="geometry" />
        </mxCell>
      </root>
    </mxGraphModel>
  </diagram>
</mxfile>
