{
	"name": "Kimbie Dark qaptoR",
	// "type": "dark",
	"colors": {

    //  Kimbie Dark Fixed + qaptoR updates
        "editor.background": "#221a0f",
		"editor.foldBackground": "#251d18",
		"editor.foreground": "#d3af86",
		"editor.lineHighlightBackground": "#291f12",
		"editor.selectionBackground": "#644c2c",
		"editorBracketHighlight.foreground1": "#d59a32",
		"editorBracketHighlight.foreground2": "#f77c2c",
		"editorBracketHighlight.foreground3": "#bd4e26",
		"editorBracketMatch.background": "#55327c",
		"editorBracketMatch.border": "#ff000000",
		"editorCursor.foreground": "#d3af86",
		"editorWhitespace.foreground": "#664d2f",

    //  Kimbie Dark
		"activityBar.background": "#221a0f",
		"activityBar.foreground": "#d3af86",
		"badge.background": "#7f5d38",
		"button.background": "#6e583b",
		"dropdown.background": "#51412c",
		"editorGroupHeader.tabsBackground": "#131510",
		"editorHoverWidget.background": "#221a14",
		"editorLineNumber.activeForeground": "#adadad",
		"editorWidget.background": "#131510",
		"focusBorder": "#a57a4c",
		"input.background": "#51412c",
		"inputOption.activeBorder": "#a57a4c",
		"inputValidation.errorBackground": "#5f0d0d",
		"inputValidation.errorBorder": "#9d2f23",
		"inputValidation.infoBackground": "#2b2a42",
		"inputValidation.infoBorder": "#1b60a5",
		"inputValidation.warningBackground": "#51412c",
		"list.activeSelectionBackground": "#7c5021",
		"list.highlightForeground": "#e3b583",
		"list.hoverBackground": "#7c502166",
		"list.inactiveSelectionBackground": "#645342",
		"menu.background": "#362712",
		"menu.foreground": "#cccccc",
		"minimap.selectionHighlight": "#84613daa",
		"peekView.border": "#5e452b",
		"peekViewEditor.background": "#221a14",
		"peekViewEditor.matchHighlightBackground": "#84613daa",
		"peekViewResult.background": "#362712",
		"peekViewTitle.background": "#362712",
		"pickerGroup.border": "#e3b583",
		"pickerGroup.foreground": "#e3b583",
		"ports.iconRunningProcessForeground": "#369432",
		"progressBar.background": "#7f5d38",
		"quickInputList.focusBackground": "#7c5021aa",
		"selection.background": "#84613daa",
		"sideBar.background": "#362712",
		"statusBar.background": "#423523",
		"statusBar.debuggingBackground": "#423523",
		"statusBar.noFolderBackground": "#423523",
		"statusBarItem.remoteBackground": "#6e583b",
		"tab.inactiveBackground": "#131510",
		"tab.lastPinnedBorder": "#51412c",
		"titleBar.activeBackground": "#423523",
		//"activityBar.activeBorder": "#d3af86",
		//"activityBar.dropBorder": "#d3af86",
		//"activityBar.inactiveForeground": "#d3af8666",
		//"activityBarBadge.background": "#007acc",
		//"activityBarBadge.foreground": "#ffffff",
		//"badge.foreground": "#ffffff",
		//"banner.background": "#7c5021",
		//"banner.foreground": "#ffffff",
		//"banner.iconForeground": "#3794ff",
		//"breadcrumb.activeSelectionForeground": "#e0e0e0",
		//"breadcrumb.background": "#221a0f",
		//"breadcrumb.focusForeground": "#e0e0e0",
		//"breadcrumb.foreground": "#cccccccc",
		//"breadcrumbPicker.background": "#131510",
		//"button.foreground": "#ffffff",
		//"button.hoverBackground": "#846947",
		//"button.secondaryBackground": "#3a3d41",
		//"button.secondaryForeground": "#ffffff",
		//"button.secondaryHoverBackground": "#45494e",
		//"charts.blue": "#3794ff",
		//"charts.foreground": "#cccccc",
		//"charts.green": "#89d185",
		//"charts.lines": "#cccccc80",
		//"charts.orange": "#d18616",
		//"charts.purple": "#b180d7",
		//"charts.red": "#f14c4c",
		//"charts.yellow": "#cca700",
		//"checkbox.background": "#51412c",
		//"checkbox.border": "#51412c",
		//"checkbox.foreground": "#f0f0f0",
		//"debugConsole.errorForeground": "#f48771",
		//"debugConsole.infoForeground": "#3794ff",
		//"debugConsole.sourceForeground": "#cccccc",
		//"debugConsole.warningForeground": "#cca700",
		//"debugConsoleInputIcon.foreground": "#cccccc",
		//"debugExceptionWidget.background": "#420b0d",
		//"debugExceptionWidget.border": "#a31515",
		//"debugIcon.breakpointCurrentStackframeForeground": "#ffcc00",
		//"debugIcon.breakpointDisabledForeground": "#848484",
		//"debugIcon.breakpointForeground": "#e51400",
		//"debugIcon.breakpointStackframeForeground": "#89d185",
		//"debugIcon.breakpointUnverifiedForeground": "#848484",
		//"debugIcon.continueForeground": "#75beff",
		//"debugIcon.disconnectForeground": "#f48771",
		//"debugIcon.pauseForeground": "#75beff",
		//"debugIcon.restartForeground": "#89d185",
		//"debugIcon.startForeground": "#89d185",
		//"debugIcon.stepBackForeground": "#75beff",
		//"debugIcon.stepIntoForeground": "#75beff",
		//"debugIcon.stepOutForeground": "#75beff",
		//"debugIcon.stepOverForeground": "#75beff",
		//"debugIcon.stopForeground": "#f48771",
		//"debugTokenExpression.boolean": "#4e94ce",
		//"debugTokenExpression.error": "#f48771",
		//"debugTokenExpression.name": "#c586c0",
		//"debugTokenExpression.number": "#b5cea8",
		//"debugTokenExpression.string": "#ce9178",
		//"debugTokenExpression.value": "#cccccc99",
		//"debugToolBar.background": "#333333",
		//"debugView.exceptionLabelBackground": "#6c2022",
		//"debugView.exceptionLabelForeground": "#cccccc",
		//"debugView.stateLabelBackground": "#88888844",
		//"debugView.stateLabelForeground": "#cccccc",
		//"debugView.valueChangedHighlight": "#569cd6",
		//"descriptionForeground": "#ccccccb3",
		//"diffEditor.diagonalFill": "#cccccc33",
		//"diffEditor.insertedTextBackground": "#9bb95533",
		//"diffEditor.removedTextBackground": "#ff000033",
		//"disabledForeground": "#cccccc80",
		//"dropdown.border": "#51412c",
		//"dropdown.foreground": "#f0f0f0",
		//"editor.findMatchBackground": "#515c6a",
		//"editor.findMatchHighlightBackground": "#ea5c0055",
		//"editor.findRangeHighlightBackground": "#3a3d4166",
		//"editor.focusedStackFrameHighlightBackground": "#7abd7a4d",
		//"editor.hoverHighlightBackground": "#264f7840",
		//"editor.inactiveSelectionBackground": "#84613d55",
		//"editor.inlineValuesBackground": "#ffc80033",
		//"editor.inlineValuesForeground": "#ffffff80",
		//"editor.lineHighlightBorder": "#282828",
		//"editor.linkedEditingBackground": "#ff00004d",
		//"editor.rangeHighlightBackground": "#ffffff0b",
		//"editor.selectionHighlightBackground": "#60462c66",
		//"editor.snippetFinalTabstopHighlightBorder": "#525252",
		//"editor.snippetTabstopHighlightBackground": "#7c7c7c4d",
		//"editor.stackFrameHighlightBackground": "#ffff0033",
		//"editor.symbolHighlightBackground": "#ea5c0055",
		//"editor.wordHighlightBackground": "#575757b8",
		//"editor.wordHighlightStrongBackground": "#004972b8",
		//"editorActiveLineNumber.foreground": "#c6c6c6",
		//"editorBracketHighlight.foreground4": "#00000000",
		//"editorBracketHighlight.foreground5": "#00000000",
		//"editorBracketHighlight.foreground6": "#00000000",
		//"editorBracketHighlight.unexpectedBracket.foreground": "#ff1212cc",
		//"editorBracketPairGuide.activeBackground1": "#00000000",
		//"editorBracketPairGuide.activeBackground2": "#00000000",
		//"editorBracketPairGuide.activeBackground3": "#00000000",
		//"editorBracketPairGuide.activeBackground4": "#00000000",
		//"editorBracketPairGuide.activeBackground5": "#00000000",
		//"editorBracketPairGuide.activeBackground6": "#00000000",
		//"editorBracketPairGuide.background1": "#00000000",
		//"editorBracketPairGuide.background2": "#00000000",
		//"editorBracketPairGuide.background3": "#00000000",
		//"editorBracketPairGuide.background4": "#00000000",
		//"editorBracketPairGuide.background5": "#00000000",
		//"editorBracketPairGuide.background6": "#00000000",
		//"editorCodeLens.foreground": "#999999",
		//"editorCommentsWidget.rangeActiveBackground": "#5e452b1a",
		//"editorCommentsWidget.rangeActiveBorder": "#5e452b66",
		//"editorCommentsWidget.rangeBackground": "#5e452b1a",
		//"editorCommentsWidget.rangeBorder": "#5e452b66",
		//"editorCommentsWidget.resolvedBorder": "#cccccc80",
		//"editorCommentsWidget.unresolvedBorder": "#5e452b",
		//"editorError.foreground": "#f14c4c",
		//"editorGhostText.foreground": "#ffffff56",
		//"editorGroup.border": "#444444",
		//"editorGroup.dropBackground": "#53595d80",
		//"editorGroup.dropIntoPromptBackground": "#131510",
		//"editorGroup.dropIntoPromptForeground": "#cccccc",
		//"editorGroupHeader.noTabsBackground": "#221a0f",
		//"editorGutter.addedBackground": "#487e02",
		//"editorGutter.background": "#221a0f",
		//"editorGutter.commentRangeForeground": "#c5c5c5",
		//"editorGutter.deletedBackground": "#f14c4c",
		//"editorGutter.foldingControlForeground": "#c5c5c5",
		//"editorGutter.modifiedBackground": "#1b81a8",
		//"editorHint.foreground": "#eeeeeeb3",
		//"editorHoverWidget.border": "#454545",
		//"editorHoverWidget.foreground": "#cccccc",
		//"editorHoverWidget.highlightForeground": "#e3b583",
		//"editorHoverWidget.statusBarBackground": "#291f18",
		//"editorIndentGuide.activeBackground": "#a57a4c",
		//"editorIndentGuide.background": "#a57a4c",
		//"editorInfo.foreground": "#3794ff",
		//"editorInlayHint.background": "#7f5d3899",
		//"editorInlayHint.foreground": "#ffffffcc",
		//"editorInlayHint.parameterBackground": "#7f5d3899",
		//"editorInlayHint.parameterForeground": "#ffffffcc",
		//"editorInlayHint.typeBackground": "#7f5d3899",
		//"editorInlayHint.typeForeground": "#ffffffcc",
		//"editorLightBulb.foreground": "#ffcc00",
		//"editorLightBulbAutoFix.foreground": "#75beff",
		//"editorLineNumber.foreground": "#858585",
		//"editorLink.activeForeground": "#4e94ce",
		//"editorMarkerNavigation.background": "#221a0f",
		//"editorMarkerNavigationError.background": "#f14c4c",
		//"editorMarkerNavigationError.headerBackground": "#f14c4c1a",
		//"editorMarkerNavigationInfo.background": "#3794ff",
		//"editorMarkerNavigationInfo.headerBackground": "#3794ff1a",
		//"editorMarkerNavigationWarning.background": "#cca700",
		//"editorMarkerNavigationWarning.headerBackground": "#cca7001a",
		//"editorOverviewRuler.addedForeground": "#487e0299",
		//"editorOverviewRuler.border": "#7f7f7f4d",
		//"editorOverviewRuler.bracketMatchForeground": "#a0a0a0",
		//"editorOverviewRuler.commonContentForeground": "#60606066",
		//"editorOverviewRuler.currentContentForeground": "#40c8ae80",
		//"editorOverviewRuler.deletedForeground": "#f14c4c99",
		//"editorOverviewRuler.errorForeground": "#ff1212b3",
		//"editorOverviewRuler.findMatchForeground": "#d186167e",
		//"editorOverviewRuler.incomingContentForeground": "#40a6ff80",
		//"editorOverviewRuler.infoForeground": "#3794ff",
		//"editorOverviewRuler.modifiedForeground": "#1b81a899",
		//"editorOverviewRuler.rangeHighlightForeground": "#007acc99",
		//"editorOverviewRuler.selectionHighlightForeground": "#a0a0a0cc",
		//"editorOverviewRuler.warningForeground": "#cca700",
		//"editorOverviewRuler.wordHighlightForeground": "#a0a0a0cc",
		//"editorOverviewRuler.wordHighlightStrongForeground": "#c0a0c0cc",
		//"editorPane.background": "#221a0f",
		//"editorRuler.foreground": "#5a5a5a",
		//"editorSuggestWidget.background": "#131510",
		//"editorSuggestWidget.border": "#454545",
		//"editorSuggestWidget.focusHighlightForeground": "#e3b583",
		//"editorSuggestWidget.foreground": "#d3af86",
		//"editorSuggestWidget.highlightForeground": "#e3b583",
		//"editorSuggestWidget.selectedBackground": "#7c5021aa",
		//"editorSuggestWidget.selectedForeground": "#ffffff",
		//"editorSuggestWidgetStatus.foreground": "#d3af8680",
		//"editorUnicodeHighlight.background": "#bd9b0326",
		//"editorUnicodeHighlight.border": "#bd9b03",
		//"editorUnnecessaryCode.opacity": "#000000aa",
		//"editorWarning.foreground": "#cca700",
		//"editorWidget.border": "#454545",
		//"editorWidget.foreground": "#cccccc",
		//"errorForeground": "#f48771",
		//"extensionBadge.remoteBackground": "#007acc",
		//"extensionBadge.remoteForeground": "#ffffff",
		//"extensionButton.prominentBackground": "#6e583b",
		//"extensionButton.prominentForeground": "#ffffff",
		//"extensionButton.prominentHoverBackground": "#846947",
		//"extensionIcon.preReleaseForeground": "#1d9271",
		//"extensionIcon.starForeground": "#ff8e00",
		//"extensionIcon.verifiedForeground": "#3794ff",
		//"foreground": "#cccccc",
		//"gitDecoration.addedResourceForeground": "#81b88b",
		//"gitDecoration.conflictingResourceForeground": "#e4676b",
		//"gitDecoration.deletedResourceForeground": "#c74e39",
		//"gitDecoration.ignoredResourceForeground": "#8c8c8c",
		//"gitDecoration.modifiedResourceForeground": "#e2c08d",
		//"gitDecoration.renamedResourceForeground": "#73c991",
		//"gitDecoration.stageDeletedResourceForeground": "#c74e39",
		//"gitDecoration.stageModifiedResourceForeground": "#e2c08d",
		//"gitDecoration.submoduleResourceForeground": "#8db9e2",
		//"gitDecoration.untrackedResourceForeground": "#73c991",
		//"icon.foreground": "#c5c5c5",
		//"input.foreground": "#cccccc",
		//"input.placeholderForeground": "#cccccc80",
		//"inputOption.activeBackground": "#a57a4c66",
		//"inputOption.activeForeground": "#ffffff",
		//"inputOption.hoverBackground": "#5a5d5e80",
		//"inputValidation.warningBorder": "#b89500",
		//"interactive.activeCodeBorder": "#5e452b",
		//"interactive.inactiveCodeBorder": "#645342",
		//"issues.closed": "#cb2431",
		//"issues.newIssueDecoration": "#ffffff48",
		//"issues.open": "#22863a",
		//"keybindingLabel.background": "#8080802b",
		//"keybindingLabel.border": "#33333399",
		//"keybindingLabel.bottomBorder": "#44444499",
		//"keybindingLabel.foreground": "#cccccc",
		//"keybindingTable.headerBackground": "#cccccc0a",
		//"keybindingTable.rowsBackground": "#cccccc0a",
		//"list.activeSelectionForeground": "#ffffff",
		//"list.deemphasizedForeground": "#8c8c8c",
		//"list.dropBackground": "#062f4a",
		//"list.errorForeground": "#f88070",
		//"list.filterMatchBackground": "#ea5c0055",
		//"list.focusHighlightForeground": "#e3b583",
		//"list.focusOutline": "#a57a4c",
		//"list.invalidItemForeground": "#b89500",
		//"list.warningForeground": "#cca700",
		//"listFilterWidget.background": "#653723",
		//"listFilterWidget.noMatchesOutline": "#be1100",
		//"listFilterWidget.outline": "#00000000",
		//"menu.selectionBackground": "#7c5021",
		//"menu.selectionForeground": "#ffffff",
		//"menu.separatorBackground": "#bbbbbb",
		//"menubar.selectionBackground": "#ffffff1a",
		//"menubar.selectionForeground": "#cccccc",
		//"merge.commonContentBackground": "#60606029",
		//"merge.commonHeaderBackground": "#60606066",
		//"merge.currentContentBackground": "#40c8ae33",
		//"merge.currentHeaderBackground": "#40c8ae80",
		//"merge.incomingContentBackground": "#40a6ff33",
		//"merge.incomingHeaderBackground": "#40a6ff80",
		//"minimap.errorHighlight": "#ff1212b3",
		//"minimap.findMatchHighlight": "#d18616",
		//"minimap.foregroundOpacity": "#000000",
		//"minimap.selectionOccurrenceHighlight": "#676767",
		//"minimap.warningHighlight": "#cca700",
		//"minimapGutter.addedBackground": "#487e02",
		//"minimapGutter.deletedBackground": "#f14c4c",
		//"minimapGutter.modifiedBackground": "#1b81a8",
		//"minimapSlider.activeBackground": "#bfbfbf33",
		//"minimapSlider.background": "#79797933",
		//"minimapSlider.hoverBackground": "#64646459",
		//"notebook.cellBorderColor": "#645342",
		//"notebook.cellEditorBackground": "#362712",
		//"notebook.cellInsertionIndicator": "#a57a4c",
		//"notebook.cellStatusBarItemHoverBackground": "#ffffff26",
		//"notebook.cellToolbarSeparator": "#80808059",
		//"notebook.focusedCellBorder": "#a57a4c",
		//"notebook.focusedEditorBorder": "#a57a4c",
		//"notebook.inactiveFocusedCellBorder": "#645342",
		//"notebook.selectedCellBackground": "#645342",
		//"notebook.selectedCellBorder": "#645342",
		//"notebook.symbolHighlightBackground": "#ffffff0b",
		//"notebookScrollbarSlider.activeBackground": "#bfbfbf66",
		//"notebookScrollbarSlider.background": "#79797966",
		//"notebookScrollbarSlider.hoverBackground": "#646464b3",
		//"notebookStatusErrorIcon.foreground": "#f48771",
		//"notebookStatusRunningIcon.foreground": "#cccccc",
		//"notebookStatusSuccessIcon.foreground": "#89d185",
		//"notificationCenterHeader.background": "#191b15",
		//"notificationLink.foreground": "#3794ff",
		//"notifications.background": "#131510",
		//"notifications.border": "#191b15",
		//"notifications.foreground": "#cccccc",
		//"notificationsErrorIcon.foreground": "#f14c4c",
		//"notificationsInfoIcon.foreground": "#3794ff",
		//"notificationsWarningIcon.foreground": "#cca700",
		//"panel.background": "#221a0f",
		//"panel.border": "#80808059",
		//"panel.dropBorder": "#e7e7e7",
		//"panelSection.border": "#80808059",
		//"panelSection.dropBackground": "#53595d80",
		//"panelSectionHeader.background": "#80808033",
		//"panelTitle.activeBorder": "#e7e7e7",
		//"panelTitle.activeForeground": "#e7e7e7",
		//"panelTitle.inactiveForeground": "#e7e7e799",
		//"peekViewEditorGutter.background": "#221a14",
		//"peekViewResult.fileForeground": "#ffffff",
		//"peekViewResult.lineForeground": "#bbbbbb",
		//"peekViewResult.matchHighlightBackground": "#ea5c004d",
		//"peekViewResult.selectionBackground": "#3399ff33",
		//"peekViewResult.selectionForeground": "#ffffff",
		//"peekViewTitleDescription.foreground": "#ccccccb3",
		//"peekViewTitleLabel.foreground": "#ffffff",
		//"problemsErrorIcon.foreground": "#f14c4c",
		//"problemsInfoIcon.foreground": "#3794ff",
		//"problemsWarningIcon.foreground": "#cca700",
		//"quickInput.background": "#131510",
		//"quickInput.foreground": "#cccccc",
		//"quickInputList.focusForeground": "#ffffff",
		//"quickInputTitle.background": "#ffffff1b",
		//"sash.hoverBorder": "#a57a4c",
		//"scm.providerBorder": "#454545",
		//"scrollbar.shadow": "#000000",
		//"scrollbarSlider.activeBackground": "#bfbfbf66",
		//"scrollbarSlider.background": "#79797966",
		//"scrollbarSlider.hoverBackground": "#646464b3",
		//"searchEditor.findMatchBackground": "#ea5c0038",
		//"settings.checkboxBackground": "#51412c",
		//"settings.checkboxBorder": "#51412c",
		//"settings.checkboxForeground": "#f0f0f0",
		//"settings.dropdownBackground": "#51412c",
		//"settings.dropdownBorder": "#51412c",
		//"settings.dropdownForeground": "#f0f0f0",
		//"settings.dropdownListBorder": "#454545",
		//"settings.focusedRowBackground": "#7c50213d",
		//"settings.focusedRowBorder": "#ffffff1f",
		//"settings.headerBorder": "#80808059",
		//"settings.headerForeground": "#e7e7e7",
		//"settings.modifiedItemIndicator": "#0c7d9d",
		//"settings.numberInputBackground": "#51412c",
		//"settings.numberInputForeground": "#cccccc",
		//"settings.rowHoverBackground": "#7c50211f",
		//"settings.sashBorder": "#80808059",
		//"settings.textInputBackground": "#51412c",
		//"settings.textInputForeground": "#cccccc",
		//"sideBar.dropBackground": "#53595d80",
		//"sideBarSectionHeader.background": "#80808033",
		//"sideBySideEditor.horizontalBorder": "#444444",
		//"sideBySideEditor.verticalBorder": "#444444",
		//"statusBar.debuggingForeground": "#ffffff",
		//"statusBar.focusBorder": "#ffffff",
		//"statusBar.foreground": "#ffffff",
		//"statusBar.noFolderForeground": "#ffffff",
		//"statusBarItem.activeBackground": "#ffffff2e",
		//"statusBarItem.compactHoverBackground": "#ffffff33",
		//"statusBarItem.errorBackground": "#c72e0f",
		//"statusBarItem.errorForeground": "#ffffff",
		//"statusBarItem.focusBorder": "#ffffff",
		//"statusBarItem.hoverBackground": "#ffffff1f",
		//"statusBarItem.prominentBackground": "#00000080",
		//"statusBarItem.prominentForeground": "#ffffff",
		//"statusBarItem.prominentHoverBackground": "#0000004d",
		//"statusBarItem.remoteForeground": "#ffffff",
		//"statusBarItem.warningBackground": "#7a6400",
		//"statusBarItem.warningForeground": "#ffffff",
		//"symbolIcon.arrayForeground": "#cccccc",
		//"symbolIcon.booleanForeground": "#cccccc",
		//"symbolIcon.classForeground": "#ee9d28",
		//"symbolIcon.colorForeground": "#cccccc",
		//"symbolIcon.constantForeground": "#cccccc",
		//"symbolIcon.constructorForeground": "#b180d7",
		//"symbolIcon.enumeratorForeground": "#ee9d28",
		//"symbolIcon.enumeratorMemberForeground": "#75beff",
		//"symbolIcon.eventForeground": "#ee9d28",
		//"symbolIcon.fieldForeground": "#75beff",
		//"symbolIcon.fileForeground": "#cccccc",
		//"symbolIcon.folderForeground": "#cccccc",
		//"symbolIcon.functionForeground": "#b180d7",
		//"symbolIcon.interfaceForeground": "#75beff",
		//"symbolIcon.keyForeground": "#cccccc",
		//"symbolIcon.keywordForeground": "#cccccc",
		//"symbolIcon.methodForeground": "#b180d7",
		//"symbolIcon.moduleForeground": "#cccccc",
		//"symbolIcon.namespaceForeground": "#cccccc",
		//"symbolIcon.nullForeground": "#cccccc",
		//"symbolIcon.numberForeground": "#cccccc",
		//"symbolIcon.objectForeground": "#cccccc",
		//"symbolIcon.operatorForeground": "#cccccc",
		//"symbolIcon.packageForeground": "#cccccc",
		//"symbolIcon.propertyForeground": "#cccccc",
		//"symbolIcon.referenceForeground": "#cccccc",
		//"symbolIcon.snippetForeground": "#cccccc",
		//"symbolIcon.stringForeground": "#cccccc",
		//"symbolIcon.structForeground": "#cccccc",
		//"symbolIcon.textForeground": "#cccccc",
		//"symbolIcon.typeParameterForeground": "#cccccc",
		//"symbolIcon.unitForeground": "#cccccc",
		//"symbolIcon.variableForeground": "#75beff",
		//"tab.activeBackground": "#221a0f",
		//"tab.activeForeground": "#ffffff",
		//"tab.activeModifiedBorder": "#3399cc",
		//"tab.border": "#252526",
		//"tab.inactiveForeground": "#ffffff80",
		//"tab.inactiveModifiedBorder": "#3399cc80",
		//"tab.unfocusedActiveBackground": "#221a0f",
		//"tab.unfocusedActiveForeground": "#ffffff80",
		//"tab.unfocusedActiveModifiedBorder": "#3399cc80",
		//"tab.unfocusedInactiveBackground": "#131510",
		//"tab.unfocusedInactiveForeground": "#ffffff40",
		//"tab.unfocusedInactiveModifiedBorder": "#3399cc40",
		//"terminal.ansiBlack": "#000000",
		//"terminal.ansiBlue": "#2472c8",
		//"terminal.ansiBrightBlack": "#666666",
		//"terminal.ansiBrightBlue": "#3b8eea",
		//"terminal.ansiBrightCyan": "#29b8db",
		//"terminal.ansiBrightGreen": "#23d18b",
		//"terminal.ansiBrightMagenta": "#d670d6",
		//"terminal.ansiBrightRed": "#f14c4c",
		//"terminal.ansiBrightWhite": "#e5e5e5",
		//"terminal.ansiBrightYellow": "#f5f543",
		//"terminal.ansiCyan": "#11a8cd",
		//"terminal.ansiGreen": "#0dbc79",
		//"terminal.ansiMagenta": "#bc3fbc",
		//"terminal.ansiRed": "#cd3131",
		//"terminal.ansiWhite": "#e5e5e5",
		//"terminal.ansiYellow": "#e5e510",
		//"terminal.border": "#80808059",
		//"terminal.dropBackground": "#53595d80",
		//"terminal.findMatchBorder": "#515c6a",
		//"terminal.findMatchHighlightBorder": "#ea5c0055",
		//"terminal.foreground": "#cccccc",
		//"terminal.selectionBackground": "#ffffff40",
		//"terminalCommandDecoration.defaultBackground": "#ffffff40",
		//"terminalCommandDecoration.errorBackground": "#f14c4c",
		//"terminalCommandDecoration.successBackground": "#1b81a8",
		//"terminalOverviewRuler.cursorForeground": "#a0a0a0cc",
		//"terminalOverviewRuler.findMatchForeground": "#d186167e",
		//"testing.iconErrored": "#f14c4c",
		//"testing.iconFailed": "#f14c4c",
		//"testing.iconPassed": "#73c991",
		//"testing.iconQueued": "#cca700",
		//"testing.iconSkipped": "#848484",
		//"testing.iconUnset": "#848484",
		//"testing.message.error.decorationForeground": "#f14c4c",
		//"testing.message.error.lineBackground": "#ff000033",
		//"testing.message.info.decorationForeground": "#d3af8680",
		//"testing.peekBorder": "#f14c4c",
		//"testing.peekHeaderBackground": "#f14c4c1a",
		//"testing.runAction": "#73c991",
		//"textBlockQuote.background": "#7f7f7f1a",
		//"textBlockQuote.border": "#007acc80",
		//"textCodeBlock.background": "#0a0a0a66",
		//"textLink.activeForeground": "#3794ff",
		//"textLink.foreground": "#3794ff",
		//"textPreformat.foreground": "#d7ba7d",
		//"textSeparator.foreground": "#ffffff2e",
		//"titleBar.activeForeground": "#cccccc",
		//"titleBar.inactiveBackground": "#42352399",
		//"titleBar.inactiveForeground": "#cccccc99",
		//"toolbar.activeBackground": "#63666750",
		//"toolbar.hoverBackground": "#5a5d5e50",
		//"tree.indentGuidesStroke": "#585858",
		//"tree.tableColumnsBorder": "#cccccc20",
		//"tree.tableOddRowsBackground": "#cccccc0a",
		//"welcomePage.progress.background": "#51412c",
		//"welcomePage.progress.foreground": "#3794ff",
		//"welcomePage.tileBackground": "#131510",
		//"welcomePage.tileHoverBackground": "#171913",
		//"welcomePage.tileShadow": "#0000005c",
		//"widget.shadow": "#0000005c",
		//"activityBar.activeBackground": null,
		//"activityBar.activeFocusBorder": null,
		//"activityBar.border": null,
		//"button.border": null,
		//"contrastActiveBorder": null,
		//"contrastBorder": null,
		//"debugToolBar.border": null,
		//"diffEditor.border": null,
		//"diffEditor.insertedLineBackground": null,
		//"diffEditor.insertedTextBorder": null,
		//"diffEditor.removedLineBackground": null,
		//"diffEditor.removedTextBorder": null,
		//"diffEditorGutter.insertedLineBackground": null,
		//"diffEditorGutter.removedLineBackground": null,
		//"diffEditorOverview.insertedForeground": null,
		//"diffEditorOverview.removedForeground": null,
		//"dropdown.listBackground": null,
		//"editor.findMatchBorder": null,
		//"editor.findMatchHighlightBorder": null,
		//"editor.findRangeHighlightBorder": null,
		//"editor.rangeHighlightBorder": null,
		//"editor.selectionForeground": null,
		//"editor.selectionHighlightBorder": null,
		//"editor.snippetFinalTabstopHighlightBackground": null,
		//"editor.snippetTabstopHighlightBorder": null,
		//"editor.symbolHighlightBorder": null,
		//"editor.wordHighlightBorder": null,
		//"editor.wordHighlightStrongBorder": null,
		//"editorCursor.background": null,
		//"editorError.background": null,
		//"editorError.border": null,
		//"editorGhostText.background": null,
		//"editorGhostText.border": null,
		//"editorGroup.dropIntoPromptBorder": null,
		//"editorGroup.emptyBackground": null,
		//"editorGroup.focusedEmptyBorder": null,
		//"editorGroupHeader.border": null,
		//"editorGroupHeader.tabsBorder": null,
		//"editorHint.border": null,
		//"editorInfo.background": null,
		//"editorInfo.border": null,
		//"editorOverviewRuler.background": null,
		//"editorSuggestWidget.selectedIconForeground": null,
		//"editorUnnecessaryCode.border": null,
		//"editorWarning.background": null,
		//"editorWarning.border": null,
		//"editorWidget.resizeBorder": null,
		//"input.border": null,
		//"inputValidation.errorForeground": null,
		//"inputValidation.infoForeground": null,
		//"inputValidation.warningForeground": null,
		//"list.activeSelectionIconForeground": null,
		//"list.filterMatchBorder": null,
		//"list.focusBackground": null,
		//"list.focusForeground": null,
		//"list.hoverForeground": null,
		//"list.inactiveFocusBackground": null,
		//"list.inactiveFocusOutline": null,
		//"list.inactiveSelectionForeground": null,
		//"list.inactiveSelectionIconForeground": null,
		//"menu.border": null,
		//"menu.selectionBorder": null,
		//"menubar.selectionBorder": null,
		//"merge.border": null,
		//"minimap.background": null,
		//"notebook.cellHoverBackground": null,
		//"notebook.focusedCellBackground": null,
		//"notebook.inactiveSelectedCellBorder": null,
		//"notebook.outputContainerBackgroundColor": null,
		//"notebook.outputContainerBorderColor": null,
		//"notificationCenter.border": null,
		//"notificationCenterHeader.foreground": null,
		//"notificationToast.border": null,
		//"panelInput.border": null,
		//"panelSectionHeader.border": null,
		//"panelSectionHeader.foreground": null,
		//"peekViewEditor.matchHighlightBorder": null,
		//"quickInput.list.focusBackground": null,
		//"quickInputList.focusIconForeground": null,
		//"searchEditor.findMatchBorder": null,
		//"searchEditor.textInputBorder": null,
		//"settings.numberInputBorder": null,
		//"settings.textInputBorder": null,
		//"sideBar.border": null,
		//"sideBar.foreground": null,
		//"sideBarSectionHeader.border": null,
		//"sideBarSectionHeader.foreground": null,
		//"sideBarTitle.foreground": null,
		//"statusBar.border": null,
		//"statusBar.debuggingBorder": null,
		//"statusBar.noFolderBorder": null,
		//"tab.activeBorder": null,
		//"tab.activeBorderTop": null,
		//"tab.hoverBackground": null,
		//"tab.hoverBorder": null,
		//"tab.hoverForeground": null,
		//"tab.unfocusedActiveBorder": null,
		//"tab.unfocusedActiveBorderTop": null,
		//"tab.unfocusedHoverBackground": null,
		//"tab.unfocusedHoverBorder": null,
		//"tab.unfocusedHoverForeground": null,
		//"terminal.background": null,
		//"terminal.findMatchBackground": null,
		//"terminal.findMatchHighlightBackground": null,
		//"terminal.tab.activeBorder": null,
		//"terminalCursor.background": null,
		//"terminalCursor.foreground": null,
		//"testing.message.info.lineBackground": null,
		//"titleBar.border": null,
		//"toolbar.hoverOutline": null,
		//"walkThrough.embeddedEditorBackground": null,
		//"welcomePage.background": null,
		//"window.activeBorder": null,
		//"window.inactiveBorder": null
	},
	"tokenColors": [
		{
			"scope": "variable.parameter.function",
			"settings": {
				"foreground": "#D3AF86"
			}
		},
		{
			"scope": "comment, punctuation.definition.comment",
			"settings": {
				"foreground": "#A57A4C"
			}
		},
		{
			"scope": "punctuation.definition.string, punctuation.definition.variable, punctuation.definition.string, punctuation.definition.parameters, punctuation.definition.string, punctuation.definition.array",
			"settings": {
				"foreground": "#D3AF86"
			}
		},
		{
			"scope": "none",
			"settings": {
				"foreground": "#D3AF86"
			}
		},
		{
			"scope": "keyword.operator",
			"settings": {
				"foreground": "#D3AF86"
			}
		},
		{
			"scope": "keyword, keyword.control",
			"settings": {
				"foreground": "#98676A"
			}
		},
		{
			"scope": "variable",
			"settings": {
				"foreground": "#DC3958"
			}
		},
		{
			"scope": "entity.name.function, meta.require, support.function.any-method",
			"settings": {
				"foreground": "#8AB1B0"
			}
		},
		{
			"scope": "meta.class, support.class, entity.name.class, entity.name.type.class",
			"settings": {
				"foreground": "#F06431"
			}
		},
		{
			"scope": "keyword.other.special-method",
			"settings": {
				"foreground": "#8AB1B0"
			}
		},
		{
			"scope": "storage",
			"settings": {
				"foreground": "#98676A"
			}
		},
		{
			"scope": "support.function",
			"settings": {
				"foreground": "#7E602C"
			}
		},
		{
			"scope": "string, constant.other.symbol, entity.other.inherited-class",
			"settings": {
				"foreground": "#889B4A"
			}
		},
		{
			"scope": "constant.numeric",
			"settings": {
				"foreground": "#F79A32"
			}
		},
		{
			"scope": "none",
			"settings": {
				"foreground": "#F79A32"
			}
		},
		{
			"scope": "none",
			"settings": {
				"foreground": "#F79A32"
			}
		},
		{
			"scope": "constant",
			"settings": {
				"foreground": "#F79A32"
			}
		},
		{
			"scope": "entity.name.tag",
			"settings": {
				"foreground": "#DC3958"
			}
		},
		{
			"scope": "entity.other.attribute-name",
			"settings": {
				"foreground": "#F79A32"
			}
		},
		{
			"scope": "entity.other.attribute-name.id, punctuation.definition.entity",
			"settings": {
				"foreground": "#8AB1B0"
			}
		},
		{
			"scope": "meta.selector",
			"settings": {
				"foreground": "#98676A"
			}
		},
		{
			"scope": "none",
			"settings": {
				"foreground": "#F79A32"
			}
		},
		{
			"scope": "markup.heading punctuation.definition.heading, entity.name.section",
			"settings": {
				"foreground": "#8AB1B0",
				"fontStyle": ""
			}
		},
		{
			"scope": "keyword.other.unit",
			"settings": {
				"foreground": "#F79A32"
			}
		},
		{
			"scope": "markup.bold, punctuation.definition.bold",
			"settings": {
				"foreground": "#F06431",
				"fontStyle": "bold"
			}
		},
		{
			"scope": "markup.italic, punctuation.definition.italic",
			"settings": {
				"foreground": "#98676A",
				"fontStyle": "italic"
			}
		},
		{
			"scope": "markup.raw.inline",
			"settings": {
				"foreground": "#889B4A"
			}
		},
		{
			"scope": "string.other.link",
			"settings": {
				"foreground": "#DC3958"
			}
		},
		{
			"scope": "meta.link",
			"settings": {
				"foreground": "#F79A32"
			}
		},
		{
			"scope": "markup.list",
			"settings": {
				"foreground": "#DC3958"
			}
		},
		{
			"scope": "markup.quote",
			"settings": {
				"foreground": "#F79A32"
			}
		},
		{
			"scope": "meta.separator",
			"settings": {
				"foreground": "#D3AF86",
				// "background": "#84613D"
			}
		},
		{
			"scope": "markup.inserted",
			"settings": {
				"foreground": "#889B4A"
			}
		},
		{
			"scope": "markup.deleted",
			"settings": {
				"foreground": "#DC3958"
			}
		},
		{
			"scope": "markup.changed",
			"settings": {
				"foreground": "#98676A"
			}
		},
		{
			"scope": "constant.other.color",
			"settings": {
				"foreground": "#7E602C"
			}
		},
		{
			"scope": "string.regexp",
			"settings": {
				"foreground": "#7E602C"
			}
		},
		{
			"scope": "constant.character.escape",
			"settings": {
				"foreground": "#7E602C"
			}
		},
		{
			"scope": "punctuation.section.embedded, variable.interpolation",
			"settings": {
				"foreground": "#18401E"
			}
		},
		{
			"scope": "invalid.illegal",
			"settings": {
				"foreground": "#221A0F",
				// "background": "#DC3958"
			}
		},
		{
			"scope": "entity.name.function",
			"settings": {
				"foreground": "#A82B15"
			}
		},
		{
			"scope": "support.function",
			"settings": {
				"foreground": "#A82B15"
			}
		},
		{
			"scope": [
				"string.regexp.quoted.single.python",
				"constant.character.escape.regexp"
			],
			"settings": {
				"foreground": "#75940F",
				"fontStyle": "bold italic"
			}
		},
		{
			"scope": [
				"meta.function-call.generic.python"
			],
			"settings": {
				"foreground": "#A70024",
				"fontStyle": ""
			}
		},
		{
			"scope": [
				"meta.function.parameters.gdscript"
			],
			"settings": {
				"foreground": "#F06431"
			}
		},
		{
			"scope": [
				"punctuation.separator.annotation.gdscript",
				"punctuation.separator.parameters.gdscript"
			],
			"settings": {
				"foreground": "#D3AF86"
			}
		},
		{
			"scope": [
				"keyword.operator"
			],
			"settings": {
				"foreground": "#98676A",
				"fontStyle": "bold"
			}
		},
		{
			"scope": [
				"punctuation.section.embedded.begin.js",
				"punctuation.section.embedded.end.js"
			],
			"settings": {
				"foreground": "#4B74B3",
				"fontStyle": "bold"
			}
		},
		{
			"scope": [
				"variable.other.object.cs"
			],
			"settings": {
				"foreground": "#8059A5",
				"fontStyle": "italic"
			}
		},
		{
			"scope": [
				"variable.other.object.property.cs"
			],
			"settings": {
				"foreground": "#B66473"
			}
		},
		{
			"scope": [
				"invalid.illegal.placeholder.c"
			],
			"settings": {
				"foreground": "#FF0000",
				"fontStyle": "bold"
			}
		},
		{
			"scope": [
				"storage.modifier.cs",
				"keyword.type.cs",
				"storage.type.cs",
				"keyword.other.class.cs",
				"keyword.other.using.cs",
				"keyword.control.flow.return.cs"
			],
			"settings": {
				"fontStyle": "italic bold"
			}
		},
		{
			"scope": [
				"invalid.illegal"
			],
			"settings": {
				"foreground": "#C40202",
				"fontStyle": "bold"
			}
		},
		{
			"scope": "token.info-token",
			"settings": {
				"foreground": "#6796E6"
			}
		},
		{
			"scope": "token.warn-token",
			"settings": {
				"foreground": "#CD9731"
			}
		},
		{
			"scope": "token.error-token",
			"settings": {
				"foreground": "#F44747"
			}
		},
		{
			"scope": "token.debug-token",
			"settings": {
				"foreground": "#B267E6"
			}
		}
	]
}