%YAML 1.1
%TAG !u! tag:unity3d.com,2011:
--- !u!114 &11400000
MonoBehaviour:
  m_ObjectHideFlags: 0
  m_CorrespondingSourceObject: {fileID: 0}
  m_PrefabInstance: {fileID: 0}
  m_PrefabAsset: {fileID: 0}
  m_GameObject: {fileID: 0}
  m_Enabled: 1
  m_EditorHideFlags: 0
  m_Script: {fileID: 11500000, guid: 2a3502bc4d3ac304c99aa3a4e5500800, type: 3}
  m_Name: Enemy3
  m_EditorClassIdentifier: 
  indexInPool: 0
  health: 10
  attackDamage: 7
  speed: 1.4
  moveDelay: 1.5
  rewards:
    rewardCoins: 3
    maxGoldReward: 6
    maxEnergyReward: 1
  enemyType: 2
  enemyColor: {r: 0.30980393, g: 0.9254902, b: 0.5779643, a: 1}
