%YAML 1.1
%TAG !u! tag:unity3d.com,2011:
--- !u!114 &11400000
MonoBehaviour:
  m_ObjectHideFlags: 0
  m_CorrespondingSourceObject: {fileID: 0}
  m_PrefabInstance: {fileID: 0}
  m_PrefabAsset: {fileID: 0}
  m_GameObject: {fileID: 0}
  m_Enabled: 1
  m_EditorHideFlags: 0
  m_Script: {fileID: 11500000, guid: 66cf1db50d028f84aaff7647d00dd11c, type: 3}
  m_Name: LevelData1
  m_EditorClassIdentifier: 
  enemiesToSpawn:
  - enemyCount: 20
    enemyData: {fileID: 11400000, guid: 86577654a54f9694687d2a0a989e02ff, type: 2}
